ISO-10303-21;
HEADER;
/* Generated by software containing ST-Developer
 * from STEP Tools, Inc. (www.steptools.com) 
 */

FILE_DESCRIPTION(
/* description */ (''),
/* implementation_level */ '2;1');

FILE_NAME(
/* name */ 
'C:\\Users\\gabri\\OneDrive\\\X\C1rea de Trabalho\\Faculdade\\2023_1\\
Ecap\\.STEP\\Base.stp',
/* time_stamp */ '2023-04-08T17:33:46-03:00',
/* author */ ('gabri'),
/* organization */ (''),
/* preprocessor_version */ 'ST-DEVELOPER v19',
/* originating_system */ 'Autodesk Inventor 2023',
/* authorisation */ '');

FILE_SCHEMA (('AUTOMOTIVE_DESIGN { 1 0 10303 214 3 1 1 }'));
ENDSEC;

DATA;
#10=MECHANICAL_DESIGN_GEOMETRIC_PRESENTATION_REPRESENTATION('',(#13),#972);
#11=SHAPE_REPRESENTATION_RELATIONSHIP('SRR','None',#979,#12);
#12=ADVANCED_BREP_SHAPE_REPRESENTATION('',(#14),#971);
#13=STYLED_ITEM('',(#988),#14);
#14=MANIFOLD_SOLID_BREP('S\X\F3lido1',#567);
#15=FACE_BOUND('',#112,.T.);
#16=FACE_BOUND('',#113,.T.);
#17=FACE_BOUND('',#114,.T.);
#18=FACE_BOUND('',#115,.T.);
#19=FACE_BOUND('',#116,.T.);
#20=FACE_BOUND('',#117,.T.);
#21=FACE_BOUND('',#118,.T.);
#22=FACE_BOUND('',#119,.T.);
#23=FACE_BOUND('',#120,.T.);
#24=FACE_BOUND('',#121,.T.);
#25=FACE_BOUND('',#122,.T.);
#26=FACE_BOUND('',#123,.T.);
#27=FACE_BOUND('',#124,.T.);
#28=FACE_BOUND('',#125,.T.);
#29=FACE_BOUND('',#126,.T.);
#30=FACE_BOUND('',#127,.T.);
#31=FACE_BOUND('',#128,.T.);
#32=FACE_BOUND('',#129,.T.);
#33=FACE_BOUND('',#130,.T.);
#34=FACE_BOUND('',#131,.T.);
#35=FACE_BOUND('',#133,.T.);
#36=FACE_BOUND('',#134,.T.);
#37=FACE_BOUND('',#135,.T.);
#38=FACE_BOUND('',#136,.T.);
#39=FACE_BOUND('',#137,.T.);
#40=FACE_BOUND('',#138,.T.);
#41=FACE_BOUND('',#139,.T.);
#42=FACE_BOUND('',#140,.T.);
#43=FACE_BOUND('',#141,.T.);
#44=FACE_BOUND('',#142,.T.);
#45=FACE_BOUND('',#143,.T.);
#46=FACE_BOUND('',#144,.T.);
#47=FACE_BOUND('',#145,.T.);
#48=FACE_BOUND('',#146,.T.);
#49=FACE_BOUND('',#147,.T.);
#50=FACE_BOUND('',#148,.T.);
#51=FACE_BOUND('',#149,.T.);
#52=FACE_BOUND('',#150,.T.);
#53=FACE_BOUND('',#151,.T.);
#54=FACE_BOUND('',#152,.T.);
#55=PLANE('',#650);
#56=PLANE('',#651);
#57=PLANE('',#652);
#58=PLANE('',#653);
#59=PLANE('',#654);
#60=PLANE('',#655);
#61=FACE_OUTER_BOUND('',#87,.T.);
#62=FACE_OUTER_BOUND('',#88,.T.);
#63=FACE_OUTER_BOUND('',#89,.T.);
#64=FACE_OUTER_BOUND('',#90,.T.);
#65=FACE_OUTER_BOUND('',#91,.T.);
#66=FACE_OUTER_BOUND('',#92,.T.);
#67=FACE_OUTER_BOUND('',#93,.T.);
#68=FACE_OUTER_BOUND('',#94,.T.);
#69=FACE_OUTER_BOUND('',#95,.T.);
#70=FACE_OUTER_BOUND('',#96,.T.);
#71=FACE_OUTER_BOUND('',#97,.T.);
#72=FACE_OUTER_BOUND('',#98,.T.);
#73=FACE_OUTER_BOUND('',#99,.T.);
#74=FACE_OUTER_BOUND('',#100,.T.);
#75=FACE_OUTER_BOUND('',#101,.T.);
#76=FACE_OUTER_BOUND('',#102,.T.);
#77=FACE_OUTER_BOUND('',#103,.T.);
#78=FACE_OUTER_BOUND('',#104,.T.);
#79=FACE_OUTER_BOUND('',#105,.T.);
#80=FACE_OUTER_BOUND('',#106,.T.);
#81=FACE_OUTER_BOUND('',#107,.T.);
#82=FACE_OUTER_BOUND('',#108,.T.);
#83=FACE_OUTER_BOUND('',#109,.T.);
#84=FACE_OUTER_BOUND('',#110,.T.);
#85=FACE_OUTER_BOUND('',#111,.T.);
#86=FACE_OUTER_BOUND('',#132,.T.);
#87=EDGE_LOOP('',(#377,#378,#379,#380));
#88=EDGE_LOOP('',(#381,#382,#383,#384));
#89=EDGE_LOOP('',(#385,#386,#387,#388));
#90=EDGE_LOOP('',(#389,#390,#391,#392));
#91=EDGE_LOOP('',(#393,#394,#395,#396));
#92=EDGE_LOOP('',(#397,#398,#399,#400));
#93=EDGE_LOOP('',(#401,#402,#403,#404));
#94=EDGE_LOOP('',(#405,#406,#407,#408));
#95=EDGE_LOOP('',(#409,#410,#411,#412));
#96=EDGE_LOOP('',(#413,#414,#415,#416));
#97=EDGE_LOOP('',(#417,#418,#419,#420));
#98=EDGE_LOOP('',(#421,#422,#423,#424));
#99=EDGE_LOOP('',(#425,#426,#427,#428));
#100=EDGE_LOOP('',(#429,#430,#431,#432));
#101=EDGE_LOOP('',(#433,#434,#435,#436));
#102=EDGE_LOOP('',(#437,#438,#439,#440));
#103=EDGE_LOOP('',(#441,#442,#443,#444));
#104=EDGE_LOOP('',(#445,#446,#447,#448));
#105=EDGE_LOOP('',(#449,#450,#451,#452));
#106=EDGE_LOOP('',(#453,#454,#455,#456));
#107=EDGE_LOOP('',(#457,#458,#459,#460));
#108=EDGE_LOOP('',(#461,#462,#463,#464));
#109=EDGE_LOOP('',(#465,#466,#467,#468));
#110=EDGE_LOOP('',(#469,#470,#471,#472));
#111=EDGE_LOOP('',(#473,#474,#475,#476));
#112=EDGE_LOOP('',(#477));
#113=EDGE_LOOP('',(#478));
#114=EDGE_LOOP('',(#479));
#115=EDGE_LOOP('',(#480));
#116=EDGE_LOOP('',(#481));
#117=EDGE_LOOP('',(#482));
#118=EDGE_LOOP('',(#483));
#119=EDGE_LOOP('',(#484));
#120=EDGE_LOOP('',(#485));
#121=EDGE_LOOP('',(#486));
#122=EDGE_LOOP('',(#487));
#123=EDGE_LOOP('',(#488));
#124=EDGE_LOOP('',(#489));
#125=EDGE_LOOP('',(#490));
#126=EDGE_LOOP('',(#491));
#127=EDGE_LOOP('',(#492));
#128=EDGE_LOOP('',(#493));
#129=EDGE_LOOP('',(#494));
#130=EDGE_LOOP('',(#495));
#131=EDGE_LOOP('',(#496));
#132=EDGE_LOOP('',(#497,#498,#499,#500));
#133=EDGE_LOOP('',(#501));
#134=EDGE_LOOP('',(#502));
#135=EDGE_LOOP('',(#503));
#136=EDGE_LOOP('',(#504));
#137=EDGE_LOOP('',(#505));
#138=EDGE_LOOP('',(#506));
#139=EDGE_LOOP('',(#507));
#140=EDGE_LOOP('',(#508));
#141=EDGE_LOOP('',(#509));
#142=EDGE_LOOP('',(#510));
#143=EDGE_LOOP('',(#511));
#144=EDGE_LOOP('',(#512));
#145=EDGE_LOOP('',(#513));
#146=EDGE_LOOP('',(#514));
#147=EDGE_LOOP('',(#515));
#148=EDGE_LOOP('',(#516));
#149=EDGE_LOOP('',(#517));
#150=EDGE_LOOP('',(#518));
#151=EDGE_LOOP('',(#519));
#152=EDGE_LOOP('',(#520));
#153=LINE('',#827,#185);
#154=LINE('',#833,#186);
#155=LINE('',#839,#187);
#156=LINE('',#845,#188);
#157=LINE('',#851,#189);
#158=LINE('',#857,#190);
#159=LINE('',#863,#191);
#160=LINE('',#869,#192);
#161=LINE('',#875,#193);
#162=LINE('',#881,#194);
#163=LINE('',#887,#195);
#164=LINE('',#893,#196);
#165=LINE('',#899,#197);
#166=LINE('',#905,#198);
#167=LINE('',#911,#199);
#168=LINE('',#917,#200);
#169=LINE('',#923,#201);
#170=LINE('',#929,#202);
#171=LINE('',#935,#203);
#172=LINE('',#941,#204);
#173=LINE('',#946,#205);
#174=LINE('',#948,#206);
#175=LINE('',#950,#207);
#176=LINE('',#951,#208);
#177=LINE('',#954,#209);
#178=LINE('',#956,#210);
#179=LINE('',#957,#211);
#180=LINE('',#960,#212);
#181=LINE('',#962,#213);
#182=LINE('',#963,#214);
#183=LINE('',#965,#215);
#184=LINE('',#966,#216);
#185=VECTOR('',#662,2.5);
#186=VECTOR('',#669,2.5);
#187=VECTOR('',#676,2.5);
#188=VECTOR('',#683,2.5);
#189=VECTOR('',#690,2.1);
#190=VECTOR('',#697,2.1);
#191=VECTOR('',#704,2.1);
#192=VECTOR('',#711,2.1);
#193=VECTOR('',#718,2.1);
#194=VECTOR('',#725,2.1);
#195=VECTOR('',#732,2.1);
#196=VECTOR('',#739,2.1);
#197=VECTOR('',#746,2.1);
#198=VECTOR('',#753,2.1);
#199=VECTOR('',#760,2.1);
#200=VECTOR('',#767,2.1);
#201=VECTOR('',#774,2.1);
#202=VECTOR('',#781,2.1);
#203=VECTOR('',#788,2.1);
#204=VECTOR('',#795,2.1);
#205=VECTOR('',#800,10.);
#206=VECTOR('',#801,10.);
#207=VECTOR('',#802,10.);
#208=VECTOR('',#803,10.);
#209=VECTOR('',#806,10.);
#210=VECTOR('',#807,10.);
#211=VECTOR('',#808,10.);
#212=VECTOR('',#811,10.);
#213=VECTOR('',#812,10.);
#214=VECTOR('',#813,10.);
#215=VECTOR('',#816,10.);
#216=VECTOR('',#817,10.);
#217=CIRCLE('',#591,2.5);
#218=CIRCLE('',#592,2.5);
#219=CIRCLE('',#594,2.5);
#220=CIRCLE('',#595,2.5);
#221=CIRCLE('',#597,2.5);
#222=CIRCLE('',#598,2.5);
#223=CIRCLE('',#600,2.5);
#224=CIRCLE('',#601,2.5);
#225=CIRCLE('',#603,2.1);
#226=CIRCLE('',#604,2.1);
#227=CIRCLE('',#606,2.1);
#228=CIRCLE('',#607,2.1);
#229=CIRCLE('',#609,2.1);
#230=CIRCLE('',#610,2.1);
#231=CIRCLE('',#612,2.1);
#232=CIRCLE('',#613,2.1);
#233=CIRCLE('',#615,2.1);
#234=CIRCLE('',#616,2.1);
#235=CIRCLE('',#618,2.1);
#236=CIRCLE('',#619,2.1);
#237=CIRCLE('',#621,2.1);
#238=CIRCLE('',#622,2.1);
#239=CIRCLE('',#624,2.1);
#240=CIRCLE('',#625,2.1);
#241=CIRCLE('',#627,2.1);
#242=CIRCLE('',#628,2.1);
#243=CIRCLE('',#630,2.1);
#244=CIRCLE('',#631,2.1);
#245=CIRCLE('',#633,2.1);
#246=CIRCLE('',#634,2.1);
#247=CIRCLE('',#636,2.1);
#248=CIRCLE('',#637,2.1);
#249=CIRCLE('',#639,2.1);
#250=CIRCLE('',#640,2.1);
#251=CIRCLE('',#642,2.1);
#252=CIRCLE('',#643,2.1);
#253=CIRCLE('',#645,2.1);
#254=CIRCLE('',#646,2.1);
#255=CIRCLE('',#648,2.1);
#256=CIRCLE('',#649,2.1);
#257=VERTEX_POINT('',#824);
#258=VERTEX_POINT('',#826);
#259=VERTEX_POINT('',#830);
#260=VERTEX_POINT('',#832);
#261=VERTEX_POINT('',#836);
#262=VERTEX_POINT('',#838);
#263=VERTEX_POINT('',#842);
#264=VERTEX_POINT('',#844);
#265=VERTEX_POINT('',#848);
#266=VERTEX_POINT('',#850);
#267=VERTEX_POINT('',#854);
#268=VERTEX_POINT('',#856);
#269=VERTEX_POINT('',#860);
#270=VERTEX_POINT('',#862);
#271=VERTEX_POINT('',#866);
#272=VERTEX_POINT('',#868);
#273=VERTEX_POINT('',#872);
#274=VERTEX_POINT('',#874);
#275=VERTEX_POINT('',#878);
#276=VERTEX_POINT('',#880);
#277=VERTEX_POINT('',#884);
#278=VERTEX_POINT('',#886);
#279=VERTEX_POINT('',#890);
#280=VERTEX_POINT('',#892);
#281=VERTEX_POINT('',#896);
#282=VERTEX_POINT('',#898);
#283=VERTEX_POINT('',#902);
#284=VERTEX_POINT('',#904);
#285=VERTEX_POINT('',#908);
#286=VERTEX_POINT('',#910);
#287=VERTEX_POINT('',#914);
#288=VERTEX_POINT('',#916);
#289=VERTEX_POINT('',#920);
#290=VERTEX_POINT('',#922);
#291=VERTEX_POINT('',#926);
#292=VERTEX_POINT('',#928);
#293=VERTEX_POINT('',#932);
#294=VERTEX_POINT('',#934);
#295=VERTEX_POINT('',#938);
#296=VERTEX_POINT('',#940);
#297=VERTEX_POINT('',#944);
#298=VERTEX_POINT('',#945);
#299=VERTEX_POINT('',#947);
#300=VERTEX_POINT('',#949);
#301=VERTEX_POINT('',#953);
#302=VERTEX_POINT('',#955);
#303=VERTEX_POINT('',#959);
#304=VERTEX_POINT('',#961);
#305=EDGE_CURVE('',#257,#257,#217,.T.);
#306=EDGE_CURVE('',#257,#258,#153,.T.);
#307=EDGE_CURVE('',#258,#258,#218,.T.);
#308=EDGE_CURVE('',#259,#259,#219,.T.);
#309=EDGE_CURVE('',#259,#260,#154,.T.);
#310=EDGE_CURVE('',#260,#260,#220,.T.);
#311=EDGE_CURVE('',#261,#261,#221,.T.);
#312=EDGE_CURVE('',#261,#262,#155,.T.);
#313=EDGE_CURVE('',#262,#262,#222,.T.);
#314=EDGE_CURVE('',#263,#263,#223,.T.);
#315=EDGE_CURVE('',#263,#264,#156,.T.);
#316=EDGE_CURVE('',#264,#264,#224,.T.);
#317=EDGE_CURVE('',#265,#265,#225,.T.);
#318=EDGE_CURVE('',#265,#266,#157,.T.);
#319=EDGE_CURVE('',#266,#266,#226,.T.);
#320=EDGE_CURVE('',#267,#267,#227,.T.);
#321=EDGE_CURVE('',#267,#268,#158,.T.);
#322=EDGE_CURVE('',#268,#268,#228,.T.);
#323=EDGE_CURVE('',#269,#269,#229,.T.);
#324=EDGE_CURVE('',#269,#270,#159,.T.);
#325=EDGE_CURVE('',#270,#270,#230,.T.);
#326=EDGE_CURVE('',#271,#271,#231,.T.);
#327=EDGE_CURVE('',#271,#272,#160,.T.);
#328=EDGE_CURVE('',#272,#272,#232,.T.);
#329=EDGE_CURVE('',#273,#273,#233,.T.);
#330=EDGE_CURVE('',#273,#274,#161,.T.);
#331=EDGE_CURVE('',#274,#274,#234,.T.);
#332=EDGE_CURVE('',#275,#275,#235,.T.);
#333=EDGE_CURVE('',#275,#276,#162,.T.);
#334=EDGE_CURVE('',#276,#276,#236,.T.);
#335=EDGE_CURVE('',#277,#277,#237,.T.);
#336=EDGE_CURVE('',#277,#278,#163,.T.);
#337=EDGE_CURVE('',#278,#278,#238,.T.);
#338=EDGE_CURVE('',#279,#279,#239,.T.);
#339=EDGE_CURVE('',#279,#280,#164,.T.);
#340=EDGE_CURVE('',#280,#280,#240,.T.);
#341=EDGE_CURVE('',#281,#281,#241,.T.);
#342=EDGE_CURVE('',#281,#282,#165,.T.);
#343=EDGE_CURVE('',#282,#282,#242,.T.);
#344=EDGE_CURVE('',#283,#283,#243,.T.);
#345=EDGE_CURVE('',#283,#284,#166,.T.);
#346=EDGE_CURVE('',#284,#284,#244,.T.);
#347=EDGE_CURVE('',#285,#285,#245,.T.);
#348=EDGE_CURVE('',#285,#286,#167,.T.);
#349=EDGE_CURVE('',#286,#286,#246,.T.);
#350=EDGE_CURVE('',#287,#287,#247,.T.);
#351=EDGE_CURVE('',#287,#288,#168,.T.);
#352=EDGE_CURVE('',#288,#288,#248,.T.);
#353=EDGE_CURVE('',#289,#289,#249,.T.);
#354=EDGE_CURVE('',#289,#290,#169,.T.);
#355=EDGE_CURVE('',#290,#290,#250,.T.);
#356=EDGE_CURVE('',#291,#291,#251,.T.);
#357=EDGE_CURVE('',#291,#292,#170,.T.);
#358=EDGE_CURVE('',#292,#292,#252,.T.);
#359=EDGE_CURVE('',#293,#293,#253,.T.);
#360=EDGE_CURVE('',#293,#294,#171,.T.);
#361=EDGE_CURVE('',#294,#294,#254,.T.);
#362=EDGE_CURVE('',#295,#295,#255,.T.);
#363=EDGE_CURVE('',#295,#296,#172,.T.);
#364=EDGE_CURVE('',#296,#296,#256,.T.);
#365=EDGE_CURVE('',#297,#298,#173,.T.);
#366=EDGE_CURVE('',#298,#299,#174,.T.);
#367=EDGE_CURVE('',#300,#299,#175,.T.);
#368=EDGE_CURVE('',#297,#300,#176,.T.);
#369=EDGE_CURVE('',#301,#297,#177,.T.);
#370=EDGE_CURVE('',#302,#300,#178,.T.);
#371=EDGE_CURVE('',#301,#302,#179,.T.);
#372=EDGE_CURVE('',#303,#301,#180,.T.);
#373=EDGE_CURVE('',#304,#302,#181,.T.);
#374=EDGE_CURVE('',#303,#304,#182,.T.);
#375=EDGE_CURVE('',#298,#303,#183,.T.);
#376=EDGE_CURVE('',#299,#304,#184,.T.);
#377=ORIENTED_EDGE('',*,*,#305,.F.);
#378=ORIENTED_EDGE('',*,*,#306,.T.);
#379=ORIENTED_EDGE('',*,*,#307,.F.);
#380=ORIENTED_EDGE('',*,*,#306,.F.);
#381=ORIENTED_EDGE('',*,*,#308,.F.);
#382=ORIENTED_EDGE('',*,*,#309,.T.);
#383=ORIENTED_EDGE('',*,*,#310,.F.);
#384=ORIENTED_EDGE('',*,*,#309,.F.);
#385=ORIENTED_EDGE('',*,*,#311,.F.);
#386=ORIENTED_EDGE('',*,*,#312,.T.);
#387=ORIENTED_EDGE('',*,*,#313,.F.);
#388=ORIENTED_EDGE('',*,*,#312,.F.);
#389=ORIENTED_EDGE('',*,*,#314,.F.);
#390=ORIENTED_EDGE('',*,*,#315,.T.);
#391=ORIENTED_EDGE('',*,*,#316,.F.);
#392=ORIENTED_EDGE('',*,*,#315,.F.);
#393=ORIENTED_EDGE('',*,*,#317,.F.);
#394=ORIENTED_EDGE('',*,*,#318,.T.);
#395=ORIENTED_EDGE('',*,*,#319,.T.);
#396=ORIENTED_EDGE('',*,*,#318,.F.);
#397=ORIENTED_EDGE('',*,*,#320,.F.);
#398=ORIENTED_EDGE('',*,*,#321,.T.);
#399=ORIENTED_EDGE('',*,*,#322,.T.);
#400=ORIENTED_EDGE('',*,*,#321,.F.);
#401=ORIENTED_EDGE('',*,*,#323,.F.);
#402=ORIENTED_EDGE('',*,*,#324,.T.);
#403=ORIENTED_EDGE('',*,*,#325,.T.);
#404=ORIENTED_EDGE('',*,*,#324,.F.);
#405=ORIENTED_EDGE('',*,*,#326,.F.);
#406=ORIENTED_EDGE('',*,*,#327,.T.);
#407=ORIENTED_EDGE('',*,*,#328,.T.);
#408=ORIENTED_EDGE('',*,*,#327,.F.);
#409=ORIENTED_EDGE('',*,*,#329,.F.);
#410=ORIENTED_EDGE('',*,*,#330,.T.);
#411=ORIENTED_EDGE('',*,*,#331,.T.);
#412=ORIENTED_EDGE('',*,*,#330,.F.);
#413=ORIENTED_EDGE('',*,*,#332,.F.);
#414=ORIENTED_EDGE('',*,*,#333,.T.);
#415=ORIENTED_EDGE('',*,*,#334,.T.);
#416=ORIENTED_EDGE('',*,*,#333,.F.);
#417=ORIENTED_EDGE('',*,*,#335,.F.);
#418=ORIENTED_EDGE('',*,*,#336,.T.);
#419=ORIENTED_EDGE('',*,*,#337,.T.);
#420=ORIENTED_EDGE('',*,*,#336,.F.);
#421=ORIENTED_EDGE('',*,*,#338,.F.);
#422=ORIENTED_EDGE('',*,*,#339,.T.);
#423=ORIENTED_EDGE('',*,*,#340,.T.);
#424=ORIENTED_EDGE('',*,*,#339,.F.);
#425=ORIENTED_EDGE('',*,*,#341,.F.);
#426=ORIENTED_EDGE('',*,*,#342,.T.);
#427=ORIENTED_EDGE('',*,*,#343,.T.);
#428=ORIENTED_EDGE('',*,*,#342,.F.);
#429=ORIENTED_EDGE('',*,*,#344,.F.);
#430=ORIENTED_EDGE('',*,*,#345,.T.);
#431=ORIENTED_EDGE('',*,*,#346,.T.);
#432=ORIENTED_EDGE('',*,*,#345,.F.);
#433=ORIENTED_EDGE('',*,*,#347,.F.);
#434=ORIENTED_EDGE('',*,*,#348,.T.);
#435=ORIENTED_EDGE('',*,*,#349,.T.);
#436=ORIENTED_EDGE('',*,*,#348,.F.);
#437=ORIENTED_EDGE('',*,*,#350,.F.);
#438=ORIENTED_EDGE('',*,*,#351,.T.);
#439=ORIENTED_EDGE('',*,*,#352,.T.);
#440=ORIENTED_EDGE('',*,*,#351,.F.);
#441=ORIENTED_EDGE('',*,*,#353,.F.);
#442=ORIENTED_EDGE('',*,*,#354,.T.);
#443=ORIENTED_EDGE('',*,*,#355,.T.);
#444=ORIENTED_EDGE('',*,*,#354,.F.);
#445=ORIENTED_EDGE('',*,*,#356,.F.);
#446=ORIENTED_EDGE('',*,*,#357,.T.);
#447=ORIENTED_EDGE('',*,*,#358,.T.);
#448=ORIENTED_EDGE('',*,*,#357,.F.);
#449=ORIENTED_EDGE('',*,*,#359,.F.);
#450=ORIENTED_EDGE('',*,*,#360,.T.);
#451=ORIENTED_EDGE('',*,*,#361,.T.);
#452=ORIENTED_EDGE('',*,*,#360,.F.);
#453=ORIENTED_EDGE('',*,*,#362,.F.);
#454=ORIENTED_EDGE('',*,*,#363,.T.);
#455=ORIENTED_EDGE('',*,*,#364,.T.);
#456=ORIENTED_EDGE('',*,*,#363,.F.);
#457=ORIENTED_EDGE('',*,*,#365,.T.);
#458=ORIENTED_EDGE('',*,*,#366,.T.);
#459=ORIENTED_EDGE('',*,*,#367,.F.);
#460=ORIENTED_EDGE('',*,*,#368,.F.);
#461=ORIENTED_EDGE('',*,*,#369,.T.);
#462=ORIENTED_EDGE('',*,*,#368,.T.);
#463=ORIENTED_EDGE('',*,*,#370,.F.);
#464=ORIENTED_EDGE('',*,*,#371,.F.);
#465=ORIENTED_EDGE('',*,*,#372,.T.);
#466=ORIENTED_EDGE('',*,*,#371,.T.);
#467=ORIENTED_EDGE('',*,*,#373,.F.);
#468=ORIENTED_EDGE('',*,*,#374,.F.);
#469=ORIENTED_EDGE('',*,*,#375,.T.);
#470=ORIENTED_EDGE('',*,*,#374,.T.);
#471=ORIENTED_EDGE('',*,*,#376,.F.);
#472=ORIENTED_EDGE('',*,*,#366,.F.);
#473=ORIENTED_EDGE('',*,*,#376,.T.);
#474=ORIENTED_EDGE('',*,*,#373,.T.);
#475=ORIENTED_EDGE('',*,*,#370,.T.);
#476=ORIENTED_EDGE('',*,*,#367,.T.);
#477=ORIENTED_EDGE('',*,*,#305,.T.);
#478=ORIENTED_EDGE('',*,*,#308,.T.);
#479=ORIENTED_EDGE('',*,*,#311,.T.);
#480=ORIENTED_EDGE('',*,*,#314,.T.);
#481=ORIENTED_EDGE('',*,*,#362,.T.);
#482=ORIENTED_EDGE('',*,*,#359,.T.);
#483=ORIENTED_EDGE('',*,*,#356,.T.);
#484=ORIENTED_EDGE('',*,*,#353,.T.);
#485=ORIENTED_EDGE('',*,*,#350,.T.);
#486=ORIENTED_EDGE('',*,*,#347,.T.);
#487=ORIENTED_EDGE('',*,*,#344,.T.);
#488=ORIENTED_EDGE('',*,*,#341,.T.);
#489=ORIENTED_EDGE('',*,*,#338,.T.);
#490=ORIENTED_EDGE('',*,*,#335,.T.);
#491=ORIENTED_EDGE('',*,*,#332,.T.);
#492=ORIENTED_EDGE('',*,*,#329,.T.);
#493=ORIENTED_EDGE('',*,*,#326,.T.);
#494=ORIENTED_EDGE('',*,*,#323,.T.);
#495=ORIENTED_EDGE('',*,*,#320,.T.);
#496=ORIENTED_EDGE('',*,*,#317,.T.);
#497=ORIENTED_EDGE('',*,*,#375,.F.);
#498=ORIENTED_EDGE('',*,*,#365,.F.);
#499=ORIENTED_EDGE('',*,*,#369,.F.);
#500=ORIENTED_EDGE('',*,*,#372,.F.);
#501=ORIENTED_EDGE('',*,*,#307,.T.);
#502=ORIENTED_EDGE('',*,*,#310,.T.);
#503=ORIENTED_EDGE('',*,*,#313,.T.);
#504=ORIENTED_EDGE('',*,*,#316,.T.);
#505=ORIENTED_EDGE('',*,*,#364,.F.);
#506=ORIENTED_EDGE('',*,*,#361,.F.);
#507=ORIENTED_EDGE('',*,*,#358,.F.);
#508=ORIENTED_EDGE('',*,*,#355,.F.);
#509=ORIENTED_EDGE('',*,*,#352,.F.);
#510=ORIENTED_EDGE('',*,*,#349,.F.);
#511=ORIENTED_EDGE('',*,*,#346,.F.);
#512=ORIENTED_EDGE('',*,*,#343,.F.);
#513=ORIENTED_EDGE('',*,*,#340,.F.);
#514=ORIENTED_EDGE('',*,*,#337,.F.);
#515=ORIENTED_EDGE('',*,*,#334,.F.);
#516=ORIENTED_EDGE('',*,*,#331,.F.);
#517=ORIENTED_EDGE('',*,*,#328,.F.);
#518=ORIENTED_EDGE('',*,*,#325,.F.);
#519=ORIENTED_EDGE('',*,*,#322,.F.);
#520=ORIENTED_EDGE('',*,*,#319,.F.);
#521=CYLINDRICAL_SURFACE('',#590,2.5);
#522=CYLINDRICAL_SURFACE('',#593,2.5);
#523=CYLINDRICAL_SURFACE('',#596,2.5);
#524=CYLINDRICAL_SURFACE('',#599,2.5);
#525=CYLINDRICAL_SURFACE('',#602,2.1);
#526=CYLINDRICAL_SURFACE('',#605,2.1);
#527=CYLINDRICAL_SURFACE('',#608,2.1);
#528=CYLINDRICAL_SURFACE('',#611,2.1);
#529=CYLINDRICAL_SURFACE('',#614,2.1);
#530=CYLINDRICAL_SURFACE('',#617,2.1);
#531=CYLINDRICAL_SURFACE('',#620,2.1);
#532=CYLINDRICAL_SURFACE('',#623,2.1);
#533=CYLINDRICAL_SURFACE('',#626,2.1);
#534=CYLINDRICAL_SURFACE('',#629,2.1);
#535=CYLINDRICAL_SURFACE('',#632,2.1);
#536=CYLINDRICAL_SURFACE('',#635,2.1);
#537=CYLINDRICAL_SURFACE('',#638,2.1);
#538=CYLINDRICAL_SURFACE('',#641,2.1);
#539=CYLINDRICAL_SURFACE('',#644,2.1);
#540=CYLINDRICAL_SURFACE('',#647,2.1);
#541=ADVANCED_FACE('',(#61),#521,.F.);
#542=ADVANCED_FACE('',(#62),#522,.F.);
#543=ADVANCED_FACE('',(#63),#523,.F.);
#544=ADVANCED_FACE('',(#64),#524,.F.);
#545=ADVANCED_FACE('',(#65),#525,.F.);
#546=ADVANCED_FACE('',(#66),#526,.F.);
#547=ADVANCED_FACE('',(#67),#527,.F.);
#548=ADVANCED_FACE('',(#68),#528,.F.);
#549=ADVANCED_FACE('',(#69),#529,.F.);
#550=ADVANCED_FACE('',(#70),#530,.F.);
#551=ADVANCED_FACE('',(#71),#531,.F.);
#552=ADVANCED_FACE('',(#72),#532,.F.);
#553=ADVANCED_FACE('',(#73),#533,.F.);
#554=ADVANCED_FACE('',(#74),#534,.F.);
#555=ADVANCED_FACE('',(#75),#535,.F.);
#556=ADVANCED_FACE('',(#76),#536,.F.);
#557=ADVANCED_FACE('',(#77),#537,.F.);
#558=ADVANCED_FACE('',(#78),#538,.F.);
#559=ADVANCED_FACE('',(#79),#539,.F.);
#560=ADVANCED_FACE('',(#80),#540,.F.);
#561=ADVANCED_FACE('',(#81),#55,.T.);
#562=ADVANCED_FACE('',(#82),#56,.T.);
#563=ADVANCED_FACE('',(#83),#57,.T.);
#564=ADVANCED_FACE('',(#84),#58,.T.);
#565=ADVANCED_FACE('',(#85,#15,#16,#17,#18,#19,#20,#21,#22,#23,#24,#25,
#26,#27,#28,#29,#30,#31,#32,#33,#34),#59,.T.);
#566=ADVANCED_FACE('',(#86,#35,#36,#37,#38,#39,#40,#41,#42,#43,#44,#45,
#46,#47,#48,#49,#50,#51,#52,#53,#54),#60,.F.);
#567=CLOSED_SHELL('',(#541,#542,#543,#544,#545,#546,#547,#548,#549,#550,
#551,#552,#553,#554,#555,#556,#557,#558,#559,#560,#561,#562,#563,#564,#565,
#566));
#568=DERIVED_UNIT_ELEMENT(#571,1.);
#569=DERIVED_UNIT_ELEMENT(#974,-3.);
#570=DIMENSIONAL_EXPONENTS(1.,0.,0.,0.,0.,0.,0.);
#571=(
CONVERSION_BASED_UNIT('gram',#573)
MASS_UNIT()
NAMED_UNIT(#570)
);
#572=(
MASS_UNIT()
NAMED_UNIT(*)
SI_UNIT(.KILO.,.GRAM.)
);
#573=MASS_MEASURE_WITH_UNIT(MASS_MEASURE(0.001),#572);
#574=DERIVED_UNIT((#568,#569));
#575=MEASURE_REPRESENTATION_ITEM('density measure',
POSITIVE_RATIO_MEASURE(1.),#574);
#576=PROPERTY_DEFINITION_REPRESENTATION(#581,#578);
#577=PROPERTY_DEFINITION_REPRESENTATION(#582,#579);
#578=REPRESENTATION('material name',(#580),#971);
#579=REPRESENTATION('density',(#575),#971);
#580=DESCRIPTIVE_REPRESENTATION_ITEM('Gen\X\E9rico','Gen\X\E9rico');
#581=PROPERTY_DEFINITION('material property','material name',#981);
#582=PROPERTY_DEFINITION('material property','density of part',#981);
#583=DATE_TIME_ROLE('creation_date');
#584=APPLIED_DATE_AND_TIME_ASSIGNMENT(#585,#583,(#981));
#585=DATE_AND_TIME(#586,#587);
#586=CALENDAR_DATE(2023,27,3);
#587=LOCAL_TIME(0,0,0.,#588);
#588=COORDINATED_UNIVERSAL_TIME_OFFSET(0,0,.BEHIND.);
#589=AXIS2_PLACEMENT_3D('placement',#822,#656,#657);
#590=AXIS2_PLACEMENT_3D('',#823,#658,#659);
#591=AXIS2_PLACEMENT_3D('',#825,#660,#661);
#592=AXIS2_PLACEMENT_3D('',#828,#663,#664);
#593=AXIS2_PLACEMENT_3D('',#829,#665,#666);
#594=AXIS2_PLACEMENT_3D('',#831,#667,#668);
#595=AXIS2_PLACEMENT_3D('',#834,#670,#671);
#596=AXIS2_PLACEMENT_3D('',#835,#672,#673);
#597=AXIS2_PLACEMENT_3D('',#837,#674,#675);
#598=AXIS2_PLACEMENT_3D('',#840,#677,#678);
#599=AXIS2_PLACEMENT_3D('',#841,#679,#680);
#600=AXIS2_PLACEMENT_3D('',#843,#681,#682);
#601=AXIS2_PLACEMENT_3D('',#846,#684,#685);
#602=AXIS2_PLACEMENT_3D('',#847,#686,#687);
#603=AXIS2_PLACEMENT_3D('',#849,#688,#689);
#604=AXIS2_PLACEMENT_3D('',#852,#691,#692);
#605=AXIS2_PLACEMENT_3D('',#853,#693,#694);
#606=AXIS2_PLACEMENT_3D('',#855,#695,#696);
#607=AXIS2_PLACEMENT_3D('',#858,#698,#699);
#608=AXIS2_PLACEMENT_3D('',#859,#700,#701);
#609=AXIS2_PLACEMENT_3D('',#861,#702,#703);
#610=AXIS2_PLACEMENT_3D('',#864,#705,#706);
#611=AXIS2_PLACEMENT_3D('',#865,#707,#708);
#612=AXIS2_PLACEMENT_3D('',#867,#709,#710);
#613=AXIS2_PLACEMENT_3D('',#870,#712,#713);
#614=AXIS2_PLACEMENT_3D('',#871,#714,#715);
#615=AXIS2_PLACEMENT_3D('',#873,#716,#717);
#616=AXIS2_PLACEMENT_3D('',#876,#719,#720);
#617=AXIS2_PLACEMENT_3D('',#877,#721,#722);
#618=AXIS2_PLACEMENT_3D('',#879,#723,#724);
#619=AXIS2_PLACEMENT_3D('',#882,#726,#727);
#620=AXIS2_PLACEMENT_3D('',#883,#728,#729);
#621=AXIS2_PLACEMENT_3D('',#885,#730,#731);
#622=AXIS2_PLACEMENT_3D('',#888,#733,#734);
#623=AXIS2_PLACEMENT_3D('',#889,#735,#736);
#624=AXIS2_PLACEMENT_3D('',#891,#737,#738);
#625=AXIS2_PLACEMENT_3D('',#894,#740,#741);
#626=AXIS2_PLACEMENT_3D('',#895,#742,#743);
#627=AXIS2_PLACEMENT_3D('',#897,#744,#745);
#628=AXIS2_PLACEMENT_3D('',#900,#747,#748);
#629=AXIS2_PLACEMENT_3D('',#901,#749,#750);
#630=AXIS2_PLACEMENT_3D('',#903,#751,#752);
#631=AXIS2_PLACEMENT_3D('',#906,#754,#755);
#632=AXIS2_PLACEMENT_3D('',#907,#756,#757);
#633=AXIS2_PLACEMENT_3D('',#909,#758,#759);
#634=AXIS2_PLACEMENT_3D('',#912,#761,#762);
#635=AXIS2_PLACEMENT_3D('',#913,#763,#764);
#636=AXIS2_PLACEMENT_3D('',#915,#765,#766);
#637=AXIS2_PLACEMENT_3D('',#918,#768,#769);
#638=AXIS2_PLACEMENT_3D('',#919,#770,#771);
#639=AXIS2_PLACEMENT_3D('',#921,#772,#773);
#640=AXIS2_PLACEMENT_3D('',#924,#775,#776);
#641=AXIS2_PLACEMENT_3D('',#925,#777,#778);
#642=AXIS2_PLACEMENT_3D('',#927,#779,#780);
#643=AXIS2_PLACEMENT_3D('',#930,#782,#783);
#644=AXIS2_PLACEMENT_3D('',#931,#784,#785);
#645=AXIS2_PLACEMENT_3D('',#933,#786,#787);
#646=AXIS2_PLACEMENT_3D('',#936,#789,#790);
#647=AXIS2_PLACEMENT_3D('',#937,#791,#792);
#648=AXIS2_PLACEMENT_3D('',#939,#793,#794);
#649=AXIS2_PLACEMENT_3D('',#942,#796,#797);
#650=AXIS2_PLACEMENT_3D('',#943,#798,#799);
#651=AXIS2_PLACEMENT_3D('',#952,#804,#805);
#652=AXIS2_PLACEMENT_3D('',#958,#809,#810);
#653=AXIS2_PLACEMENT_3D('',#964,#814,#815);
#654=AXIS2_PLACEMENT_3D('',#967,#818,#819);
#655=AXIS2_PLACEMENT_3D('',#968,#820,#821);
#656=DIRECTION('axis',(0.,0.,1.));
#657=DIRECTION('refdir',(1.,0.,0.));
#658=DIRECTION('center_axis',(0.,-1.,0.));
#659=DIRECTION('ref_axis',(1.,0.,0.));
#660=DIRECTION('center_axis',(0.,-1.,0.));
#661=DIRECTION('ref_axis',(1.,0.,0.));
#662=DIRECTION('',(0.,-1.,0.));
#663=DIRECTION('center_axis',(0.,1.,0.));
#664=DIRECTION('ref_axis',(1.,0.,0.));
#665=DIRECTION('center_axis',(0.,-1.,0.));
#666=DIRECTION('ref_axis',(1.,0.,0.));
#667=DIRECTION('center_axis',(0.,-1.,0.));
#668=DIRECTION('ref_axis',(1.,0.,0.));
#669=DIRECTION('',(0.,-1.,0.));
#670=DIRECTION('center_axis',(0.,1.,0.));
#671=DIRECTION('ref_axis',(1.,0.,0.));
#672=DIRECTION('center_axis',(0.,-1.,0.));
#673=DIRECTION('ref_axis',(1.,0.,0.));
#674=DIRECTION('center_axis',(0.,-1.,0.));
#675=DIRECTION('ref_axis',(1.,0.,0.));
#676=DIRECTION('',(0.,-1.,0.));
#677=DIRECTION('center_axis',(0.,1.,0.));
#678=DIRECTION('ref_axis',(1.,0.,0.));
#679=DIRECTION('center_axis',(0.,-1.,0.));
#680=DIRECTION('ref_axis',(1.,0.,0.));
#681=DIRECTION('center_axis',(0.,-1.,0.));
#682=DIRECTION('ref_axis',(1.,0.,0.));
#683=DIRECTION('',(0.,-1.,0.));
#684=DIRECTION('center_axis',(0.,1.,0.));
#685=DIRECTION('ref_axis',(1.,0.,0.));
#686=DIRECTION('center_axis',(0.,1.,0.));
#687=DIRECTION('ref_axis',(1.,0.,0.));
#688=DIRECTION('center_axis',(0.,-1.,0.));
#689=DIRECTION('ref_axis',(1.,0.,0.));
#690=DIRECTION('',(0.,-1.,0.));
#691=DIRECTION('center_axis',(0.,-1.,0.));
#692=DIRECTION('ref_axis',(1.,0.,0.));
#693=DIRECTION('center_axis',(0.,1.,0.));
#694=DIRECTION('ref_axis',(1.,0.,0.));
#695=DIRECTION('center_axis',(0.,-1.,0.));
#696=DIRECTION('ref_axis',(1.,0.,0.));
#697=DIRECTION('',(0.,-1.,0.));
#698=DIRECTION('center_axis',(0.,-1.,0.));
#699=DIRECTION('ref_axis',(1.,0.,0.));
#700=DIRECTION('center_axis',(0.,1.,0.));
#701=DIRECTION('ref_axis',(1.,0.,0.));
#702=DIRECTION('center_axis',(0.,-1.,0.));
#703=DIRECTION('ref_axis',(1.,0.,0.));
#704=DIRECTION('',(0.,-1.,0.));
#705=DIRECTION('center_axis',(0.,-1.,0.));
#706=DIRECTION('ref_axis',(1.,0.,0.));
#707=DIRECTION('center_axis',(0.,1.,0.));
#708=DIRECTION('ref_axis',(1.,0.,0.));
#709=DIRECTION('center_axis',(0.,-1.,0.));
#710=DIRECTION('ref_axis',(1.,0.,0.));
#711=DIRECTION('',(0.,-1.,0.));
#712=DIRECTION('center_axis',(0.,-1.,0.));
#713=DIRECTION('ref_axis',(1.,0.,0.));
#714=DIRECTION('center_axis',(0.,1.,0.));
#715=DIRECTION('ref_axis',(1.,0.,0.));
#716=DIRECTION('center_axis',(0.,-1.,0.));
#717=DIRECTION('ref_axis',(1.,0.,0.));
#718=DIRECTION('',(0.,-1.,0.));
#719=DIRECTION('center_axis',(0.,-1.,0.));
#720=DIRECTION('ref_axis',(1.,0.,0.));
#721=DIRECTION('center_axis',(0.,1.,0.));
#722=DIRECTION('ref_axis',(1.,0.,0.));
#723=DIRECTION('center_axis',(0.,-1.,0.));
#724=DIRECTION('ref_axis',(1.,0.,0.));
#725=DIRECTION('',(0.,-1.,0.));
#726=DIRECTION('center_axis',(0.,-1.,0.));
#727=DIRECTION('ref_axis',(1.,0.,0.));
#728=DIRECTION('center_axis',(0.,1.,0.));
#729=DIRECTION('ref_axis',(1.,0.,0.));
#730=DIRECTION('center_axis',(0.,-1.,0.));
#731=DIRECTION('ref_axis',(1.,0.,0.));
#732=DIRECTION('',(0.,-1.,0.));
#733=DIRECTION('center_axis',(0.,-1.,0.));
#734=DIRECTION('ref_axis',(1.,0.,0.));
#735=DIRECTION('center_axis',(0.,1.,0.));
#736=DIRECTION('ref_axis',(1.,0.,0.));
#737=DIRECTION('center_axis',(0.,-1.,0.));
#738=DIRECTION('ref_axis',(1.,0.,0.));
#739=DIRECTION('',(0.,-1.,0.));
#740=DIRECTION('center_axis',(0.,-1.,0.));
#741=DIRECTION('ref_axis',(1.,0.,0.));
#742=DIRECTION('center_axis',(0.,1.,0.));
#743=DIRECTION('ref_axis',(1.,0.,0.));
#744=DIRECTION('center_axis',(0.,-1.,0.));
#745=DIRECTION('ref_axis',(1.,0.,0.));
#746=DIRECTION('',(0.,-1.,0.));
#747=DIRECTION('center_axis',(0.,-1.,0.));
#748=DIRECTION('ref_axis',(1.,0.,0.));
#749=DIRECTION('center_axis',(0.,1.,0.));
#750=DIRECTION('ref_axis',(1.,0.,0.));
#751=DIRECTION('center_axis',(0.,-1.,0.));
#752=DIRECTION('ref_axis',(1.,0.,0.));
#753=DIRECTION('',(0.,-1.,0.));
#754=DIRECTION('center_axis',(0.,-1.,0.));
#755=DIRECTION('ref_axis',(1.,0.,0.));
#756=DIRECTION('center_axis',(0.,1.,0.));
#757=DIRECTION('ref_axis',(1.,0.,0.));
#758=DIRECTION('center_axis',(0.,-1.,0.));
#759=DIRECTION('ref_axis',(1.,0.,0.));
#760=DIRECTION('',(0.,-1.,0.));
#761=DIRECTION('center_axis',(0.,-1.,0.));
#762=DIRECTION('ref_axis',(1.,0.,0.));
#763=DIRECTION('center_axis',(0.,1.,0.));
#764=DIRECTION('ref_axis',(1.,0.,0.));
#765=DIRECTION('center_axis',(0.,-1.,0.));
#766=DIRECTION('ref_axis',(1.,0.,0.));
#767=DIRECTION('',(0.,-1.,0.));
#768=DIRECTION('center_axis',(0.,-1.,0.));
#769=DIRECTION('ref_axis',(1.,0.,0.));
#770=DIRECTION('center_axis',(0.,1.,0.));
#771=DIRECTION('ref_axis',(1.,0.,0.));
#772=DIRECTION('center_axis',(0.,-1.,0.));
#773=DIRECTION('ref_axis',(1.,0.,0.));
#774=DIRECTION('',(0.,-1.,0.));
#775=DIRECTION('center_axis',(0.,-1.,0.));
#776=DIRECTION('ref_axis',(1.,0.,0.));
#777=DIRECTION('center_axis',(0.,1.,0.));
#778=DIRECTION('ref_axis',(1.,0.,0.));
#779=DIRECTION('center_axis',(0.,-1.,0.));
#780=DIRECTION('ref_axis',(1.,0.,0.));
#781=DIRECTION('',(0.,-1.,0.));
#782=DIRECTION('center_axis',(0.,-1.,0.));
#783=DIRECTION('ref_axis',(1.,0.,0.));
#784=DIRECTION('center_axis',(0.,1.,0.));
#785=DIRECTION('ref_axis',(1.,0.,0.));
#786=DIRECTION('center_axis',(0.,-1.,0.));
#787=DIRECTION('ref_axis',(1.,0.,0.));
#788=DIRECTION('',(0.,-1.,0.));
#789=DIRECTION('center_axis',(0.,-1.,0.));
#790=DIRECTION('ref_axis',(1.,0.,0.));
#791=DIRECTION('center_axis',(0.,1.,0.));
#792=DIRECTION('ref_axis',(1.,0.,0.));
#793=DIRECTION('center_axis',(0.,-1.,0.));
#794=DIRECTION('ref_axis',(1.,0.,0.));
#795=DIRECTION('',(0.,-1.,0.));
#796=DIRECTION('center_axis',(0.,-1.,0.));
#797=DIRECTION('ref_axis',(1.,0.,0.));
#798=DIRECTION('center_axis',(1.,0.,0.));
#799=DIRECTION('ref_axis',(0.,0.,-1.));
#800=DIRECTION('',(0.,0.,-1.));
#801=DIRECTION('',(0.,1.,0.));
#802=DIRECTION('',(0.,0.,-1.));
#803=DIRECTION('',(0.,1.,0.));
#804=DIRECTION('center_axis',(0.,0.,1.));
#805=DIRECTION('ref_axis',(1.,0.,0.));
#806=DIRECTION('',(1.,0.,0.));
#807=DIRECTION('',(1.,0.,0.));
#808=DIRECTION('',(0.,1.,0.));
#809=DIRECTION('center_axis',(-1.,0.,0.));
#810=DIRECTION('ref_axis',(0.,0.,1.));
#811=DIRECTION('',(0.,0.,1.));
#812=DIRECTION('',(0.,0.,1.));
#813=DIRECTION('',(0.,1.,0.));
#814=DIRECTION('center_axis',(0.,0.,-1.));
#815=DIRECTION('ref_axis',(-1.,0.,0.));
#816=DIRECTION('',(-1.,0.,0.));
#817=DIRECTION('',(-1.,0.,0.));
#818=DIRECTION('center_axis',(0.,1.,0.));
#819=DIRECTION('ref_axis',(0.,0.,1.));
#820=DIRECTION('center_axis',(0.,1.,0.));
#821=DIRECTION('ref_axis',(0.,0.,1.));
#822=CARTESIAN_POINT('',(0.,0.,0.));
#823=CARTESIAN_POINT('Origin',(-15.5,3.,-60.));
#824=CARTESIAN_POINT('',(-18.,3.,-60.));
#825=CARTESIAN_POINT('Origin',(-15.5,3.,-60.));
#826=CARTESIAN_POINT('',(-18.,0.,-60.));
#827=CARTESIAN_POINT('',(-18.,3.,-60.));
#828=CARTESIAN_POINT('Origin',(-15.5,0.,-60.));
#829=CARTESIAN_POINT('Origin',(-15.5,3.,-110.));
#830=CARTESIAN_POINT('',(-18.,3.,-110.));
#831=CARTESIAN_POINT('Origin',(-15.5,3.,-110.));
#832=CARTESIAN_POINT('',(-18.,0.,-110.));
#833=CARTESIAN_POINT('',(-18.,3.,-110.));
#834=CARTESIAN_POINT('Origin',(-15.5,0.,-110.));
#835=CARTESIAN_POINT('Origin',(-55.5,3.,-60.));
#836=CARTESIAN_POINT('',(-58.,3.,-60.));
#837=CARTESIAN_POINT('Origin',(-55.5,3.,-60.));
#838=CARTESIAN_POINT('',(-58.,0.,-60.));
#839=CARTESIAN_POINT('',(-58.,3.,-60.));
#840=CARTESIAN_POINT('Origin',(-55.5,0.,-60.));
#841=CARTESIAN_POINT('Origin',(-55.5,3.,-110.));
#842=CARTESIAN_POINT('',(-58.,3.,-110.));
#843=CARTESIAN_POINT('Origin',(-55.5,3.,-110.));
#844=CARTESIAN_POINT('',(-58.,0.,-110.));
#845=CARTESIAN_POINT('',(-58.,3.,-110.));
#846=CARTESIAN_POINT('Origin',(-55.5,0.,-110.));
#847=CARTESIAN_POINT('Origin',(-5.00000000000003,0.,-139.));
#848=CARTESIAN_POINT('',(-7.10000000000003,3.,-139.));
#849=CARTESIAN_POINT('Origin',(-5.00000000000003,3.,-139.));
#850=CARTESIAN_POINT('',(-7.10000000000003,0.,-139.));
#851=CARTESIAN_POINT('',(-7.10000000000003,0.,-139.));
#852=CARTESIAN_POINT('Origin',(-5.00000000000003,0.,-139.));
#853=CARTESIAN_POINT('Origin',(-22.,0.,-139.));
#854=CARTESIAN_POINT('',(-24.1,3.,-139.));
#855=CARTESIAN_POINT('Origin',(-22.,3.,-139.));
#856=CARTESIAN_POINT('',(-24.1,0.,-139.));
#857=CARTESIAN_POINT('',(-24.1,0.,-139.));
#858=CARTESIAN_POINT('Origin',(-22.,0.,-139.));
#859=CARTESIAN_POINT('Origin',(-49.,0.,-139.));
#860=CARTESIAN_POINT('',(-51.1,3.,-139.));
#861=CARTESIAN_POINT('Origin',(-49.,3.,-139.));
#862=CARTESIAN_POINT('',(-51.1,0.,-139.));
#863=CARTESIAN_POINT('',(-51.1,0.,-139.));
#864=CARTESIAN_POINT('Origin',(-49.,0.,-139.));
#865=CARTESIAN_POINT('Origin',(-66.,0.,-139.));
#866=CARTESIAN_POINT('',(-68.1,3.,-139.));
#867=CARTESIAN_POINT('Origin',(-66.,3.,-139.));
#868=CARTESIAN_POINT('',(-68.1,0.,-139.));
#869=CARTESIAN_POINT('',(-68.1,0.,-139.));
#870=CARTESIAN_POINT('Origin',(-66.,0.,-139.));
#871=CARTESIAN_POINT('Origin',(-66.,0.,-5.));
#872=CARTESIAN_POINT('',(-68.1,3.,-5.));
#873=CARTESIAN_POINT('Origin',(-66.,3.,-5.));
#874=CARTESIAN_POINT('',(-68.1,0.,-5.));
#875=CARTESIAN_POINT('',(-68.1,0.,-5.));
#876=CARTESIAN_POINT('Origin',(-66.,0.,-5.));
#877=CARTESIAN_POINT('Origin',(-66.,0.,-31.));
#878=CARTESIAN_POINT('',(-68.1,3.,-31.));
#879=CARTESIAN_POINT('Origin',(-66.,3.,-31.));
#880=CARTESIAN_POINT('',(-68.1,0.,-31.));
#881=CARTESIAN_POINT('',(-68.1,0.,-31.));
#882=CARTESIAN_POINT('Origin',(-66.,0.,-31.));
#883=CARTESIAN_POINT('Origin',(-49.,0.,-5.));
#884=CARTESIAN_POINT('',(-51.1,3.,-5.));
#885=CARTESIAN_POINT('Origin',(-49.,3.,-5.));
#886=CARTESIAN_POINT('',(-51.1,0.,-5.));
#887=CARTESIAN_POINT('',(-51.1,0.,-5.));
#888=CARTESIAN_POINT('Origin',(-49.,0.,-5.));
#889=CARTESIAN_POINT('Origin',(-49.,0.,-31.));
#890=CARTESIAN_POINT('',(-51.1,3.,-31.));
#891=CARTESIAN_POINT('Origin',(-49.,3.,-31.));
#892=CARTESIAN_POINT('',(-51.1,0.,-31.));
#893=CARTESIAN_POINT('',(-51.1,0.,-31.));
#894=CARTESIAN_POINT('Origin',(-49.,0.,-31.));
#895=CARTESIAN_POINT('Origin',(-22.,0.,-5.));
#896=CARTESIAN_POINT('',(-24.1,3.,-5.));
#897=CARTESIAN_POINT('Origin',(-22.,3.,-5.));
#898=CARTESIAN_POINT('',(-24.1,0.,-5.));
#899=CARTESIAN_POINT('',(-24.1,0.,-5.));
#900=CARTESIAN_POINT('Origin',(-22.,0.,-5.));
#901=CARTESIAN_POINT('Origin',(-22.,0.,-31.));
#902=CARTESIAN_POINT('',(-24.1,3.,-31.));
#903=CARTESIAN_POINT('Origin',(-22.,3.,-31.));
#904=CARTESIAN_POINT('',(-24.1,0.,-31.));
#905=CARTESIAN_POINT('',(-24.1,0.,-31.));
#906=CARTESIAN_POINT('Origin',(-22.,0.,-31.));
#907=CARTESIAN_POINT('Origin',(-5.,0.,-5.));
#908=CARTESIAN_POINT('',(-7.1,3.,-5.));
#909=CARTESIAN_POINT('Origin',(-5.,3.,-5.));
#910=CARTESIAN_POINT('',(-7.1,0.,-5.));
#911=CARTESIAN_POINT('',(-7.1,0.,-5.));
#912=CARTESIAN_POINT('Origin',(-5.,0.,-5.));
#913=CARTESIAN_POINT('Origin',(-5.,0.,-31.));
#914=CARTESIAN_POINT('',(-7.1,3.,-31.));
#915=CARTESIAN_POINT('Origin',(-5.,3.,-31.));
#916=CARTESIAN_POINT('',(-7.1,0.,-31.));
#917=CARTESIAN_POINT('',(-7.1,0.,-31.));
#918=CARTESIAN_POINT('Origin',(-5.,0.,-31.));
#919=CARTESIAN_POINT('Origin',(-66.,0.,-165.));
#920=CARTESIAN_POINT('',(-68.1,3.,-165.));
#921=CARTESIAN_POINT('Origin',(-66.,3.,-165.));
#922=CARTESIAN_POINT('',(-68.1,0.,-165.));
#923=CARTESIAN_POINT('',(-68.1,0.,-165.));
#924=CARTESIAN_POINT('Origin',(-66.,0.,-165.));
#925=CARTESIAN_POINT('Origin',(-49.,0.,-165.));
#926=CARTESIAN_POINT('',(-51.1,3.,-165.));
#927=CARTESIAN_POINT('Origin',(-49.,3.,-165.));
#928=CARTESIAN_POINT('',(-51.1,0.,-165.));
#929=CARTESIAN_POINT('',(-51.1,0.,-165.));
#930=CARTESIAN_POINT('Origin',(-49.,0.,-165.));
#931=CARTESIAN_POINT('Origin',(-22.,0.,-165.));
#932=CARTESIAN_POINT('',(-24.1,3.,-165.));
#933=CARTESIAN_POINT('Origin',(-22.,3.,-165.));
#934=CARTESIAN_POINT('',(-24.1,0.,-165.));
#935=CARTESIAN_POINT('',(-24.1,0.,-165.));
#936=CARTESIAN_POINT('Origin',(-22.,0.,-165.));
#937=CARTESIAN_POINT('Origin',(-5.00000000000003,0.,-165.));
#938=CARTESIAN_POINT('',(-7.10000000000003,3.,-165.));
#939=CARTESIAN_POINT('Origin',(-5.00000000000003,3.,-165.));
#940=CARTESIAN_POINT('',(-7.10000000000003,0.,-165.));
#941=CARTESIAN_POINT('',(-7.10000000000003,0.,-165.));
#942=CARTESIAN_POINT('Origin',(-5.00000000000003,0.,-165.));
#943=CARTESIAN_POINT('Origin',(0.,0.,0.));
#944=CARTESIAN_POINT('',(0.,0.,0.));
#945=CARTESIAN_POINT('',(0.,0.,-170.));
#946=CARTESIAN_POINT('',(0.,0.,0.));
#947=CARTESIAN_POINT('',(0.,3.,-170.));
#948=CARTESIAN_POINT('',(0.,0.,-170.));
#949=CARTESIAN_POINT('',(0.,3.,0.));
#950=CARTESIAN_POINT('',(0.,3.,0.));
#951=CARTESIAN_POINT('',(0.,0.,0.));
#952=CARTESIAN_POINT('Origin',(-71.,0.,0.));
#953=CARTESIAN_POINT('',(-71.,0.,0.));
#954=CARTESIAN_POINT('',(-71.,0.,0.));
#955=CARTESIAN_POINT('',(-71.,3.,0.));
#956=CARTESIAN_POINT('',(-71.,3.,0.));
#957=CARTESIAN_POINT('',(-71.,0.,0.));
#958=CARTESIAN_POINT('Origin',(-71.,0.,-170.));
#959=CARTESIAN_POINT('',(-71.,0.,-170.));
#960=CARTESIAN_POINT('',(-71.,0.,-170.));
#961=CARTESIAN_POINT('',(-71.,3.,-170.));
#962=CARTESIAN_POINT('',(-71.,3.,-170.));
#963=CARTESIAN_POINT('',(-71.,0.,-170.));
#964=CARTESIAN_POINT('Origin',(0.,0.,-170.));
#965=CARTESIAN_POINT('',(0.,0.,-170.));
#966=CARTESIAN_POINT('',(0.,3.,-170.));
#967=CARTESIAN_POINT('Origin',(-35.5,3.,-85.));
#968=CARTESIAN_POINT('Origin',(-35.5,0.,-85.));
#969=UNCERTAINTY_MEASURE_WITH_UNIT(LENGTH_MEASURE(0.01),#973,
'DISTANCE_ACCURACY_VALUE',
'Maximum model space distance between geometric entities at asserted c
onnectivities');
#970=UNCERTAINTY_MEASURE_WITH_UNIT(LENGTH_MEASURE(0.01),#973,
'DISTANCE_ACCURACY_VALUE',
'Maximum model space distance between geometric entities at asserted c
onnectivities');
#971=(
GEOMETRIC_REPRESENTATION_CONTEXT(3)
GLOBAL_UNCERTAINTY_ASSIGNED_CONTEXT((#969))
GLOBAL_UNIT_ASSIGNED_CONTEXT((#973,#975,#976))
REPRESENTATION_CONTEXT('','3D')
);
#972=(
GEOMETRIC_REPRESENTATION_CONTEXT(3)
GLOBAL_UNCERTAINTY_ASSIGNED_CONTEXT((#970))
GLOBAL_UNIT_ASSIGNED_CONTEXT((#973,#975,#976))
REPRESENTATION_CONTEXT('','3D')
);
#973=(
LENGTH_UNIT()
NAMED_UNIT(*)
SI_UNIT(.MILLI.,.METRE.)
);
#974=(
LENGTH_UNIT()
NAMED_UNIT(*)
SI_UNIT(.CENTI.,.METRE.)
);
#975=(
NAMED_UNIT(*)
PLANE_ANGLE_UNIT()
SI_UNIT($,.RADIAN.)
);
#976=(
NAMED_UNIT(*)
SI_UNIT($,.STERADIAN.)
SOLID_ANGLE_UNIT()
);
#977=SHAPE_DEFINITION_REPRESENTATION(#978,#979);
#978=PRODUCT_DEFINITION_SHAPE('',$,#981);
#979=SHAPE_REPRESENTATION('',(#589),#971);
#980=PRODUCT_DEFINITION_CONTEXT('part definition',#985,'design');
#981=PRODUCT_DEFINITION('Base','Base',#982,#980);
#982=PRODUCT_DEFINITION_FORMATION('',$,#987);
#983=PRODUCT_RELATED_PRODUCT_CATEGORY('Base','Base',(#987));
#984=APPLICATION_PROTOCOL_DEFINITION('international standard',
'automotive_design',2009,#985);
#985=APPLICATION_CONTEXT(
'Core Data for Automotive Mechanical Design Process');
#986=PRODUCT_CONTEXT('part definition',#985,'mechanical');
#987=PRODUCT('Base','Base',$,(#986));
#988=PRESENTATION_STYLE_ASSIGNMENT((#989));
#989=SURFACE_STYLE_USAGE(.BOTH.,#992);
#990=SURFACE_STYLE_RENDERING_WITH_PROPERTIES($,#996,(#991));
#991=SURFACE_STYLE_TRANSPARENT(0.);
#992=SURFACE_SIDE_STYLE('',(#993,#990));
#993=SURFACE_STYLE_FILL_AREA(#994);
#994=FILL_AREA_STYLE('',(#995));
#995=FILL_AREA_STYLE_COLOUR('',#996);
#996=COLOUR_RGB('',0.749019607843137,0.749019607843137,0.749019607843137);
ENDSEC;
END-ISO-10303-21;
