{
	"info": {
		"_postman_id": "932e646c-ee62-4eb6-aeed-46d14f53b0a8",
		"name": "Flask Project",
		"schema": "https://schema.getpostman.com/json/collection/v2.1.0/collection.json",
		"_exporter_id": "32361780"
	},
	"item": [
		{
			"name": "Add employee",
			"request": {
				"method": "POST",
				"header": [],
				"body": {
					"mode": "raw",
					"raw": "{\n    \"lastName\": \"{{$randomLastName}}\",\n    \"firstName\": \"{{$randomFirstName}}\",\n    \"extension\": \"x1245\",\n    \"email\": \"{{$randomEmail}}\",\n    \"officeCode\": \"1\",\n    \"reportsTo\": 1102,\n    \"jobTitle\": \"{{$randomJobTitle}}\"\n}",
					"options": {
						"raw": {
							"language": "json"
						}
					}
				},
				"url": {
					"raw": "http://127.0.0.1:5000/employees",
					"protocol": "http",
					"host": [
						"127",
						"0",
						"0",
						"1"
					],
					"port": "5000",
					"path": [
						"employees"
					]
				}
			},
			"response": []
		},
		{
			"name": "Update employee",
			"request": {
				"method": "PUT",
				"header": [],
				"body": {
					"mode": "raw",
					"raw": "{\n    \"lastName\": \"{{$randomLastName}}\",\n    \"firstName\": \"{{$randomFirstName}}\",\n    \"extension\": \"x1249\",\n    \"email\": \"{{$randomEmail}}\",\n    \"officeCode\": \"1\",\n    \"reportsTo\": \"NULL\",\n    \"jobTitle\": \"{{$randomJobTitle}}\"\n}",
					"options": {
						"raw": {
							"language": "json"
						}
					}
				},
				"url": {
					"raw": "http://127.0.0.1:5000/employees?employee_id=1622",
					"protocol": "http",
					"host": [
						"127",
						"0",
						"0",
						"1"
					],
					"port": "5000",
					"path": [
						"employees"
					],
					"query": [
						{
							"key": "employee_id",
							"value": "1622"
						}
					]
				}
			},
			"response": []
		},
		{
			"name": "Get all employees",
			"request": {
				"method": "GET",
				"header": [],
				"url": {
					"raw": "http://127.0.0.1:5000/employees",
					"protocol": "http",
					"host": [
						"127",
						"0",
						"0",
						"1"
					],
					"port": "5000",
					"path": [
						"employees"
					]
				}
			},
			"response": []
		},
		{
			"name": "Get all products",
			"request": {
				"method": "GET",
				"header": [],
				"url": {
					"raw": "http://127.0.0.1:5000/products",
					"protocol": "http",
					"host": [
						"127",
						"0",
						"0",
						"1"
					],
					"port": "5000",
					"path": [
						"products"
					]
				}
			},
			"response": []
		},
		{
			"name": "Get customers for an employee",
			"request": {
				"method": "GET",
				"header": [],
				"url": {
					"raw": "http://127.0.0.1:5000/employees/customers?employee_id=1166",
					"protocol": "http",
					"host": [
						"127",
						"0",
						"0",
						"1"
					],
					"port": "5000",
					"path": [
						"employees",
						"customers"
					],
					"query": [
						{
							"key": "employee_id",
							"value": "1166"
						}
					]
				}
			},
			"response": []
		},
		{
			"name": "Delete employee",
			"request": {
				"method": "DELETE",
				"header": [],
				"url": {
					"raw": "http://127.0.0.1:5000/employees?employee_id=1056",
					"protocol": "http",
					"host": [
						"127",
						"0",
						"0",
						"1"
					],
					"port": "5000",
					"path": [
						"employees"
					],
					"query": [
						{
							"key": "employee_id",
							"value": "1056"
						}
					]
				}
			},
			"response": []
		},
		{
			"name": "Delete product",
			"request": {
				"method": "DELETE",
				"header": [],
				"url": {
					"raw": "http://127.0.0.1:5000/products?product_id=S18_1749",
					"protocol": "http",
					"host": [
						"127",
						"0",
						"0",
						"1"
					],
					"port": "5000",
					"path": [
						"products"
					],
					"query": [
						{
							"key": "product_id",
							"value": "S18_1749"
						}
					]
				}
			},
			"response": []
		},
		{
			"name": "Payments for customer after date",
			"request": {
				"method": "POST",
				"header": [],
				"body": {
					"mode": "raw",
					"raw": "{\n    \"customerNumber\": 103,\n    \"date\": \"2003-12-31\"\n}",
					"options": {
						"raw": {
							"language": "json"
						}
					}
				},
				"url": {
					"raw": "http://127.0.0.1:5000/customer/payment",
					"protocol": "http",
					"host": [
						"127",
						"0",
						"0",
						"1"
					],
					"port": "5000",
					"path": [
						"customer",
						"payment"
					]
				}
			},
			"response": []
		},
		{
			"name": "Add payment for customer",
			"request": {
				"method": "POST",
				"header": [],
				"body": {
					"mode": "raw",
					"raw": "{\n    \"orderNumber\": 10429\n}",
					"options": {
						"raw": {
							"language": "json"
						}
					}
				},
				"url": {
					"raw": "http://127.0.0.1:5000/customer/payment",
					"protocol": "http",
					"host": [
						"127",
						"0",
						"0",
						"1"
					],
					"port": "5000",
					"path": [
						"customer",
						"payment"
					]
				}
			},
			"response": []
		},
		{
			"name": "Add product",
			"request": {
				"method": "POST",
				"header": [],
				"body": {
					"mode": "raw",
					"raw": "{\n    \"productCode\": \"S{{$randomInt}}\",\n    \"productName\": \"{{$randomProductName}}\",\n    \"productLine\": \"Ships\",\n    \"productScale\": \"1:10\",\n    \"productVendor\": \"Classic Metal Creations\",\n    \"productDescription\": \"{{$randomProductAdjective}}\",\n    \"quantityInStock\": {{$randomInt}},\n    \"buyPrice\": 44.44,\n    \"MSRP\": 44.44\n}",
					"options": {
						"raw": {
							"language": "json"
						}
					}
				},
				"url": {
					"raw": "http://127.0.0.1:5000/products",
					"protocol": "http",
					"host": [
						"127",
						"0",
						"0",
						"1"
					],
					"port": "5000",
					"path": [
						"products"
					]
				}
			},
			"response": []
		},
		{
			"name": "Update product",
			"request": {
				"method": "PUT",
				"header": [],
				"body": {
					"mode": "raw",
					"raw": "{\n    \"productName\": \"{{$randomProductName}}\",\n    \"productLine\": \"Ships\",\n    \"productScale\": \"1:1000\",\n    \"productVendor\": \"Classic Metal Creations\",\n    \"productDescription\": \"{{$randomProductAdjective}}\",\n    \"quantityInStock\": {{$randomInt}},\n    \"buyPrice\": 442.44,\n    \"MSRP\": 44.44\n}",
					"options": {
						"raw": {
							"language": "json"
						}
					}
				},
				"url": {
					"raw": "http://127.0.0.1:5000/products?product_id=S12345",
					"protocol": "http",
					"host": [
						"127",
						"0",
						"0",
						"1"
					],
					"port": "5000",
					"path": [
						"products"
					],
					"query": [
						{
							"key": "product_id",
							"value": "S12345"
						}
					]
				}
			},
			"response": []
		},
		{
			"name": "Get single product",
			"request": {
				"method": "POST",
				"header": [],
				"body": {
					"mode": "raw",
					"raw": "{\n    \"productCode\": \"S12345\"\n}",
					"options": {
						"raw": {
							"language": "json"
						}
					}
				},
				"url": {
					"raw": "http://127.0.0.1:5000/products",
					"protocol": "http",
					"host": [
						"127",
						"0",
						"0",
						"1"
					],
					"port": "5000",
					"path": [
						"products"
					]
				}
			},
			"response": []
		},
		{
			"name": "Create order for a customer",
			"request": {
				"method": "POST",
				"header": [],
				"body": {
					"mode": "raw",
					"raw": "{\n    \"customerNumber\": 103,\n    \"productCode\": \"S12345\",\n    \"quantityOrdered\": 100,\n    \"priceEach\": 11.11,\n    \"orderLineNumber\": 999,\n    \"orderDate\": \"2020-01-01\",\n    \"requiredDate\": \"2020-03-01\",\n    \"shippedDate\": \"2020-02-01\",\n    \"status\": \"Shipped\",\n    \"comments\": \"Comment-OK\"\n}\n",
					"options": {
						"raw": {
							"language": "json"
						}
					}
				},
				"url": {
					"raw": "http://127.0.0.1:5000/customer/order",
					"protocol": "http",
					"host": [
						"127",
						"0",
						"0",
						"1"
					],
					"port": "5000",
					"path": [
						"customer",
						"order"
					]
				}
			},
			"response": []
		}
	]
}