<?xml version="1.0" encoding="UTF-8" standalone="no"?>
<!-- Created with Inkscape (http://www.inkscape.org/) -->

<svg
   xmlns:dc="http://purl.org/dc/elements/1.1/"
   xmlns:cc="http://creativecommons.org/ns#"
   xmlns:rdf="http://www.w3.org/1999/02/22-rdf-syntax-ns#"
   xmlns:svg="http://www.w3.org/2000/svg"
   xmlns="http://www.w3.org/2000/svg"
   xmlns:sodipodi="http://sodipodi.sourceforge.net/DTD/sodipodi-0.dtd"
   xmlns:inkscape="http://www.inkscape.org/namespaces/inkscape"
   width="210mm"
   height="297mm"
   viewBox="0 0 744.09448819 1052.3622047"
   id="svg2"
   version="1.1"
   inkscape:version="0.91 r13725"
   sodipodi:docname="widthArrow.svg">
  <defs
     id="defs4">
    <filter
       inkscape:collect="always"
       style="color-interpolation-filters:sRGB"
       id="filter4188"
       x="-0.025055031"
       width="1.0501101"
       y="-0.02303023"
       height="1.0460605">
      <feGaussianBlur
         inkscape:collect="always"
         stdDeviation="0.49467105"
         id="feGaussianBlur4190" />
    </filter>
  </defs>
  <sodipodi:namedview
     id="base"
     pagecolor="#ffffff"
     bordercolor="#666666"
     borderopacity="1.0"
     inkscape:pageopacity="0.0"
     inkscape:pageshadow="2"
     inkscape:zoom="3.959798"
     inkscape:cx="232.30343"
     inkscape:cy="932.56673"
     inkscape:document-units="px"
     inkscape:current-layer="layer1"
     showgrid="false"
     showguides="true"
     inkscape:guide-bbox="true"
     inkscape:window-width="1366"
     inkscape:window-height="706"
     inkscape:window-x="-8"
     inkscape:window-y="-8"
     inkscape:window-maximized="1">
    <sodipodi:guide
       position="147.5,853.57145"
       orientation="1,0"
       id="guide4136" />
    <sodipodi:guide
       position="226.42857,931.42859"
       orientation="0,1"
       id="guide4138" />
    <sodipodi:guide
       position="225.71429,960.00002"
       orientation="0,1"
       id="guide4140" />
    <sodipodi:guide
       position="230,988.57145"
       orientation="0,1"
       id="guide4142" />
    <sodipodi:guide
       position="195.71429,840.7143"
       orientation="1,0"
       id="guide4144" />
    <sodipodi:guide
       position="171.42857,878.57145"
       orientation="1,0"
       id="guide4148" />
  </sodipodi:namedview>
  <metadata
     id="metadata7">
    <rdf:RDF>
      <cc:Work
         rdf:about="">
        <dc:format>image/svg+xml</dc:format>
        <dc:type
           rdf:resource="http://purl.org/dc/dcmitype/StillImage" />
        <dc:title></dc:title>
      </cc:Work>
    </rdf:RDF>
  </metadata>
  <g
     inkscape:label="Layer 1"
     inkscape:groupmode="layer"
     id="layer1">
    <g
       id="g4202"
       inkscape:export-xdpi="87.798988"
       inkscape:export-ydpi="87.798988">
      <rect
         ry="0"
         y="105.90258"
         x="199.27029"
         height="55"
         width="55"
         id="rect4192"
         style="opacity:1;fill:none;fill-opacity:1;stroke:#ffffff;stroke-width:1;stroke-linecap:round;stroke-miterlimit:4;stroke-dasharray:none;stroke-dashoffset:0;stroke-opacity:1" />
      <g
         transform="translate(53.464962,-11.447503)"
         id="g4194">
        <g
           id="g4180"
           style="filter:url(#filter4188)">
          <path
             style="fill:#4d4d4d;fill-rule:evenodd;stroke:none;stroke-width:1px;stroke-linecap:butt;stroke-linejoin:miter;stroke-opacity:1"
             d="m 162.35714,172.04167 0,-19.73259 -11.42857,0 22.92506,-19.73259 22.92506,19.73259 -11.42857,0 0,19.73259 c -7.66433,0 -15.32865,0 -22.99298,0 z"
             id="path4174"
             inkscape:connector-curvature="0"
             sodipodi:nodetypes="cccccccc" />
          <rect
             style="opacity:1;fill:#4d4d4d;fill-opacity:1;stroke:none;stroke-width:1.1158874;stroke-linecap:round;stroke-miterlimit:4;stroke-dasharray:none;stroke-dashoffset:0;stroke-opacity:1"
             id="rect4176"
             width="47.384117"
             height="11.312681"
             x="150.27223"
             y="120.49158"
             ry="5.6563406" />
        </g>
        <g
           id="g4168">
          <path
             sodipodi:nodetypes="cccccccc"
             inkscape:connector-curvature="0"
             id="path4146"
             d="m 160.35714,170.04167 0,-19.73259 -11.42857,0 22.92506,-19.73259 22.92506,19.73259 -11.42857,0 0,19.73259 c -7.66433,0 -15.32865,0 -22.99298,0 z"
             style="fill:#000080;fill-rule:evenodd;stroke:none;stroke-width:1px;stroke-linecap:butt;stroke-linejoin:miter;stroke-opacity:1" />
          <rect
             ry="5.6563406"
             y="118.49158"
             x="148.27223"
             height="11.312681"
             width="47.384117"
             id="rect4160"
             style="opacity:1;fill:#000080;fill-opacity:1;stroke:none;stroke-width:1.1158874;stroke-linecap:round;stroke-miterlimit:4;stroke-dasharray:none;stroke-dashoffset:0;stroke-opacity:1" />
        </g>
      </g>
    </g>
  </g>
</svg>
