{
  "project_info": {
    "project_number": "138216707976",
    "firebase_url": "https://datapoints-159d1.firebaseio.com",
    "project_id": "datapoints-159d1",
    "storage_bucket": "datapoints-159d1.appspot.com"
  },
  "client": [
    {
      "client_info": {
        "mobilesdk_app_id": "1:138216707976:android:c84b39cf7284ed43060c3d",
        "android_client_info": {
          "package_name": "com.fiinlab.data"
        }
      },
      "oauth_client": [
        {
          "client_id": "138216707976-i0bub6pgqsanssr0la7gaapf9bm7in90.apps.googleusercontent.com",
          "client_type": 3
        }
      ],
      "api_key": [
        {
          "current_key": "AIzaSyBmD9MxhVTo82gAYLOZbBwNHfLk6NdY9hU"
        }
      ],
      "services": {
        "appinvite_service": {
          "other_platform_oauth_client": [
            {
              "client_id": "138216707976-i0bub6pgqsanssr0la7gaapf9bm7in90.apps.googleusercontent.com",
              "client_type": 3
            }
          ]
        }
      }
    }
  ],
  "configuration_version": "1"
}