0
SECTION
2
HEADER
9
$INSUNITS
70
4
9
$ACADVER
1
AC1014
9
$HANDSEED
5
FFFF
0
ENDSEC
0
SECTION
2
TABLES
0
TABLE
2
VPORT
5
8
100
AcDbSymbolTable
0
ENDTAB
0
TABLE
2
LTYPE
5
5
100
AcDbSymbolTable
0
LTYPE
5
14
100
AcDbSymbolTableRecord
100
AcDbLinetypeTableRecord
2
BYBLOCK
70
0
0
LTYPE
5
15
100
AcDbSymbolTableRecord
100
AcDbLinetypeTableRecord
2
BYLAYER
70
0
0
ENDTAB
0
TABLE
2
LAYER
5
2
100
AcDbSymbolTable
70
2
0
LAYER
5
50
100
AcDbSymbolTableRecord
100
AcDbLayerTableRecord
2
0
70
0
6
CONTINUOUS
0
ENDTAB
0
TABLE
2
STYLE
5
3
100
AcDbSymbolTable
70
1
0
STYLE
5
11
100
AcDbSymbolTableRecord
100
AcDbTextStyleTableRecord
2
STANDARD
70
0
0
ENDTAB
0
TABLE
2
VIEW
5
6
100
AcDbSymbolTable
70
0
0
ENDTAB
0
TABLE
2
UCS
5
7
100
AcDbSymbolTable
70
0
0
ENDTAB
0
TABLE
2
APPID
5
9
100
AcDbSymbolTable
70
2
0
APPID
5
12
100
AcDbSymbolTableRecord
100
AcDbRegAppTableRecord
2
ACAD
70
0
0
ENDTAB
0
TABLE
2
DIMSTYLE
5
A
100
AcDbSymbolTable
70
1
0
ENDTAB
0
TABLE
2
BLOCK_RECORD
5
1
100
AcDbSymbolTable
70
1
0
BLOCK_RECORD
5
1F
100
AcDbSymbolTableRecord
100
AcDbBlockTableRecord
2
*MODEL_SPACE
0
BLOCK_RECORD
5
1B
100
AcDbSymbolTableRecord
100
AcDbBlockTableRecord
2
*PAPER_SPACE
0
ENDTAB
0
ENDSEC
0
SECTION
2
BLOCKS
0
BLOCK
5
20
100
AcDbEntity
100
AcDbBlockBegin
2
*MODEL_SPACE
0
ENDBLK
5
21
100
AcDbEntity
100
AcDbBlockEnd
0
BLOCK
5
1C
100
AcDbEntity
100
AcDbBlockBegin
2
*PAPER_SPACE
0
ENDBLK
5
1D
100
AcDbEntity
100
AcDbBlockEnd
0
ENDSEC
0
SECTION
2
ENTITIES
0
CIRCLE
5
100
100
AcDbEntity
8
0
100
AcDbCircle
10
272.31323746705522
20
-14.000000000000004
30
0
40
1.9999999999999929
210
0
220
-0
230
1
0
CIRCLE
5
101
100
AcDbEntity
8
0
100
AcDbCircle
10
272.31323746705522
20
-44.000000000000028
30
0
40
1.9999999999999929
210
0
220
-0
230
1
0
CIRCLE
5
102
100
AcDbEntity
8
0
100
AcDbCircle
10
17.686762532944794
20
-44.000000000000028
30
0
40
1.9999999999999996
210
0
220
-0
230
1
0
CIRCLE
5
103
100
AcDbEntity
8
0
100
AcDbCircle
10
17.686762532944794
20
-14.000000000000004
30
0
40
1.9999999999999996
210
0
220
-0
230
1
0
CIRCLE
5
104
100
AcDbEntity
8
0
100
AcDbCircle
10
144.99676253294481
20
-44.000000000000028
30
0
40
1.9999999999999929
210
0
220
-0
230
1
0
CIRCLE
5
105
100
AcDbEntity
8
0
100
AcDbCircle
10
144.99676253294481
20
-14.000000000000004
30
0
40
1.9999999999999929
210
0
220
-0
230
1
0
LWPOLYLINE
5
106
100
AcDbEntity
8
0
100
AcDbPolyline
90
144
70
1
43
0.0
10
290
20
0
10
290.00000000000006
20
-108
10
287
20
-108
10
287
20
-58.000000000000007
10
281.80000000000001
20
-58.000000000000007
10
281.80000000000001
20
-108
10
278.80000000000001
20
-108
10
278.80000000000001
20
-58.000000000000007
10
273.60000000000002
20
-58.000000000000007
10
273.60000000000002
20
-108
10
270.60000000000002
20
-108
10
270.60000000000002
20
-58.000000000000007
10
265.40000000000003
20
-58.000000000000007
10
265.40000000000003
20
-108
10
262.40000000000003
20
-108
10
262.40000000000003
20
-58.000000000000007
10
257.20000000000005
20
-58.000000000000007
10
257.20000000000005
20
-108
10
254.20000000000002
20
-108
10
254.20000000000002
20
-58.000000000000007
10
249.00000000000003
20
-58.000000000000007
10
249.00000000000003
20
-108
10
246
20
-108
10
246
20
-58.000000000000007
10
240.80000000000001
20
-58.000000000000007
10
240.80000000000001
20
-108
10
237.80000000000001
20
-108
10
237.80000000000001
20
-58.000000000000007
10
232.60000000000002
20
-58.000000000000007
10
232.60000000000002
20
-108
10
229.60000000000002
20
-108
10
229.60000000000002
20
-58.000000000000007
10
224.40000000000001
20
-58.000000000000007
10
224.40000000000001
20
-108
10
221.40000000000001
20
-108
10
221.40000000000001
20
-58.000000000000007
10
216.20000000000002
20
-58.000000000000007
10
216.20000000000002
20
-108
10
213.19999999999999
20
-108
10
213.19999999999999
20
-58.000000000000007
10
208
20
-58.000000000000007
10
208
20
-108
10
205
20
-108
10
205
20
-58.000000000000007
10
199.80000000000001
20
-58.000000000000007
10
199.80000000000001
20
-108
10
196.80000000000001
20
-108
10
196.80000000000001
20
-58.000000000000007
10
191.60000000000002
20
-58.000000000000007
10
191.60000000000002
20
-108
10
188.60000000000002
20
-108
10
188.60000000000002
20
-58.000000000000007
10
183.40000000000003
20
-58.000000000000007
10
183.40000000000003
20
-108
10
180.40000000000003
20
-108
10
180.40000000000003
20
-58.000000000000007
10
175.20000000000005
20
-58.000000000000007
10
175.20000000000005
20
-108
10
172.20000000000002
20
-108
10
172.20000000000002
20
-58.000000000000007
10
167.00000000000003
20
-58.000000000000007
10
167.00000000000003
20
-108
10
164.00000000000003
20
-108
10
164.00000000000003
20
-58.000000000000007
10
158.80000000000001
20
-58.000000000000007
10
158.80000000000001
20
-108
10
155.80000000000001
20
-108
10
155.80000000000001
20
-58.000000000000007
10
150.60000000000002
20
-58.000000000000007
10
150.60000000000002
20
-108
10
147.60000000000002
20
-108
10
147.60000000000002
20
-58.000000000000007
10
142.40000000000003
20
-58.000000000000007
10
142.40000000000003
20
-108
10
139.40000000000001
20
-108
10
139.40000000000001
20
-58.000000000000007
10
134.20000000000002
20
-58.000000000000007
10
134.20000000000002
20
-108
10
131.20000000000002
20
-108
10
131.20000000000002
20
-58.000000000000007
10
126.00000000000001
20
-58.000000000000007
10
126.00000000000001
20
-108
10
123
20
-108
10
123
20
-58.000000000000007
10
117.80000000000001
20
-58.000000000000007
10
117.80000000000001
20
-108
10
114.80000000000001
20
-108
10
114.80000000000001
20
-58.000000000000007
10
109.60000000000001
20
-58.000000000000007
10
109.60000000000001
20
-108
10
106.59999999999999
20
-108
10
106.59999999999999
20
-58.000000000000007
10
101.40000000000001
20
-58.000000000000007
10
101.40000000000001
20
-108
10
98.400000000000006
20
-108
10
98.400000000000006
20
-58.000000000000007
10
93.200000000000017
20
-58.000000000000007
10
93.200000000000017
20
-108
10
90.200000000000017
20
-108
10
90.200000000000017
20
-58.000000000000007
10
85.000000000000014
20
-58.000000000000007
10
85.000000000000014
20
-108
10
82.000000000000014
20
-108
10
82.000000000000014
20
-58.000000000000007
10
76.800000000000011
20
-58.000000000000007
10
76.800000000000011
20
-108
10
73.800000000000011
20
-108
10
73.800000000000011
20
-58.000000000000007
10
68.600000000000009
20
-58.000000000000007
10
68.600000000000009
20
-108
10
65.600000000000009
20
-108
10
65.600000000000009
20
-58.000000000000007
10
60.399999999999999
20
-58.000000000000007
10
60.399999999999999
20
-108
10
57.400000000000006
20
-108
10
57.400000000000006
20
-58.000000000000007
10
52.199999999999996
20
-58.000000000000007
10
52.199999999999996
20
-108
10
49.200000000000003
20
-108
10
49.200000000000003
20
-58.000000000000007
10
44
20
-58.000000000000007
10
44
20
-108
10
41.000000000000007
20
-108
10
41.000000000000007
20
-58.000000000000007
10
35.799999999999997
20
-58.000000000000007
10
35.799999999999997
20
-108
10
32.800000000000004
20
-108
10
32.800000000000004
20
-58.000000000000007
10
27.599999999999998
20
-58.000000000000007
10
27.599999999999998
20
-108
10
24.600000000000001
20
-108
10
24.600000000000001
20
-58.000000000000007
10
19.400000000000002
20
-58.000000000000007
10
19.400000000000002
20
-108
10
16.400000000000002
20
-108
10
16.400000000000002
20
-58.000000000000007
10
11.200000000000001
20
-58.000000000000007
10
11.200000000000001
20
-108
10
8.2000000000000011
20
-108
10
8.2000000000000011
20
-58.000000000000007
10
3.0000000000000004
20
-58.000000000000007
10
3.0000000000000004
20
-108
10
0
20
-108
10
0
20
0
0
ENDSEC
0
SECTION
2
OBJECTS
0
DICTIONARY
5
C
100
AcDbDictionary
3
ACAD_GROUP
350
D
3
ACAD_MLINESTYLE
350
17
0
DICTIONARY
5
D
100
AcDbDictionary
0
DICTIONARY
5
1A
330
C
100
AcDbDictionary
0
DICTIONARY
5
17
100
AcDbDictionary
0
ENDSEC
0
EOF
