{
    "development": {
        "mongoServer": "mongodb://localhost/dkata",
        "port": 3000
    },
    "test": {
        "mongoServer": "mongodb://localhost/test",
        "port": 3000
    },
    "production": {
        "mongoServer": "mongodb+srv://admin:admin@cluster0-gkszh.mongodb.net/photo_share?retryWrites=true&w=majority"
    }
}