{
    "development": {
        "port" : 3000,
        "mongoUrl" : "mongodb://localhost:27017/dkatalis"
    },
    "test" : {
        "port" : 4000,
        "mongoUrl" : "mongodb://localhost:27017/test"
    },
    "production" : {
        "mongoUrl" :"mongodb://localhost:27017/dkatalis"
    }
}

