{
  "nested": {
    "fk_app": {
      "options": {
        "java_package": "org.conservify.fieldkit.app.pb",
        "go_package": "gitlab.com/fieldkit/libraries/app-protocol"
      },
      "nested": {
        "QueryFlags": {
          "values": {
            "QUERY_FLAGS_NONE": 0,
            "QUERY_FLAGS_LOGS": 1
          }
        },
        "QueryType": {
          "values": {
            "QUERY_NONE": 0,
            "QUERY_CAPABILITIES": 1,
            "QUERY_CONFIGURE_SENSOR": 2,
            "QUERY_LIVE_DATA_POLL": 7,
            "QUERY_SCHEDULES": 8,
            "QUERY_CONFIGURE_SCHEDULES": 9,
            "QUERY_FILES_SD": 10,
            "QUERY_DOWNLOAD_FILE": 11,
            "QUERY_ERASE_FILE": 12,
            "QUERY_RESET": 13,
            "QUERY_NETWORK_SETTINGS": 14,
            "QUERY_CONFIGURE_NETWORK_SETTINGS": 15,
            "QUERY_SCAN_MODULES": 16,
            "QUERY_CONFIGURE_IDENTITY": 17,
            "QUERY_STATUS": 18,
            "QUERY_MODULE": 19,
            "QUERY_METADATA": 20,
            "QUERY_FORMAT": 21,
            "QUERY_GET_READINGS": 22,
            "QUERY_TAKE_READINGS": 23,
            "QUERY_RECORDING_CONTROL": 24,
            "QUERY_CONFIGURE": 25,
            "QUERY_SCAN_NETWORKS": 26,
            "QUERY_FILES_SPI": 27,
            "QUERY_FILES_QSPI": 28
          }
        },
        "ReplyType": {
          "values": {
            "REPLY_NONE": 0,
            "REPLY_SUCCESS": 1,
            "REPLY_BUSY": 2,
            "REPLY_ERROR": 3,
            "REPLY_CAPABILITIES": 4,
            "REPLY_LIVE_DATA_POLL": 8,
            "REPLY_SCHEDULES": 9,
            "REPLY_FILES": 10,
            "REPLY_DOWNLOAD_FILE": 11,
            "REPLY_RESET": 12,
            "REPLY_NETWORK_SETTINGS": 13,
            "REPLY_IDENTITY": 14,
            "REPLY_STATUS": 15,
            "REPLY_MODULE": 16,
            "REPLY_METADATA": 17,
            "REPLY_READINGS": 18,
            "REPLY_NETWORKS": 19
          }
        },
        "DownloadFlags": {
          "values": {
            "DOWNLOAD_FLAG_NONE": 0,
            "DOWNLOAD_FLAG_METADATA_PREPEND": 1,
            "DOWNLOAD_FLAG_METADATA_ONLY": 2
          }
        },
        "ModuleFlags": {
          "values": {
            "MODULE_FLAG_NONE": 0,
            "MODULE_FLAG_INTERNAL": 1
          }
        },
        "SensorFlags": {
          "values": {
            "SENSOR_FLAG_NONE": 0
          }
        },
        "QueryCapabilities": {
          "fields": {
            "version": {
              "type": "uint32",
              "id": 1
            },
            "callerTime": {
              "type": "uint32",
              "id": 2
            }
          }
        },
        "LiveValue": {
          "fields": {
            "valid": {
              "type": "bool",
              "id": 1
            },
            "value": {
              "type": "float",
              "id": 2
            },
            "uncalibrated": {
              "type": "float",
              "id": 3
            }
          }
        },
        "SensorCapabilities": {
          "fields": {
            "number": {
              "type": "uint32",
              "id": 1
            },
            "module": {
              "type": "uint32",
              "id": 2
            },
            "name": {
              "type": "string",
              "id": 3
            },
            "frequency": {
              "type": "uint32",
              "id": 4
            },
            "unitOfMeasure": {
              "type": "string",
              "id": 5
            },
            "uncalibratedUnitOfMeasure": {
              "type": "string",
              "id": 9
            },
            "path": {
              "type": "string",
              "id": 6
            },
            "flags": {
              "type": "uint32",
              "id": 7
            },
            "value": {
              "type": "LiveValue",
              "id": 8
            }
          }
        },
        "ModuleHeader": {
          "fields": {
            "manufacturer": {
              "type": "uint32",
              "id": 1
            },
            "kind": {
              "type": "uint32",
              "id": 2
            },
            "version": {
              "type": "uint32",
              "id": 3
            }
          }
        },
        "ModuleCapabilities": {
          "fields": {
            "position": {
              "type": "uint32",
              "id": 1
            },
            "name": {
              "type": "string",
              "id": 2
            },
            "sensors": {
              "rule": "repeated",
              "type": "SensorCapabilities",
              "id": 3
            },
            "path": {
              "type": "string",
              "id": 4
            },
            "flags": {
              "type": "uint32",
              "id": 5
            },
            "id": {
              "type": "bytes",
              "id": 6
            },
            "header": {
              "type": "ModuleHeader",
              "id": 7
            },
            "configuration": {
              "type": "bytes",
              "id": 8
            }
          }
        },
        "Capabilities": {
          "fields": {
            "version": {
              "type": "uint32",
              "id": 1
            },
            "deviceId": {
              "type": "bytes",
              "id": 2
            },
            "name": {
              "type": "string",
              "id": 3
            },
            "modules": {
              "rule": "repeated",
              "type": "ModuleCapabilities",
              "id": 4
            },
            "sensors": {
              "rule": "repeated",
              "type": "SensorCapabilities",
              "id": 5
            }
          }
        },
        "NetworkInfo": {
          "fields": {
            "ssid": {
              "type": "string",
              "id": 1
            },
            "password": {
              "type": "string",
              "id": 2
            },
            "create": {
              "type": "bool",
              "id": 3
            },
            "preferred": {
              "type": "bool",
              "id": 4
            },
            "keeping": {
              "type": "bool",
              "id": 5
            }
          }
        },
        "NetworkSettings": {
          "fields": {
            "createAccessPoint": {
              "type": "int32",
              "id": 1
            },
            "connected": {
              "type": "NetworkInfo",
              "id": 3
            },
            "macAddress": {
              "type": "string",
              "id": 4
            },
            "modifying": {
              "type": "bool",
              "id": 5
            },
            "supportsUdp": {
              "type": "bool",
              "id": 6
            },
            "networks": {
              "rule": "repeated",
              "type": "NetworkInfo",
              "id": 2
            }
          }
        },
        "Firmware": {
          "fields": {
            "version": {
              "type": "string",
              "id": 1
            },
            "build": {
              "type": "string",
              "id": 2
            },
            "number": {
              "type": "string",
              "id": 3
            },
            "timestamp": {
              "type": "uint64",
              "id": 4
            },
            "hash": {
              "type": "string",
              "id": 5
            },
            "logicalAddress": {
              "type": "uint64",
              "id": 6
            },
            "name": {
              "type": "string",
              "id": 7
            }
          }
        },
        "Identity": {
          "fields": {
            "device": {
              "type": "string",
              "id": 1
            },
            "stream": {
              "type": "string",
              "id": 2
            },
            "deviceId": {
              "type": "bytes",
              "id": 3
            },
            "firmware": {
              "type": "string",
              "id": 4
            },
            "build": {
              "type": "string",
              "id": 5
            },
            "number": {
              "type": "string",
              "id": 8
            },
            "name": {
              "type": "string",
              "id": 6
            },
            "generationId": {
              "type": "bytes",
              "id": 7
            }
          }
        },
        "ConfigureSensorQuery": {
          "fields": {
            "id": {
              "type": "uint32",
              "id": 1
            },
            "frequency": {
              "type": "uint32",
              "id": 2
            }
          }
        },
        "LiveDataPoll": {
          "fields": {
            "interval": {
              "type": "uint32",
              "id": 1
            }
          }
        },
        "LiveDataSample": {
          "fields": {
            "sensor": {
              "type": "uint32",
              "id": 1
            },
            "time": {
              "type": "uint64",
              "id": 2
            },
            "value": {
              "type": "float",
              "id": 3
            }
          }
        },
        "LiveData": {
          "fields": {
            "samples": {
              "rule": "repeated",
              "type": "LiveDataSample",
              "id": 1
            }
          }
        },
        "File": {
          "fields": {
            "id": {
              "type": "uint32",
              "id": 1
            },
            "time": {
              "type": "uint64",
              "id": 2
            },
            "size": {
              "type": "uint64",
              "id": 3
            },
            "version": {
              "type": "uint32",
              "id": 4
            },
            "name": {
              "type": "string",
              "id": 5
            },
            "maximum": {
              "type": "uint64",
              "id": 6
            }
          }
        },
        "Files": {
          "fields": {
            "files": {
              "rule": "repeated",
              "type": "File",
              "id": 1
            }
          }
        },
        "DownloadFile": {
          "fields": {
            "id": {
              "type": "uint32",
              "id": 1
            },
            "offset": {
              "type": "uint32",
              "id": 2
            },
            "length": {
              "type": "uint32",
              "id": 3
            },
            "flags": {
              "type": "uint32",
              "id": 4
            }
          }
        },
        "EraseFile": {
          "fields": {
            "id": {
              "type": "uint32",
              "id": 1
            }
          }
        },
        "FileData": {
          "fields": {
            "offset": {
              "type": "uint32",
              "id": 1
            },
            "data": {
              "type": "bytes",
              "id": 2
            },
            "size": {
              "type": "uint32",
              "id": 3
            },
            "hash": {
              "type": "uint32",
              "id": 4
            },
            "version": {
              "type": "uint32",
              "id": 5
            },
            "id": {
              "type": "uint32",
              "id": 6
            }
          }
        },
        "DeviceStatus": {
          "fields": {
            "uptime": {
              "type": "uint32",
              "id": 1
            },
            "batteryPercentage": {
              "type": "float",
              "id": 2
            },
            "batteryVoltage": {
              "type": "float",
              "id": 3
            },
            "gpsHasFix": {
              "type": "uint32",
              "id": 4
            },
            "gpsSatellites": {
              "type": "uint32",
              "id": 5
            }
          }
        },
        "QueryModule": {
          "fields": {
            "id": {
              "type": "uint32",
              "id": 1
            },
            "address": {
              "type": "uint32",
              "id": 2
            },
            "message": {
              "type": "bytes",
              "id": 3
            }
          }
        },
        "ModuleReply": {
          "fields": {
            "id": {
              "type": "uint32",
              "id": 1
            },
            "address": {
              "type": "uint32",
              "id": 2
            },
            "message": {
              "type": "bytes",
              "id": 3
            }
          }
        },
        "WireMessageQuery": {
          "fields": {
            "type": {
              "type": "QueryType",
              "id": 1
            },
            "queryCapabilities": {
              "type": "QueryCapabilities",
              "id": 2
            },
            "configureSensor": {
              "type": "ConfigureSensorQuery",
              "id": 3
            },
            "liveDataPoll": {
              "type": "LiveDataPoll",
              "id": 8
            },
            "downloadFile": {
              "type": "DownloadFile",
              "id": 10
            },
            "eraseFile": {
              "type": "EraseFile",
              "id": 11
            },
            "networkSettings": {
              "type": "NetworkSettings",
              "id": 12
            },
            "identity": {
              "type": "Identity",
              "id": 13
            },
            "module": {
              "type": "QueryModule",
              "id": 14
            }
          }
        },
        "Error": {
          "fields": {
            "message": {
              "type": "string",
              "id": 1
            },
            "delay": {
              "type": "uint32",
              "id": 2
            }
          }
        },
        "WireMessageReply": {
          "fields": {
            "type": {
              "type": "ReplyType",
              "id": 1
            },
            "errors": {
              "rule": "repeated",
              "type": "Error",
              "id": 2
            },
            "capabilities": {
              "type": "Capabilities",
              "id": 3
            },
            "liveData": {
              "type": "LiveData",
              "id": 6
            },
            "files": {
              "type": "Files",
              "id": 8
            },
            "fileData": {
              "type": "FileData",
              "id": 9
            },
            "networkSettings": {
              "type": "NetworkSettings",
              "id": 10
            },
            "identity": {
              "type": "Identity",
              "id": 11
            },
            "status": {
              "type": "DeviceStatus",
              "id": 12
            },
            "module": {
              "type": "ModuleReply",
              "id": 13
            }
          }
        },
        "Interval": {
          "fields": {
            "start": {
              "type": "uint64",
              "id": 1
            },
            "end": {
              "type": "uint64",
              "id": 2
            },
            "interval": {
              "type": "uint32",
              "id": 3
            }
          }
        },
        "Schedule": {
          "fields": {
            "cron": {
              "type": "bytes",
              "id": 1
            },
            "interval": {
              "type": "uint32",
              "id": 2
            },
            "repeated": {
              "type": "uint32",
              "id": 3
            },
            "duration": {
              "type": "uint32",
              "id": 4
            },
            "jitter": {
              "type": "uint32",
              "id": 5
            },
            "intervals": {
              "rule": "repeated",
              "type": "Interval",
              "id": 6
            }
          }
        },
        "Schedules": {
          "fields": {
            "modifying": {
              "type": "bool",
              "id": 1
            },
            "readings": {
              "type": "Schedule",
              "id": 2
            },
            "lora": {
              "type": "Schedule",
              "id": 3
            },
            "network": {
              "type": "Schedule",
              "id": 4
            },
            "gps": {
              "type": "Schedule",
              "id": 5
            }
          }
        },
        "HardwareStatus": {
          "fields": {}
        },
        "GpsStatus": {
          "fields": {
            "enabled": {
              "type": "uint32",
              "id": 7
            },
            "fix": {
              "type": "uint32",
              "id": 1
            },
            "time": {
              "type": "uint64",
              "id": 2
            },
            "satellites": {
              "type": "uint32",
              "id": 3
            },
            "longitude": {
              "type": "float",
              "id": 4
            },
            "latitude": {
              "type": "float",
              "id": 5
            },
            "altitude": {
              "type": "float",
              "id": 6
            }
          }
        },
        "MemoryStatus": {
          "fields": {
            "sramAvailable": {
              "type": "uint32",
              "id": 1
            },
            "programFlashAvailable": {
              "type": "uint32",
              "id": 2
            },
            "extendedMemoryAvailable": {
              "type": "uint32",
              "id": 3
            },
            "dataMemoryInstalled": {
              "type": "uint32",
              "id": 4
            },
            "dataMemoryUsed": {
              "type": "uint32",
              "id": 5
            },
            "dataMemoryConsumption": {
              "type": "float",
              "id": 6
            },
            "firmware": {
              "rule": "repeated",
              "type": "Firmware",
              "id": 7
            }
          }
        },
        "BatteryStatus": {
          "fields": {
            "voltage": {
              "type": "uint32",
              "id": 1
            },
            "percentage": {
              "type": "uint32",
              "id": 2
            }
          }
        },
        "SolarStatus": {
          "fields": {
            "voltage": {
              "type": "uint32",
              "id": 1
            }
          }
        },
        "PowerStatus": {
          "fields": {
            "battery": {
              "type": "BatteryStatus",
              "id": 1
            },
            "solar": {
              "type": "SolarStatus",
              "id": 2
            }
          }
        },
        "Status": {
          "fields": {
            "version": {
              "type": "uint32",
              "id": 1
            },
            "uptime": {
              "type": "uint32",
              "id": 2
            },
            "identity": {
              "type": "Identity",
              "id": 3
            },
            "hardware": {
              "type": "HardwareStatus",
              "id": 4
            },
            "power": {
              "type": "PowerStatus",
              "id": 5
            },
            "memory": {
              "type": "MemoryStatus",
              "id": 6
            },
            "gps": {
              "type": "GpsStatus",
              "id": 7
            },
            "schedules": {
              "type": "Schedules",
              "id": 8
            },
            "recording": {
              "type": "Recording",
              "id": 9
            },
            "network": {
              "type": "NetworkSettings",
              "id": 10
            },
            "time": {
              "type": "uint64",
              "id": 11
            },
            "firmware": {
              "type": "Firmware",
              "id": 12
            },
            "logs": {
              "type": "string",
              "id": 13
            }
          }
        },
        "Range": {
          "fields": {
            "start": {
              "type": "uint32",
              "id": 1
            },
            "end": {
              "type": "uint32",
              "id": 2
            }
          }
        },
        "DownloadQuery": {
          "fields": {
            "stream": {
              "type": "uint32",
              "id": 1
            },
            "ranges": {
              "rule": "repeated",
              "type": "Range",
              "id": 3
            },
            "blocks": {
              "rule": "repeated",
              "type": "uint32",
              "id": 4
            }
          }
        },
        "Recording": {
          "fields": {
            "modifying": {
              "type": "bool",
              "id": 1
            },
            "enabled": {
              "type": "bool",
              "id": 2
            },
            "startedTime": {
              "type": "uint64",
              "id": 3
            },
            "location": {
              "type": "Location",
              "id": 4
            }
          }
        },
        "LoraSettings": {
          "fields": {
            "available": {
              "type": "bool",
              "id": 1
            },
            "modifying": {
              "type": "bool",
              "id": 2
            },
            "clearing": {
              "type": "bool",
              "id": 3
            },
            "verify": {
              "type": "bool",
              "id": 11
            },
            "frequencyBand": {
              "type": "uint32",
              "id": 4
            },
            "deviceEui": {
              "type": "bytes",
              "id": 5
            },
            "appKey": {
              "type": "bytes",
              "id": 6
            },
            "joinEui": {
              "type": "bytes",
              "id": 7
            },
            "deviceAddress": {
              "type": "bytes",
              "id": 8
            },
            "networkSessionKey": {
              "type": "bytes",
              "id": 9
            },
            "appSessionKey": {
              "type": "bytes",
              "id": 10
            }
          }
        },
        "Location": {
          "fields": {
            "modifying": {
              "type": "bool",
              "id": 1
            },
            "longitude": {
              "type": "float",
              "id": 2
            },
            "latitude": {
              "type": "float",
              "id": 3
            },
            "time": {
              "type": "uint64",
              "id": 4
            }
          }
        },
        "WifiTransmission": {
          "fields": {
            "modifying": {
              "type": "bool",
              "id": 1
            },
            "url": {
              "type": "string",
              "id": 2
            },
            "token": {
              "type": "string",
              "id": 3
            },
            "enabled": {
              "type": "bool",
              "id": 4
            }
          }
        },
        "Transmission": {
          "fields": {
            "wifi": {
              "type": "WifiTransmission",
              "id": 1
            }
          }
        },
        "ListDirectory": {
          "fields": {
            "path": {
              "type": "string",
              "id": 1
            },
            "page": {
              "type": "uint32",
              "id": 2
            }
          }
        },
        "HttpQuery": {
          "fields": {
            "type": {
              "type": "QueryType",
              "id": 1
            },
            "identity": {
              "type": "Identity",
              "id": 2
            },
            "recording": {
              "type": "Recording",
              "id": 3
            },
            "schedules": {
              "type": "Schedules",
              "id": 4
            },
            "networkSettings": {
              "type": "NetworkSettings",
              "id": 6
            },
            "loraSettings": {
              "type": "LoraSettings",
              "id": 7
            },
            "locate": {
              "type": "Location",
              "id": 9
            },
            "transmission": {
              "type": "Transmission",
              "id": 10
            },
            "directory": {
              "type": "ListDirectory",
              "id": 11
            },
            "flags": {
              "type": "uint32",
              "id": 5
            },
            "time": {
              "type": "uint64",
              "id": 8
            },
            "counter": {
              "type": "uint32",
              "id": 12
            }
          }
        },
        "DataStream": {
          "fields": {
            "id": {
              "type": "uint32",
              "id": 1
            },
            "time": {
              "type": "uint64",
              "id": 2
            },
            "size": {
              "type": "uint64",
              "id": 3
            },
            "version": {
              "type": "uint32",
              "id": 4
            },
            "block": {
              "type": "uint64",
              "id": 5
            },
            "hash": {
              "type": "bytes",
              "id": 6
            },
            "name": {
              "type": "string",
              "id": 7
            },
            "path": {
              "type": "string",
              "id": 8
            }
          }
        },
        "LiveSensorReading": {
          "fields": {
            "sensor": {
              "type": "SensorCapabilities",
              "id": 1
            },
            "value": {
              "type": "float",
              "id": 2
            },
            "uncalibrated": {
              "type": "float",
              "id": 3
            },
            "factory": {
              "type": "float",
              "id": 4
            },
            "adc": {
              "type": "bytes",
              "id": 5
            }
          }
        },
        "LiveModuleReadings": {
          "fields": {
            "module": {
              "type": "ModuleCapabilities",
              "id": 1
            },
            "readings": {
              "rule": "repeated",
              "type": "LiveSensorReading",
              "id": 2
            }
          }
        },
        "LiveReadings": {
          "fields": {
            "time": {
              "type": "uint64",
              "id": 1
            },
            "modules": {
              "rule": "repeated",
              "type": "LiveModuleReadings",
              "id": 2
            }
          }
        },
        "DirectoryEntry": {
          "fields": {
            "name": {
              "type": "string",
              "id": 1
            },
            "path": {
              "type": "string",
              "id": 2
            },
            "size": {
              "type": "uint32",
              "id": 3
            },
            "directory": {
              "type": "bool",
              "id": 4
            }
          }
        },
        "DirectoryListing": {
          "fields": {
            "path": {
              "type": "string",
              "id": 1
            },
            "totalEntries": {
              "type": "uint32",
              "id": 3
            },
            "entries": {
              "rule": "repeated",
              "type": "DirectoryEntry",
              "id": 2
            }
          }
        },
        "NearbyNetwork": {
          "fields": {
            "ssid": {
              "type": "string",
              "id": 1
            }
          }
        },
        "NearbyNetworks": {
          "fields": {
            "networks": {
              "rule": "repeated",
              "type": "NearbyNetwork",
              "id": 1
            }
          }
        },
        "HttpReply": {
          "fields": {
            "type": {
              "type": "ReplyType",
              "id": 1
            },
            "errors": {
              "rule": "repeated",
              "type": "Error",
              "id": 2
            },
            "status": {
              "type": "Status",
              "id": 3
            },
            "networkSettings": {
              "type": "NetworkSettings",
              "id": 4
            },
            "loraSettings": {
              "type": "LoraSettings",
              "id": 8
            },
            "modules": {
              "rule": "repeated",
              "type": "ModuleCapabilities",
              "id": 5
            },
            "streams": {
              "rule": "repeated",
              "type": "DataStream",
              "id": 6
            },
            "liveReadings": {
              "rule": "repeated",
              "type": "LiveReadings",
              "id": 7
            },
            "schedules": {
              "type": "Schedules",
              "id": 9
            },
            "transmission": {
              "type": "Transmission",
              "id": 10
            },
            "listing": {
              "type": "DirectoryListing",
              "id": 11
            },
            "nearbyNetworks": {
              "type": "NearbyNetworks",
              "id": 12
            },
            "events": {
              "type": "bytes",
              "id": 13
            }
          }
        },
        "ModuleQueryType": {
          "values": {
            "MODULE_QUERY_NONE": 0,
            "MODULE_QUERY_STATUS": 1,
            "MODULE_QUERY_CONFIGURE": 2,
            "MODULE_QUERY_RESET": 3
          }
        },
        "ModuleHttpQuery": {
          "fields": {
            "type": {
              "type": "ModuleQueryType",
              "id": 1
            },
            "errors": {
              "rule": "repeated",
              "type": "Error",
              "id": 2
            },
            "configuration": {
              "type": "bytes",
              "id": 3
            }
          }
        },
        "ModuleReplyType": {
          "values": {
            "MODULE_REPLY_NONE": 0,
            "MODULE_REPLY_SUCCESS": 1,
            "MODULE_REPLY_BUSY": 2,
            "MODULE_REPLY_ERROR": 3
          }
        },
        "ModuleHttpReply": {
          "fields": {
            "type": {
              "type": "ModuleReplyType",
              "id": 1
            },
            "errors": {
              "rule": "repeated",
              "type": "Error",
              "id": 2
            },
            "configuration": {
              "type": "bytes",
              "id": 3
            }
          }
        },
        "UdpStatus": {
          "values": {
            "UDP_STATUS_ONLINE": 0,
            "UDP_STATUS_BYE": 1
          }
        },
        "UdpMessage": {
          "fields": {
            "deviceId": {
              "type": "bytes",
              "id": 1
            },
            "status": {
              "type": "UdpStatus",
              "id": 2
            },
            "counter": {
              "type": "uint32",
              "id": 3
            },
            "port": {
              "type": "uint32",
              "id": 4
            }
          }
        }
      }
    }
  }
}