module gitlab.com/fidencio.garrido/ditracker

go 1.16

require (
	github.com/containerd/containerd v1.5.9 // indirect
	github.com/docker/docker v20.10.12+incompatible
	github.com/docker/go-connections v0.4.0 // indirect
	github.com/gorilla/mux v1.8.0 // indirect
	github.com/moby/term v0.0.0-20210619224110-3f7ff695adc6 // indirect
	github.com/morikuni/aec v1.0.0 // indirect
	golang.org/x/time v0.0.0-20211116232009-f0f3c7e86c11 // indirect
	google.golang.org/grpc v1.43.0 // indirect
	gotest.tools/v3 v3.1.0 // indirect
)
