[
  {
    "op": "rdf-extension/save-rdf-schema",
    "schema": {
      "prefixes": [
        {
          "name": "rdf",
          "uri": "http://www.w3.org/1999/02/22-rdf-syntax-ns#"
        },
        {
          "name": "owl",
          "uri": "http://www.w3.org/2002/07/owl#"
        },
        {
          "name": "xsd",
          "uri": "http://www.w3.org/2001/XMLSchema#"
        },
        {
          "name": "skos",
          "uri": "http://www.w3.org/2004/02/skos/core#"
        },
        {
          "name": "rdfs",
          "uri": "http://www.w3.org/2000/01/rdf-schema#"
        },
        {
          "name": "foaf",
          "uri": "http://xmlns.com/foaf/0.1/"
        }
      ],
      "baseUri": "http://127.0.0.1:3333/",
      "rootNodes": [
        {
          "nodeType": "cell-as-resource",
          "columnName": "IRI",
          "expression": "value",
          "isRowNumberCell": false,
          "links": [
            {
              "uri": "http://www.w3.org/2004/02/skos/core#mappingRelation",
              "curie": "skos:mappingRelation",
              "target": {
                "nodeType": "cell-as-resource",
                "columnName": "Findex Raum Mappings",
                "expression": "value",
                "isRowNumberCell": false,
                "links": [],
                "rdfTypes": [
                  {
                    "uri": "http://www.w3.org/2004/02/skos/core#Concept",
                    "curie": "skos:Concept"
                  }
                ]
              }
            }
          ],
          "rdfTypes": [
            {
              "uri": "http://www.w3.org/2004/02/skos/core#Concept",
              "curie": "skos:Concept"
            }
          ]
        }
      ]
    },
    "description": "Save RDF schema skeleton"
  }
]