{
  "token": "02ff2a60abcd6f52308f41c3add6b79edce43b88ab329687288ff286350a9582",
  "name": "Endang",
  "email": "fian.enfi@gmail.com",
  "usr": "akFlMGZQdFczcGtUeE5SQUNHNUhLQm1yLWR3Vnh2d0NBbkNXeGVHVncyND0=",
  "pwd": "gAAAAABla172YnZU-j-__a0pvIsY4P5j-EsTbDrvvURIi-poC5lnaJ3kSHQ02FnAHCoyfL4DAn9amYEECvlZuayNZtfA6F8I8jbZZRP6Td1Ct2P-t0bk1PC7FDto-zccplahU08RIdB2",
  "remember_me": 1,
  "screen_width": 1366,
  "screen_height": 768,
  "patients": [],
  "folder_id": "1",
  "patient_name": "",
  "mode": "prod",
  "instruction": false,
  "version": "2.2.4"
}