^C:\USERS\STUET\RIDERPROJECTS\UEBUNGSBLATT2-AUFGABE4\X64\DEBUG\MAIN.OBJ
C:\USERS\STUET\RIDERPROJECTS\UEBUNGSBLATT2-AUFGABE4\X64\DEBUG\UEBUNGSBLATT2-AUFGABE4.EXE
C:\USERS\STUET\RIDERPROJECTS\UEBUNGSBLATT2-AUFGABE4\X64\DEBUG\UEBUNGSBLATT2-AUFGABE4.ILK
C:\USERS\STUET\RIDERPROJECTS\UEBUNGSBLATT2-AUFGABE4\X64\DEBUG\UEBUNGSBLATT2-AUFGABE4.PDB
