^C:\USERS\STUET\RIDERPROJECTS\UEBUNGSBLATT2-AUFGABE3\UEBUNGSBLATT2-AUFGABE3\X64\DEBUG\MAIN.OBJ
C:\USERS\STUET\RIDERPROJECTS\UEBUNGSBLATT2-AUFGABE3\X64\DEBUG\UEBUNGSBLATT2-AUFGABE3.EXE
C:\USERS\STUET\RIDERPROJECTS\UEBUNGSBLATT2-AUFGABE3\UEBUNGSBLATT2-AUFGABE3\X64\DEBUG\UEBUNGSBLATT2-AUFGABE3.ILK
C:\USERS\STUET\RIDERPROJECTS\UEBUNGSBLATT2-AUFGABE3\X64\DEBUG\UEBUNGSBLATT2-AUFGABE3.PDB
