^C:\USERS\STUET\RIDERPROJECTS\UEBUNGSBLATT2-AUFGABE2\X64\DEBUG\MAIN.OBJ
C:\USERS\STUET\RIDERPROJECTS\UEBUNGSBLATT2-AUFGABE2\X64\DEBUG\UEBUNGSBLATT2-AUFGABE2.EXE
C:\USERS\STUET\RIDERPROJECTS\UEBUNGSBLATT2-AUFGABE2\X64\DEBUG\UEBUNGSBLATT2-AUFGABE2.ILK
C:\USERS\STUET\RIDERPROJECTS\UEBUNGSBLATT2-AUFGABE2\X64\DEBUG\UEBUNGSBLATT2-AUFGABE2.PDB
