<svg width="696" height="477" viewBox="0 0 696 477" fill="none" xmlns="http://www.w3.org/2000/svg">
<path d="M36.7787 70C36.4053 70 36.0942 69.888 35.8453 69.664C35.6213 69.44 35.5093 69.1787 35.5093 68.88V44.9866C35.5093 44.6879 35.6213 44.4266 35.8453 44.2026C36.0693 43.9786 36.3307 43.8666 36.6293 43.8666H46.7094C48.128 43.8666 49.3974 44.1777 50.5174 44.7999C51.6374 45.3973 52.5085 46.231 53.1307 47.3013C53.7778 48.3715 54.1014 49.5786 54.1014 50.9226C54.1014 52.0177 53.9023 53.0257 53.5041 53.9466C53.1058 54.8675 52.5458 55.6515 51.8241 56.2986C51.1023 56.9209 50.2934 57.3813 49.3974 57.68L48.0907 57.2693C49.0116 57.344 49.8703 57.6426 50.6667 58.1653C51.4632 58.6631 52.0978 59.36 52.5707 60.256C53.0685 61.1271 53.3298 62.1849 53.3547 63.4293C53.3796 64.4995 53.4294 65.3333 53.5041 65.9307C53.6036 66.528 53.7405 66.976 53.9147 67.2747C54.089 67.5733 54.313 67.8098 54.5867 67.984C54.8356 68.1333 54.9974 68.3449 55.0721 68.6187C55.1716 68.8924 55.1467 69.1538 54.9974 69.4027C54.8978 69.6018 54.7485 69.7511 54.5494 69.8507C54.3752 69.9253 54.1885 69.9627 53.9894 69.9627C53.7903 69.9627 53.5912 69.9129 53.3921 69.8133C53.0436 69.6142 52.6827 69.3031 52.3094 68.88C51.9609 68.4569 51.6623 67.8347 51.4134 67.0133C51.1894 66.192 51.0774 65.0471 51.0774 63.5786C51.0774 62.608 50.9156 61.8115 50.5921 61.1893C50.2934 60.5671 49.8952 60.0942 49.3974 59.7706C48.9245 59.4222 48.3894 59.1857 47.792 59.0613C47.2196 58.912 46.672 58.8373 46.1494 58.8373H37.4507L37.8614 58.3146V68.88C37.8614 69.1787 37.7618 69.44 37.5627 69.664C37.3636 69.888 37.1022 70 36.7787 70ZM37.4507 56.784H46.8214C47.6676 56.7093 48.464 56.4355 49.2107 55.9626C49.9574 55.4648 50.5547 54.7928 51.0027 53.9466C51.4756 53.1004 51.7121 52.1173 51.7121 50.9973C51.7121 49.5786 51.2267 48.4088 50.2561 47.4879C49.3103 46.5422 48.0658 46.0693 46.5227 46.0693H37.6L37.8614 45.5466V57.3066L37.4507 56.784ZM68.4016 70.3733C66.4851 70.3733 64.7927 69.9627 63.3242 69.1413C61.8558 68.32 60.7109 67.1751 59.8895 65.7067C59.0682 64.2382 58.6575 62.5209 58.6575 60.5546C58.6575 58.4391 59.0682 56.6346 59.8895 55.1413C60.7358 53.648 61.8184 52.5031 63.1375 51.7066C64.4816 50.8853 65.9002 50.4746 67.3936 50.4746C68.4887 50.4746 69.5465 50.6737 70.5669 51.0719C71.6122 51.4453 72.5331 52.0177 73.3296 52.7893C74.1509 53.536 74.798 54.4568 75.2709 55.552C75.7687 56.6471 76.0425 57.9164 76.0923 59.36C76.0674 59.6586 75.9429 59.92 75.7189 60.144C75.4949 60.3431 75.2336 60.4426 74.9349 60.4426H59.9642L59.5162 58.4266H74.2256L73.7402 58.8746V58.128C73.6407 56.9582 73.2674 55.9626 72.6202 55.1413C71.9731 54.32 71.1891 53.6977 70.2682 53.2746C69.3473 52.8515 68.3891 52.6399 67.3936 52.6399C66.6469 52.6399 65.8753 52.7893 65.0789 53.088C64.3073 53.3866 63.598 53.8595 62.9509 54.5066C62.3287 55.1288 61.8184 55.9377 61.4202 56.9333C61.022 57.904 60.8229 59.0613 60.8229 60.4053C60.8229 61.8738 61.1215 63.2053 61.7189 64.4C62.3162 65.5947 63.1749 66.5404 64.2949 67.2373C65.4398 67.9342 66.7962 68.2827 68.3642 68.2827C69.2353 68.2827 70.0193 68.1582 70.7162 67.9093C71.4131 67.6604 72.0229 67.3369 72.5456 66.9387C73.0682 66.5155 73.5038 66.08 73.8522 65.632C74.126 65.408 74.3998 65.296 74.6736 65.296C74.9225 65.296 75.134 65.3955 75.3082 65.5947C75.5074 65.7938 75.6069 66.0178 75.6069 66.2667C75.6069 66.5653 75.4825 66.8267 75.2336 67.0507C74.4869 67.9467 73.5162 68.7307 72.3216 69.4027C71.1269 70.0498 69.8202 70.3733 68.4016 70.3733ZM96.6755 50.9226C96.9991 50.9226 97.2604 51.0346 97.4595 51.2586C97.6835 51.4826 97.7955 51.7564 97.7955 52.0799V68.88C97.7955 69.1787 97.6835 69.44 97.4595 69.664C97.2355 69.888 96.9742 70 96.6755 70C96.352 70 96.0782 69.888 95.8542 69.664C95.6551 69.44 95.5555 69.1787 95.5555 68.88V64.4373L96.1902 64.1386C96.1902 64.8355 95.9911 65.5449 95.5928 66.2667C95.2195 66.9884 94.6968 67.6604 94.0248 68.2827C93.3528 68.9049 92.5564 69.4151 91.6355 69.8133C90.7395 70.1867 89.7688 70.3733 88.7235 70.3733C87.031 70.3733 85.5128 69.9378 84.1688 69.0667C82.8497 68.1956 81.8044 67.0009 81.0328 65.4827C80.2861 63.9644 79.9128 62.2595 79.9128 60.368C79.9128 58.4266 80.2986 56.7217 81.0701 55.2533C81.8417 53.76 82.887 52.5902 84.2061 51.7439C85.5253 50.8977 87.0186 50.4746 88.6862 50.4746C89.7564 50.4746 90.7519 50.6613 91.6728 51.0346C92.6186 51.4079 93.44 51.9182 94.1368 52.5653C94.8337 53.2124 95.3688 53.9591 95.7422 54.8053C96.1404 55.6266 96.3395 56.4853 96.3395 57.3813L95.5555 56.8213V52.0799C95.5555 51.7564 95.6551 51.4826 95.8542 51.2586C96.0782 51.0346 96.352 50.9226 96.6755 50.9226ZM88.9102 68.2827C90.2293 68.2827 91.3991 67.9467 92.4195 67.2747C93.44 66.5778 94.2364 65.632 94.8088 64.4373C95.4062 63.2178 95.7048 61.8613 95.7048 60.368C95.7048 58.8995 95.4062 57.5804 94.8088 56.4106C94.2364 55.2408 93.44 54.3075 92.4195 53.6106C91.3991 52.9137 90.2293 52.5653 88.9102 52.5653C87.6159 52.5653 86.4462 52.9013 85.4008 53.5733C84.3804 54.2453 83.5715 55.1662 82.9741 56.336C82.4017 57.5057 82.1155 58.8497 82.1155 60.368C82.1155 61.8613 82.4017 63.2178 82.9741 64.4373C83.5715 65.632 84.3804 66.5778 85.4008 67.2747C86.4213 67.9467 87.591 68.2827 88.9102 68.2827ZM112.074 50.4746C113.268 50.4746 114.363 50.6115 115.359 50.8853C116.354 51.1342 117.151 51.4826 117.748 51.9306C118.37 52.3786 118.682 52.864 118.682 53.3866C118.682 53.6355 118.594 53.8844 118.42 54.1333C118.246 54.3573 118.01 54.4693 117.711 54.4693C117.412 54.4693 117.163 54.3946 116.964 54.2453C116.79 54.096 116.603 53.9217 116.404 53.7226C116.23 53.5235 115.969 53.3368 115.62 53.1626C115.297 53.0133 114.836 52.8764 114.239 52.752C113.642 52.6275 112.957 52.5653 112.186 52.5653C110.792 52.5653 109.535 52.9137 108.415 53.6106C107.295 54.3075 106.411 55.2533 105.764 56.448C105.117 57.6177 104.793 58.9369 104.793 60.4053C104.793 61.8986 105.105 63.2426 105.727 64.4373C106.349 65.632 107.208 66.5778 108.303 67.2747C109.398 67.9467 110.68 68.2827 112.148 68.2827C113.144 68.2827 113.915 68.1956 114.463 68.0213C115.01 67.8471 115.483 67.648 115.882 67.424C116.354 67.1502 116.69 66.8889 116.89 66.64C117.114 66.3662 117.4 66.2293 117.748 66.2293C118.072 66.2293 118.308 66.3289 118.458 66.528C118.632 66.7022 118.719 66.9387 118.719 67.2373C118.719 67.6355 118.42 68.0836 117.823 68.5813C117.25 69.0542 116.454 69.4773 115.434 69.8507C114.413 70.1991 113.243 70.3733 111.924 70.3733C110.058 70.3733 108.415 69.9378 106.996 69.0667C105.602 68.1956 104.507 67.0133 103.711 65.52C102.939 64.0018 102.553 62.2969 102.553 60.4053C102.553 58.5884 102.952 56.9333 103.748 55.44C104.545 53.9466 105.652 52.752 107.071 51.8559C108.514 50.9351 110.182 50.4746 112.074 50.4746ZM121.764 50.9973H130.463C130.762 50.9973 131.011 51.1093 131.21 51.3333C131.409 51.5324 131.508 51.7813 131.508 52.0799C131.508 52.3537 131.409 52.5902 131.21 52.7893C131.011 52.9884 130.762 53.088 130.463 53.088H121.764C121.466 53.088 121.204 52.9884 120.98 52.7893C120.781 52.5653 120.682 52.3164 120.682 52.0426C120.682 51.7439 120.781 51.4951 120.98 51.2959C121.204 51.0968 121.466 50.9973 121.764 50.9973ZM125.61 45.7333C125.933 45.7333 126.195 45.8453 126.394 46.0693C126.618 46.2933 126.73 46.5546 126.73 46.8533V65.5947C126.73 66.2915 126.817 66.8142 126.991 67.1627C127.19 67.5111 127.439 67.7475 127.738 67.872C128.036 67.9715 128.335 68.0213 128.634 68.0213C128.833 68.0213 129.007 67.9964 129.156 67.9467C129.331 67.872 129.517 67.8347 129.716 67.8347C129.94 67.8347 130.127 67.9218 130.276 68.096C130.451 68.2702 130.538 68.4942 130.538 68.768C130.538 69.1164 130.339 69.4151 129.94 69.664C129.542 69.888 129.069 70 128.522 70C128.298 70 127.962 69.9876 127.514 69.9627C127.066 69.9129 126.605 69.776 126.132 69.552C125.66 69.3031 125.261 68.88 124.938 68.2827C124.639 67.6853 124.49 66.8267 124.49 65.7067V46.8533C124.49 46.5546 124.589 46.2933 124.788 46.0693C125.012 45.8453 125.286 45.7333 125.61 45.7333ZM157.429 43.8666C159.52 43.8666 161.15 44.439 162.32 45.5839C163.515 46.7039 164.112 48.2719 164.112 50.2879C164.112 51.3333 163.888 52.3288 163.44 53.2746C162.992 54.2204 162.332 54.992 161.461 55.5893C160.59 56.1617 159.507 56.4853 158.213 56.56L158.064 55.8133C158.985 55.8133 159.881 55.9502 160.752 56.224C161.648 56.4728 162.444 56.8835 163.141 57.456C163.838 58.0284 164.398 58.7502 164.821 59.6213C165.244 60.4675 165.456 61.5004 165.456 62.72C165.456 64.0142 165.232 65.1342 164.784 66.08C164.361 67.0009 163.776 67.7475 163.029 68.32C162.308 68.8924 161.474 69.3156 160.528 69.5893C159.582 69.8631 158.599 70 157.579 70H147.536C147.237 70 146.976 69.888 146.752 69.664C146.528 69.44 146.416 69.1787 146.416 68.88V44.9866C146.416 44.6879 146.528 44.4266 146.752 44.2026C146.976 43.9786 147.237 43.8666 147.536 43.8666H157.429ZM157.131 46.0693H148.357L148.805 45.3973V55.9626L148.395 55.4026H157.131C158.425 55.3777 159.507 54.9546 160.379 54.1333C161.275 53.312 161.723 52.0924 161.723 50.4746C161.723 49.1057 161.324 48.0355 160.528 47.2639C159.732 46.4675 158.599 46.0693 157.131 46.0693ZM157.392 57.6426H148.619L148.805 57.4186V68.1333L148.581 67.7973H157.467C159.059 67.7973 160.391 67.3991 161.461 66.6027C162.532 65.7813 163.067 64.4871 163.067 62.72C163.067 61.4755 162.805 60.48 162.283 59.7333C161.76 58.9866 161.063 58.4515 160.192 58.128C159.321 57.8044 158.387 57.6426 157.392 57.6426ZM185.816 50.9226C186.14 50.9226 186.401 51.0346 186.6 51.2586C186.824 51.4826 186.936 51.7564 186.936 52.0799V68.88C186.936 69.1787 186.824 69.44 186.6 69.664C186.376 69.888 186.115 70 185.816 70C185.493 70 185.219 69.888 184.995 69.664C184.796 69.44 184.696 69.1787 184.696 68.88V64.4373L185.331 64.1386C185.331 64.8355 185.132 65.5449 184.734 66.2667C184.36 66.9884 183.838 67.6604 183.166 68.2827C182.494 68.9049 181.697 69.4151 180.776 69.8133C179.88 70.1867 178.91 70.3733 177.864 70.3733C176.172 70.3733 174.654 69.9378 173.31 69.0667C171.991 68.1956 170.945 67.0009 170.174 65.4827C169.427 63.9644 169.054 62.2595 169.054 60.368C169.054 58.4266 169.439 56.7217 170.211 55.2533C170.983 53.76 172.028 52.5902 173.347 51.7439C174.666 50.8977 176.159 50.4746 177.827 50.4746C178.897 50.4746 179.893 50.6613 180.814 51.0346C181.759 51.4079 182.581 51.9182 183.278 52.5653C183.975 53.2124 184.51 53.9591 184.883 54.8053C185.281 55.6266 185.48 56.4853 185.48 57.3813L184.696 56.8213V52.0799C184.696 51.7564 184.796 51.4826 184.995 51.2586C185.219 51.0346 185.493 50.9226 185.816 50.9226ZM178.051 68.2827C179.37 68.2827 180.54 67.9467 181.56 67.2747C182.581 66.5778 183.377 65.632 183.95 64.4373C184.547 63.2178 184.846 61.8613 184.846 60.368C184.846 58.8995 184.547 57.5804 183.95 56.4106C183.377 55.2408 182.581 54.3075 181.56 53.6106C180.54 52.9137 179.37 52.5653 178.051 52.5653C176.757 52.5653 175.587 52.9013 174.542 53.5733C173.521 54.2453 172.712 55.1662 172.115 56.336C171.543 57.5057 171.256 58.8497 171.256 60.368C171.256 61.8613 171.543 63.2178 172.115 64.4373C172.712 65.632 173.521 66.5778 174.542 67.2747C175.562 67.9467 176.732 68.2827 178.051 68.2827ZM191.732 66.976C191.533 66.6773 191.433 66.3911 191.433 66.1173C191.458 65.8187 191.62 65.5822 191.918 65.408C192.117 65.2338 192.341 65.1591 192.59 65.184C192.864 65.2089 193.113 65.3333 193.337 65.5573C194.009 66.4284 194.818 67.1378 195.764 67.6853C196.734 68.208 197.879 68.4693 199.198 68.4693C199.895 68.4693 200.58 68.3573 201.252 68.1333C201.949 67.8844 202.521 67.5235 202.969 67.0507C203.417 66.5529 203.641 65.9307 203.641 65.184C203.641 64.4124 203.417 63.7902 202.969 63.3173C202.521 62.8444 201.936 62.4711 201.214 62.1973C200.518 61.9235 199.771 61.6871 198.974 61.488C198.128 61.264 197.307 61.0151 196.51 60.7413C195.714 60.4426 195.005 60.0817 194.382 59.6586C193.785 59.2106 193.3 58.6755 192.926 58.0533C192.553 57.4311 192.366 56.672 192.366 55.776C192.366 54.7306 192.653 53.8097 193.225 53.0133C193.797 52.2168 194.569 51.5946 195.54 51.1466C196.535 50.6986 197.655 50.4746 198.9 50.4746C199.522 50.4746 200.194 50.5617 200.916 50.7359C201.638 50.8853 202.347 51.1466 203.044 51.5199C203.741 51.8933 204.363 52.4035 204.91 53.0506C205.134 53.2746 205.246 53.536 205.246 53.8346C205.246 54.1084 205.122 54.3573 204.873 54.5813C204.674 54.7306 204.438 54.8053 204.164 54.8053C203.915 54.8053 203.703 54.7057 203.529 54.5066C202.932 53.8346 202.222 53.3244 201.401 52.976C200.58 52.6275 199.696 52.4533 198.75 52.4533C198.029 52.4533 197.344 52.5777 196.697 52.8266C196.075 53.0506 195.552 53.3991 195.129 53.872C194.706 54.3448 194.494 54.9671 194.494 55.7386C194.544 56.4604 194.793 57.0453 195.241 57.4933C195.714 57.9413 196.324 58.3146 197.07 58.6133C197.842 58.912 198.701 59.1857 199.646 59.4346C200.443 59.6337 201.202 59.8702 201.924 60.144C202.67 60.4178 203.318 60.7662 203.865 61.1893C204.438 61.5875 204.886 62.0978 205.209 62.72C205.558 63.3422 205.732 64.1262 205.732 65.072C205.732 66.1671 205.421 67.1129 204.798 67.9093C204.201 68.7058 203.392 69.3156 202.372 69.7387C201.351 70.1618 200.219 70.3733 198.974 70.3733C197.63 70.3733 196.324 70.112 195.054 69.5893C193.81 69.0667 192.702 68.1956 191.732 66.976ZM212.48 68.88C212.48 69.1787 212.368 69.44 212.144 69.664C211.92 69.888 211.658 70 211.36 70C211.036 70 210.762 69.888 210.538 69.664C210.339 69.44 210.24 69.1787 210.24 68.88V51.7066C210.24 51.4079 210.339 51.1466 210.538 50.9226C210.762 50.6986 211.036 50.5866 211.36 50.5866C211.683 50.5866 211.945 50.6986 212.144 50.9226C212.368 51.1466 212.48 51.4079 212.48 51.7066V68.88ZM211.36 48.0853C210.837 48.0853 210.439 47.9733 210.165 47.7493C209.916 47.5004 209.792 47.1519 209.792 46.7039V46.3306C209.792 45.8826 209.929 45.5466 210.202 45.3226C210.501 45.0737 210.899 44.9493 211.397 44.9493C211.87 44.9493 212.231 45.0737 212.48 45.3226C212.754 45.5466 212.89 45.8826 212.89 46.3306V46.7039C212.89 47.1519 212.754 47.5004 212.48 47.7493C212.231 47.9733 211.858 48.0853 211.36 48.0853ZM226.699 50.4746C227.894 50.4746 228.989 50.6115 229.984 50.8853C230.98 51.1342 231.776 51.4826 232.374 51.9306C232.996 52.3786 233.307 52.864 233.307 53.3866C233.307 53.6355 233.22 53.8844 233.046 54.1333C232.871 54.3573 232.635 54.4693 232.336 54.4693C232.038 54.4693 231.789 54.3946 231.59 54.2453C231.415 54.096 231.229 53.9217 231.03 53.7226C230.855 53.5235 230.594 53.3368 230.246 53.1626C229.922 53.0133 229.462 52.8764 228.864 52.752C228.267 52.6275 227.582 52.5653 226.811 52.5653C225.417 52.5653 224.16 52.9137 223.04 53.6106C221.92 54.3075 221.037 55.2533 220.389 56.448C219.742 57.6177 219.419 58.9369 219.419 60.4053C219.419 61.8986 219.73 63.2426 220.352 64.4373C220.974 65.632 221.833 66.5778 222.928 67.2747C224.023 67.9467 225.305 68.2827 226.774 68.2827C227.769 68.2827 228.541 68.1956 229.088 68.0213C229.636 67.8471 230.109 67.648 230.507 67.424C230.98 67.1502 231.316 66.8889 231.515 66.64C231.739 66.3662 232.025 66.2293 232.374 66.2293C232.697 66.2293 232.934 66.3289 233.083 66.528C233.257 66.7022 233.344 66.9387 233.344 67.2373C233.344 67.6355 233.046 68.0836 232.448 68.5813C231.876 69.0542 231.079 69.4773 230.059 69.8507C229.038 70.1991 227.869 70.3733 226.55 70.3733C224.683 70.3733 223.04 69.9378 221.621 69.0667C220.228 68.1956 219.133 67.0133 218.336 65.52C217.565 64.0018 217.179 62.2969 217.179 60.4053C217.179 58.5884 217.577 56.9333 218.373 55.44C219.17 53.9466 220.277 52.752 221.696 51.8559C223.14 50.9351 224.807 50.4746 226.699 50.4746ZM236.539 66.976C236.34 66.6773 236.24 66.3911 236.24 66.1173C236.265 65.8187 236.427 65.5822 236.726 65.408C236.925 65.2338 237.149 65.1591 237.398 65.184C237.672 65.2089 237.92 65.3333 238.144 65.5573C238.816 66.4284 239.625 67.1378 240.571 67.6853C241.542 68.208 242.687 68.4693 244.006 68.4693C244.703 68.4693 245.387 68.3573 246.059 68.1333C246.756 67.8844 247.328 67.5235 247.776 67.0507C248.224 66.5529 248.448 65.9307 248.448 65.184C248.448 64.4124 248.224 63.7902 247.776 63.3173C247.328 62.8444 246.744 62.4711 246.022 62.1973C245.325 61.9235 244.578 61.6871 243.782 61.488C242.936 61.264 242.114 61.0151 241.318 60.7413C240.521 60.4426 239.812 60.0817 239.19 59.6586C238.592 59.2106 238.107 58.6755 237.734 58.0533C237.36 57.4311 237.174 56.672 237.174 55.776C237.174 54.7306 237.46 53.8097 238.032 53.0133C238.605 52.2168 239.376 51.5946 240.347 51.1466C241.343 50.6986 242.463 50.4746 243.707 50.4746C244.329 50.4746 245.001 50.5617 245.723 50.7359C246.445 50.8853 247.154 51.1466 247.851 51.5199C248.548 51.8933 249.17 52.4035 249.718 53.0506C249.942 53.2746 250.054 53.536 250.054 53.8346C250.054 54.1084 249.929 54.3573 249.68 54.5813C249.481 54.7306 249.245 54.8053 248.971 54.8053C248.722 54.8053 248.511 54.7057 248.336 54.5066C247.739 53.8346 247.03 53.3244 246.208 52.976C245.387 52.6275 244.504 52.4533 243.558 52.4533C242.836 52.4533 242.152 52.5777 241.504 52.8266C240.882 53.0506 240.36 53.3991 239.936 53.872C239.513 54.3448 239.302 54.9671 239.302 55.7386C239.352 56.4604 239.6 57.0453 240.048 57.4933C240.521 57.9413 241.131 58.3146 241.878 58.6133C242.649 58.912 243.508 59.1857 244.454 59.4346C245.25 59.6337 246.009 59.8702 246.731 60.144C247.478 60.4178 248.125 60.7662 248.672 61.1893C249.245 61.5875 249.693 62.0978 250.016 62.72C250.365 63.3422 250.539 64.1262 250.539 65.072C250.539 66.1671 250.228 67.1129 249.606 67.9093C249.008 68.7058 248.2 69.3156 247.179 69.7387C246.159 70.1618 245.026 70.3733 243.782 70.3733C242.438 70.3733 241.131 70.112 239.862 69.5893C238.617 69.0667 237.51 68.1956 236.539 66.976Z" fill="#8C8990"/>
<rect x="32" y="119" width="190" height="8" rx="4" fill="#FF0000"/>
<rect x="233" y="119" width="100" height="8" rx="4" fill="#FFB81F"/>
<rect x="32" y="138" width="100" height="8" rx="4" fill="#424044"/>
<rect x="143" y="138" width="48" height="8" rx="4" fill="#1D90F5"/>
<rect x="202" y="138" width="100" height="8" rx="4" fill="#424044"/>
<rect x="48" y="194" width="72" height="8" rx="4" fill="#FFB81F"/>
<rect x="131" y="194" width="100" height="8" rx="4" fill="#05FD00"/>
<rect x="80" y="213" width="100" height="8" rx="4" fill="#FF0000"/>
<rect x="191" y="213" width="48" height="8" rx="4" fill="#424044"/>
<rect x="250" y="213" width="100" height="8" rx="4" fill="#1D90F5"/>
<rect x="112" y="232" width="48" height="8" rx="4" fill="#424044"/>
<rect x="171" y="232" width="48" height="8" rx="4" fill="#FFB81F"/>
<rect x="230" y="232" width="100" height="8" rx="4" fill="#424044"/>
<rect x="80" y="251" width="100" height="8" rx="4" fill="#05FD00"/>
<rect x="191" y="251" width="48" height="8" rx="4" fill="#424044"/>
<rect x="80" y="270" width="64" height="8" rx="4" fill="#424044"/>
<rect x="155" y="270" width="100" height="8" rx="4" fill="#1D90F5"/>
<rect x="80" y="289" width="64" height="8" rx="4" fill="#FF0000"/>
<rect x="155" y="289" width="12" height="8" rx="4" fill="#424044"/>
<rect x="178" y="289" width="100" height="8" rx="4" fill="#FF0000"/>
<rect x="48" y="308" width="32" height="8" rx="4" fill="#424044"/>
<rect x="91" y="308" width="48" height="8" rx="4" fill="#FFB81F"/>
<rect x="150" y="308" width="100" height="8" rx="4" fill="#424044"/>
<path d="M388.5 193.134C389.167 193.519 389.167 194.481 388.5 194.866L379.5 200.062C378.833 200.447 378 199.966 378 199.196V188.804C378 188.034 378.833 187.553 379.5 187.938L388.5 193.134Z" fill="#424044"/>
<rect x="398" y="186" width="4" height="138" rx="2" fill="#424044"/>
<rect x="442" y="236" width="32" height="72" rx="8" fill="#68EA48"/>
<rect x="485" y="208" width="32" height="100" rx="8" fill="#1B69DD"/>
<rect x="528" y="276" width="32" height="32" rx="8" fill="#F67329"/>
<rect x="32" y="364" width="190" height="8" rx="4" fill="#05FD00"/>
<rect x="233" y="364" width="100" height="8" rx="4" fill="#1D90F5"/>
<rect x="32" y="383" width="100" height="8" rx="4" fill="#424044"/>
<rect x="143" y="383" width="48" height="8" rx="4" fill="#FFB81F"/>
<rect x="202" y="383" width="100" height="8" rx="4" fill="#424044"/>
<rect x="32" y="402" width="100" height="8" rx="4" fill="#FF0000"/>
<rect x="143" y="402" width="100" height="8" rx="4" fill="#1D90F5"/>
<rect x="32" y="421" width="64" height="8" rx="4" fill="#424044"/>
<rect x="107" y="421" width="48" height="8" rx="4" fill="#05FD00"/>
<rect x="166" y="421" width="100" height="8" rx="4" fill="#424044"/>
<rect x="1" y="1" width="694" height="475" rx="31" stroke="#2F2F32" stroke-width="2"/>
</svg>
