<svg width="24" height="18" viewBox="0 0 24 18" fill="none" xmlns="http://www.w3.org/2000/svg">
<line x1="1" y1="1" x2="23" y2="1" stroke="#DEDEDE" stroke-width="2" stroke-linecap="round"/>
<line x1="1" y1="7" x2="23" y2="7" stroke="#DEDEDE" stroke-width="2" stroke-linecap="round"/>
<line x1="1" y1="13" x2="23" y2="13" stroke="#DEDEDE" stroke-width="2" stroke-linecap="round"/>
</svg>
