@startuml architecture

!include ./styles.plantuml
!include C4_Component.puml
!include <awslib/AWSCommon>
!include <awslib/Compute/AppRunner>
!include <awslib/Database/All>
!include <awslib/FrontEndWebMobile/All>
!include <awslib/General/Internet>
!include <awslib/General/Users>
!include <awslib/NetworkingContentDelivery/VPCRouter>
!include <awslib/Storage/All>

HIDE_STEREOTYPE()

title App Architecture

Boundary(proxy_server, "Cheap server with public IP") {
	VPCRouter(proxy, "Reverse Proxy", "NGINX")
}

Boundary(rpi, "Raspberry PI") {
	FrontEndWebMobile(app, "Main Web App", "React & TypeScript", "Serves as the main entry point to the app. This is where the courses are located.")
	FrontEndWebMobile(cms, "Content Management System", "SolidJS & TypeScript", "Used by administrators to add end edit the app's content")

	Boundary(api, "Infrastructure") {
		AppRunner(backend, "Back end", "Rust")

		Database(postgres, "Main database", "Postgres", "Stores most of the app's persistent data")
		SimpleStorageService(minio, "Object Storage", "MinIO", "Stores user-uploaded files")
		Users(kratos, "Auth service", "Ory Kratos", "Manages everything related to users: Keeping track of accounts, sign-in and sign-up flows, authentication tokens, CSRF tokens, etc.")

		Rel(app, backend, "Uses", "RPC")
		Rel(cms, backend, "Uses", "RPC")

		Rel(backend, postgres, "Reads/Writes")
		Rel(backend, minio, "Stores files")
		Rel(backend, kratos, "Authenticates users")
	}
}

Rel(proxy, app, "Routes to")
Rel(proxy, cms, "Routes to")

@enduml
