{
    "trigger": [
        {
            "name": "test-app2-server-mqtt",
            "enable": true,
            "testFile": "../test/test_app2-s1-server.csv",
            "startTime": "2019-05-21T21:35:00",
            "outputDirectory": "/home/chris/project/fh/ba/test/"
        } 
    ], 
    "controller": [
        {
            "name": "controller-mqtt",
            "trigger": "test-app2-server-mqtt",
            "type": "svr-controller",
            "dataPacker" : ["json"],
            "referenceList": "../test/reference-list.csv"
        }
    ],
    "driver": [
        {
            "name": "driver-mqtt",
            "controller": ["controller-mqtt"],
            "type": "srv-mqtt-json",
            "host": "192.168.110.134",
            "port": 1883,
            "groupId": "group1",
            "deviceId": "jskl3452uzks",
            "keepalive": 5000,
            "persistent": false,
            "clientId": "4ssafa4qawfsa",
            "password": "abcpw342",
            "useSSL": false,
            "data": {
                "publish": {
                    "qos": 1,
                    "retain": false
                }
            },
            "notify": {
                "publish": {
                    "qos": 1,
                    "retain": false
                }
            },
            "config": {
                "subscribe": {
                    "qos": 1,
                    "retain": false
                },
                "publish": {
                    "qos": 1,
                    "retain": false
                }
            },
            "method": {
                "subscribe": {
                    "qos": 2,
                    "retain": false
                },
                "publish": {
                    "qos": 1,
                    "retain": false
                }
            },
            "publish": {
                "qos": 0,
                "retain": false
            },
            "subscribe": {
                "qos": 0,
                "retain": false
            }
        },
        {
            "name": "driver-mqtt-tls",
            "controller": [],
            "type": "srv-mqtt-json",
            "host": "192.168.110.134",
            "port": 8883,
            "groupId": "group1",
            "deviceId": "jskl3452uzks",
            "keepalive": 5000,
            "persistent": false,
            "clientId": "4ssafa4qawfsa",
            "password": "abcpw342",
            "useSSL": true,
            "caFile": "/home/chris/project/fh/ba/iot-client/cert/ca.crt",
            "data": {
                "publish": {
                    "qos": 1,
                    "retain": false
                }
            },
            "notify": {
                "publish": {
                    "qos": 1,
                    "retain": false
                }
            },
            "config": {
                "subscribe": {
                    "qos": 1,
                    "retain": false
                },
                "publish": {
                    "qos": 1,
                    "retain": false
                }
            },
            "method": {
                "subscribe": {
                    "qos": 2,
                    "retain": false
                },
                "publish": {
                    "qos": 1,
                    "retain": false
                }
            },
            "publish": {
                "qos": 0,
                "retain": false
            },
            "subscribe": {
                "qos": 0,
                "retain": false
            }
        }
    ],
    "recorder": [
        {
            "name": "recorder-mqtt",
            "controller": "controller-mqtt",
            "type": "quantity-recorder",
            "filePath": "/home/chris/project/fh/ba/report"
        }
    ],
    "logger": {
        "loglevel": "debug"
    }
}