{
    "trigger": [
        {
            "name": "test-app2-server-coap",
            "enable": true,
            "testFile": "../test/test_app2-s1-server.csv",
            "startTime": "2019-05-21T21:26:00",
            "outputDirectory": "/home/chris/project/fh/ba/test/"
        }
    ],
    "controller": [
        {
            "name": "controller-coap",
            "trigger": "test-app2-server-coap",
            "type": "svr-controller",
            "dataPacker" : ["value-timestamp", "cbor", {"type": "zip", "enable": true, "always": true }],
            "referenceList": "../test/reference-list.csv"
        }
    ],
    "driver": [
        {
            "name": "driver-coap-srv",
            "controller": ["controller-coap"],
            "type": "srv-coap",
            "host": "192.168.110.134",
            "port": 5683,
            "groupId": "group1",
            "deviceId": "jskl3452uzks",
            "password": "aw342tgs"
        },
        {
            "name": "driver-coap-clt",
            "controller": ["controller-coap"],
            "type": "clt-coap",
            "host": "192.168.110.133",
            "port": 5683,
            "groupId": "group1",
            "deviceId": "jskl3452uzks",
            "password": "aw342tgs"
        }
    ],
    "recorder": [
        {
            "name": "recorder-coap",
            "controller": "controller-coap",
            "type": "quantity-recorder",
            "filePath": "/home/chris/project/fh/ba/report"
        }
    ],
    "logger": {
        "loglevel": "debug"
    }
}