{
    "trigger": [
        {
            "name": "test-app1-server",
            "enable": true,
            "testFile": "/home/chris/project/fh/ba/test/test_app1-server.csv",
            "startTime": "2019-05-10T23:16:00",
            "outputDirectory": "/home/chris/project/fh/ba/test/"
        } 
    ],
    "controller": [
        {
            "name": "controller-1",
            "trigger": [],
            "type": "svr-controller",
            "dataPacker" : "cbor"
        },
        {
            "name": "controller-mqtt-sn",
            "trigger": "test-app1-server",
            "type": "svr-controller",
            "dataPacker" : ["timestamp", "cbor", "zip"]
        }
    ],
    "driver": [
        {
            "name": "driver-mqtt",
            "controller": ["controller-mqtt-sn"],
            "type": "srv-mqtt-json",
            "host": "192.168.110.134",
            "port": 1883,
            "groupId": "group1",
            "deviceId": "jskl3452uzks",
            "keepalive": 5000,
            "persistent": false,
            "clientId": "4ssafa4qawfsa",
            "password": "abcpw342",
            "useSSL": false,
            "caFile": "/home/chris/project/fh/ba/iot-client/cert/ca.crt",
            "data": {
                "publish": {
                    "qos": 1,
                    "retain": false
                }
            },
            "notify": {
                "publish": {
                    "qos": 1,
                    "retain": false
                }
            },
            "config": {
                "subscribe": {
                    "qos": 2,
                    "retain": false
                },
                "publish": {
                    "qos": 1,
                    "retain": false
                }
            },
            "method": {
                "subscribe": {
                    "qos": 2,
                    "retain": false
                },
                "publish": {
                    "qos": 1,
                    "retain": false
                }
            },
            "publish": {
                "qos": 0,
                "retain": false
            },
            "subscribe": {
                "qos": 0,
                "retain": false
            }
        },
        {
            "name": "driver-mqtt-tls",
            "controller": [],
            "type": "srv-mqtt-json",
            "host": "192.168.110.134",
            "port": 8883,
            "groupId": "group1",
            "deviceId": "jskl3452uzks",
            "keepalive": 5000,
            "persistent": false,
            "clientId": "4ssafa4qawfsa",
            "password": "abcpw342",
            "useSSL": true,
            "caFile": "/home/chris/project/fh/ba/iot-client/cert/ca.crt",
            "data": {
                "publish": {
                    "qos": 1,
                    "retain": false
                }
            },
            "notify": {
                "publish": {
                    "qos": 1,
                    "retain": false
                }
            },
            "config": {
                "subscribe": {
                    "qos": 2,
                    "retain": false
                },
                "publish": {
                    "qos": 1,
                    "retain": false
                }
            },
            "method": {
                "subscribe": {
                    "qos": 2,
                    "retain": false
                },
                "publish": {
                    "qos": 1,
                    "retain": false
                }
            },
            "publish": {
                "qos": 0,
                "retain": false
            },
            "subscribe": {
                "qos": 0,
                "retain": false
            }
        },
        {
            "name": "driver-coap-srv",
            "controller": [],
            "type": "srv-coap",
            "host": "192.168.110.134",
            "port": 5683,
            "groupId": "group1",
            "deviceId": "jskl3452uzks",
            "password": "aw342tgs"
        },
        {
            "name": "driver-coap-clt",
            "controller": [],
            "type": "clt-coap",
            "host": "192.168.110.133",
            "port": 5683,
            "groupId": "group1",
            "deviceId": "jskl3452uzks",
            "password": "aw342tgs"
        },
        {
            "name": "driver-coaps-srv",
            "controller": [],
            "type": "srv-coap",
            "host": "localhost",
            "port": 5683,
            "groupId": "group1",
            "deviceId": "jskl3452uzks",
            "password": "aw342tgs"
        },
        {
            "name": "driver-coaps-clt",
            "controller": [],
            "type": "clt-coap",
            "host": "localhost",
            "port": 5687,
            "groupId": "group1",
            "deviceId": "jskl3452uzks",
            "password": "aw342tgs"
        }, 
        {
            "name": "driver-mqtt-sn-gw",
            "controller": [],
            "type": "mqtt-sn-gw",
            "port": 1884,
            "useSSL": true,
            "dtlsKeyFile": "/home/chris/project/fh/ba/iot-client/cert/dtls/cert.key",
            "dtlsCertFile": "/home/chris/project/fh/ba/iot-client/cert/dtls/cert.crt",
            "brokerUrl": "mqtt://localhost:1883"
        }
    ],
    "recorder": [
        {
            "name": "rec-wire",
            "controller": [],
            "type": "wireshark",
            "filePath": "/home/chris/project/fh/ba/report",
            "interface": "ens33",
            "serverIP": "192.168.110.134",
            "myIP": "192.168.110.134"
        },
        {
            "name": "recorder-2",
            "controller": "controller-1",
            "type": "quantity-recorder",
            "filePath": "/home/chris/project/fh/ba/report"
        },
        {
            "name": "recorder-mqtt-sn",
            "controller": "controller-mqtt-sn",
            "type": "quantity-recorder",
            "filePath": "/home/chris/project/fh/ba/report"
        }
    ],
    "logger": {
        "loglevel": "debug"
    }
}