{
    "trigger": [
        {
            "name": "test-app1-client-mqtt-sn",
            "enable": true,
            "testFile": "/home/chris/project/fh/test/test_app1-s1-client.csv",
            "startTime": "2019-05-22T08:58:00",
            "outputDirectory": "/home/chris/project/fh/test/"
        }
    ],  
    "controller": [ 
        {
            "name": "controller-mqtt-sn",
            "trigger": ["test-app1-client-mqtt-sn"],
            "type": "dev-controller",
            "dataPacker" : ["value-timestamp", "cbor", {"type": "zip", "enable": true, "always": true }],
            "dataCollector": {
                "enable": true,
                "maximum": 32
            },
            "referenceList": "/home/chris/project/fh/test/reference-list.csv"
        }  
    ],
    "driver": [
        {
            "name": "driver-mqtt-sn",
            "controller": ["controller-mqtt-sn"],
            "type": "mqtt-sn-device",
            "gwAddress": "192.168.110.134",
            "gwPort": 1884,
            "listenPort": 1884,
            "useSSL": false,
            "groupId": "group1",
            "deviceId": "jskl3452uzks",
            "keepalive": 5000,
            "persistent": false,
            "saveTopics": false,
            "clientId": "jskl3452uzks",
            "will": {
                "topic":"jskl3452uzks/state/connect"
            },
            "data": {
                "publish": {
                    "qos": 1,
                    "retain": false
                }
            },
            "notify": {
                "publish": {
                    "qos": 1,
                    "retain": false
                }
            },
            "config": {
                "subscribe": {
                    "qos": 1,
                    "retain": false
                },
                "publish": {
                    "qos": 1,
                    "retain": false
                }
            },
            "method": {
                "subscribe": {
                    "qos": 2,
                    "retain": false
                },
                "publish": {
                    "qos": 1,
                    "retain": false
                }
            },
            "publish": {
                "qos": 1,
                "retain": true
            },
            "subscribe": {
                "qos": 0,
                "retain": false
            }
        },
        {
            "name": "driver-mqtt-sn-dtls",
            "controller": [],
            "type": "mqtt-sn-device",
            "gwAddress": "127.0.0.1",
            "gwPort": 8884,
            "listenPort": 1884,
            "useSSL": true,
            "certFile": "/home/chris/project/fh/ba-client/cert/dtls/cert.crt",
            "privateKeyFile": "/home/chris/project/fh/ba-client/cert/dtls/cert.key",
            "groupId": "group1",
            "deviceId": "jskl3452uzks",
            "keepalive": 5000,
            "persistent": false,
            "saveTopics": false,
            "clientId": "jskl3452uzks",
            "will": {
                "topic":"jskl3452uzks/state/connect"
            },
            "data": {
                "publish": {
                    "qos": 1,
                    "retain": false
                }
            },
            "notify": {
                "publish": {
                    "qos": 1,
                    "retain": false
                }
            },
            "config": {
                "subscribe": {
                    "qos": 1,
                    "retain": false
                },
                "publish": {
                    "qos": 1,
                    "retain": false
                }
            },
            "method": {
                "subscribe": {
                    "qos": 2,
                    "retain": false
                },
                "publish": {
                    "qos": 1,
                    "retain": false
                }
            },
            "publish": {
                "qos": 1,
                "retain": true
            },
            "subscribe": {
                "qos": 0,
                "retain": false
            }
        }
    ],
    "recorder": [
        {
            "name": "rec-wire",
            "controller": ["controller-mqtt-sn"],
            "type": "wireshark",
            "filePath": "/home/chris/project/fh/report",
            "interface": "ens33",
            "serverIP": "192.168.110.134",
            "myIP": "192.168.110.133"
        },
        {
            "name": "recorder-2",
            "controller": ["controller-mqtt-sn"],
            "type": "quantity-recorder",
            "filePath": "/home/chris/project/fh/report"
        }
    ],
    "logger": {
        "loglevel": "debug"
    }

}