%YAML 1.1
%TAG !u! tag:unity3d.com,2011:
--- !u!114 &11400000
MonoBehaviour:
  m_ObjectHideFlags: 0
  m_CorrespondingSourceObject: {fileID: 0}
  m_PrefabInstance: {fileID: 0}
  m_PrefabAsset: {fileID: 0}
  m_GameObject: {fileID: 0}
  m_Enabled: 1
  m_EditorHideFlags: 0
  m_Script: {fileID: 11500000, guid: 0cb4e07232dd44f789a1a03cf5d48ca4, type: 3}
  m_Name: TestScene_1_ActivityConfig2
  m_EditorClassIdentifier: 
  <Id>k__BackingField: ActivityConfig_819840d3-f131-485d-b8da-5ff878a20526
  _taskSequence:
    _nodes:
    - _config: {fileID: 11400000, guid: 566b14f518747bb4aac8c7f755a3ef4a, type: 2}
