%YAML 1.1
%TAG !u! tag:unity3d.com,2011:
--- !u!221 &22100000
AnimatorOverrideController:
  m_ObjectHideFlags: 0
  m_CorrespondingSourceObject: {fileID: 0}
  m_PrefabInstance: {fileID: 0}
  m_PrefabAsset: {fileID: 0}
  m_Name: ZombieSpittingAnimator
  m_Controller: {fileID: 9100000, guid: 76abe7af1517f6342bb75fa3365a59a8, type: 2}
  m_Clips:
  - m_OriginalClip: {fileID: -310949540564020661, guid: e6e985811ff05394b81173f3f8112624, type: 3}
    m_OverrideClip: {fileID: 7400000, guid: cabf240263727d4419ab9405f6dc5dda, type: 2}
  - m_OriginalClip: {fileID: 4252389541269213003, guid: e6e985811ff05394b81173f3f8112624, type: 3}
    m_OverrideClip: {fileID: 7400000, guid: 1dc6cf694c23d6141b554246ead559d6, type: 2}
  - m_OriginalClip: {fileID: 2645761746825683943, guid: e6e985811ff05394b81173f3f8112624, type: 3}
    m_OverrideClip: {fileID: 7400000, guid: 1dc6cf694c23d6141b554246ead559d6, type: 2}
  - m_OriginalClip: {fileID: -4018235431919141024, guid: e6e985811ff05394b81173f3f8112624, type: 3}
    m_OverrideClip: {fileID: 7400000, guid: ea940826972102946914096db2442496, type: 2}
  - m_OriginalClip: {fileID: 1579887664227891798, guid: e6e985811ff05394b81173f3f8112624, type: 3}
    m_OverrideClip: {fileID: 7400000, guid: 1451eb14a0e837f4bb24ba2377d7cf52, type: 2}
  - m_OriginalClip: {fileID: 7400000, guid: 796ffef7f1072704dbf2d4b399343311, type: 2}
    m_OverrideClip: {fileID: 7400000, guid: 7d1934617f930f847bf1c5e50cba7537, type: 2}
  - m_OriginalClip: {fileID: 7400000, guid: 0bd0aefb51d90574fb9c690624a12685, type: 2}
    m_OverrideClip: {fileID: 7400000, guid: 2975757cc7e1a5a4fa7fc628a02ef75f, type: 2}
  - m_OriginalClip: {fileID: 7400000, guid: 2171aaa684f985548936f68ea16644b4, type: 2}
    m_OverrideClip: {fileID: 7400000, guid: cabf240263727d4419ab9405f6dc5dda, type: 2}
  - m_OriginalClip: {fileID: 7400000, guid: b0daf3e64ac14ca42986be6a79672864, type: 2}
    m_OverrideClip: {fileID: 7400000, guid: cabf240263727d4419ab9405f6dc5dda, type: 2}
  - m_OriginalClip: {fileID: 7400000, guid: 96cff8dc0af42ea45bf06f0ff490c44c, type: 2}
    m_OverrideClip: {fileID: 7400000, guid: cabf240263727d4419ab9405f6dc5dda, type: 2}
