%YAML 1.1
%TAG !u! tag:unity3d.com,2011:
--- !u!114 &11400000
MonoBehaviour:
  m_ObjectHideFlags: 0
  m_CorrespondingSourceObject: {fileID: 0}
  m_PrefabInstance: {fileID: 0}
  m_PrefabAsset: {fileID: 0}
  m_GameObject: {fileID: 0}
  m_Enabled: 1
  m_EditorHideFlags: 0
  m_Script: {fileID: 11500000, guid: 2d15bd14b0e443cb99b7ad599c07bd9c, type: 3}
  m_Name: Suburb1_Arena1_FinishOffActivityConfig
  m_EditorClassIdentifier: 
  <Id>k__BackingField: FinishOffActivityConfig_aaf2270f-ba5e-430a-b557-4a43583cac07
