%YAML 1.1
%TAG !u! tag:unity3d.com,2011:
--- !u!114 &11400000
MonoBehaviour:
  m_ObjectHideFlags: 0
  m_CorrespondingSourceObject: {fileID: 0}
  m_PrefabInstance: {fileID: 0}
  m_PrefabAsset: {fileID: 0}
  m_GameObject: {fileID: 0}
  m_Enabled: 1
  m_EditorHideFlags: 0
  m_Script: {fileID: 11500000, guid: 66c857b9dd0f4ca49505eef26ae616a9, type: 3}
  m_Name: ZombieGirl 1Config
  m_EditorClassIdentifier: 
  <Id>k__BackingField: bot_zombie_girl
  <Name>k__BackingField: 
  <Sprite>k__BackingField: {fileID: 0}
  <Class>k__BackingField: 0
  <RoleIcon>k__BackingField: {fileID: 0}
  <GoldRoleIcon>k__BackingField: {fileID: 0}
  <IsBoss>k__BackingField: 0
  <View>k__BackingField: {fileID: 1655015890418872360, guid: 5fcb36bb5f9e07f4780b4ce2b4e7eb21, type: 3}
  <ViewConfig>k__BackingField: {fileID: 1068684761356309, guid: e7812d775c860694180216960c58ff8d, type: 3}
  <ClientModule>k__BackingField: {fileID: 0}
  <ServerModule>k__BackingField: {fileID: 0}
  <UnitAIConfig>k__BackingField: {fileID: 11400000, guid: 8307d6b7b74fbee45a8c1a7f75144498, type: 2}
  <UnitPhaseConfig>k__BackingField: {fileID: 0}
  <Phase>k__BackingField: 1
  <UnitActionRoster>k__BackingField: {fileID: 11400000, guid: 147aa4318782370469f75b1c817bd6a9, type: 2}
  <UpgradeTable>k__BackingField: {fileID: 11400000, guid: 7d7ccd6edaf397346a06f5bd721c8614, type: 2}
  <BodyMass>k__BackingField: 80
  _damageMultipliers: []
  <DeathRewards>k__BackingField:
    <Exp>k__BackingField: 200
    <EnergyCapsule>k__BackingField:
      <Energy>k__BackingField: 6
      <DropChance>k__BackingField: 10
      <MaxRandomPositionOffset>k__BackingField: 0.7
    _lootSet: {fileID: 11400000, guid: 942ab4a199e4a3d4fb4150065849b686, type: 2}
  <DefaultWeapon>k__BackingField: {fileID: 0}
  <DefaultMeleeWeapon>k__BackingField: {fileID: 11400000, guid: a9a505e4940bc8249a6b2574b78cf77d, type: 2}
  <GearScore>k__BackingField: 10
  <Health>k__BackingField: 180
  <Stamina>k__BackingField: 0
  <Energy>k__BackingField: 0
  <Speed>k__BackingField: 2.5
  <TurnSpeed>k__BackingField: 500
  <HpAutoRecovery>k__BackingField:
    <PercentPerSecond>k__BackingField: 0
    <DamageCooldown>k__BackingField: 0
  <EnergyAutoRecovery>k__BackingField:
    <Speed>k__BackingField: 0
  <StaminaAutoRecovery>k__BackingField:
    <Speed>k__BackingField: 0
  <Impacts>k__BackingField:
    _death:
      _config: {fileID: 0}
      _delayVariant: 0
      _delay: 0
      _cooldown: 0
    _ultimate:
      _config: {fileID: 0}
      _delayVariant: 0
      _delay: 0
      _cooldown: 0
    _ability:
      _config: {fileID: 0}
      _delayVariant: 0
      _delay: 0
      _cooldown: 0
    _extraAbility:
      _config: {fileID: 0}
      _delayVariant: 0
      _delay: 0
      _cooldown: 0
    _special:
      _config: {fileID: 0}
      _delayVariant: 0
      _delay: 0
      _cooldown: 0
