%YAML 1.1
%TAG !u! tag:unity3d.com,2011:
--- !u!114 &11400000
MonoBehaviour:
  m_ObjectHideFlags: 0
  m_CorrespondingSourceObject: {fileID: 0}
  m_PrefabInstance: {fileID: 0}
  m_PrefabAsset: {fileID: 0}
  m_GameObject: {fileID: 0}
  m_Enabled: 1
  m_EditorHideFlags: 0
  m_Script: {fileID: 11500000, guid: 1a3b1958c06449609e68d9f83a3fe89c, type: 3}
  m_Name: Arena_1_Wave_3
  m_EditorClassIdentifier: 
  <Id>k__BackingField: BotSpawnerConfig_d152219f-ffbf-409b-bd2e-dd6d24103018
  _isEndless: 0
  _unlimitedUnits: 1
  _maxUnitsInFrame: 0
  _delay: 0
  _autoUnspawnBots: 0
  _waves:
  - _delay: 2
    _repeatsCount: 1
    _waveEndCondition: 1
    _waveEndTime: 0
    _ddaSetups:
    - <DdaLevel>k__BackingField: 1
      _botConfigs:
      - {fileID: 11400000, guid: 0ce26a3a81750f5499a693b3f4d94d90, type: 2}
      - {fileID: 11400000, guid: 0ce26a3a81750f5499a693b3f4d94d90, type: 2}
      - {fileID: 11400000, guid: 0ce26a3a81750f5499a693b3f4d94d90, type: 2}
      - {fileID: 11400000, guid: 0ce26a3a81750f5499a693b3f4d94d90, type: 2}
      - {fileID: 11400000, guid: 2830101f10789ab4c9cbc04513628431, type: 2}
      - {fileID: 11400000, guid: 0ce26a3a81750f5499a693b3f4d94d90, type: 2}
      - {fileID: 11400000, guid: 0ce26a3a81750f5499a693b3f4d94d90, type: 2}
    - <DdaLevel>k__BackingField: 2
      _botConfigs:
      - {fileID: 11400000, guid: 0ce26a3a81750f5499a693b3f4d94d90, type: 2}
      - {fileID: 11400000, guid: 0ce26a3a81750f5499a693b3f4d94d90, type: 2}
      - {fileID: 11400000, guid: 0ce26a3a81750f5499a693b3f4d94d90, type: 2}
      - {fileID: 11400000, guid: 0ce26a3a81750f5499a693b3f4d94d90, type: 2}
      - {fileID: 11400000, guid: 2830101f10789ab4c9cbc04513628431, type: 2}
      - {fileID: 11400000, guid: 0ce26a3a81750f5499a693b3f4d94d90, type: 2}
      - {fileID: 11400000, guid: 0ce26a3a81750f5499a693b3f4d94d90, type: 2}
    - <DdaLevel>k__BackingField: 3
      _botConfigs:
      - {fileID: 11400000, guid: 0ce26a3a81750f5499a693b3f4d94d90, type: 2}
      - {fileID: 11400000, guid: 0ce26a3a81750f5499a693b3f4d94d90, type: 2}
      - {fileID: 11400000, guid: 0ce26a3a81750f5499a693b3f4d94d90, type: 2}
      - {fileID: 11400000, guid: 0ce26a3a81750f5499a693b3f4d94d90, type: 2}
      - {fileID: 11400000, guid: 2830101f10789ab4c9cbc04513628431, type: 2}
      - {fileID: 11400000, guid: 0ce26a3a81750f5499a693b3f4d94d90, type: 2}
      - {fileID: 11400000, guid: 0ce26a3a81750f5499a693b3f4d94d90, type: 2}
