%YAML 1.1
%TAG !u! tag:unity3d.com,2011:
--- !u!114 &11400000
MonoBehaviour:
  m_ObjectHideFlags: 0
  m_CorrespondingSourceObject: {fileID: 0}
  m_PrefabInstance: {fileID: 0}
  m_PrefabAsset: {fileID: 0}
  m_GameObject: {fileID: 0}
  m_Enabled: 1
  m_EditorHideFlags: 0
  m_Script: {fileID: 11500000, guid: a2f9b21bf40a4e28a7f3d02125b85d95, type: 3}
  m_Name: HeroKadzuoImpact_Ultimate
  m_EditorClassIdentifier: 
  <Id>k__BackingField: hero_kadzuo_ultimate
  _castData:
    <CanMove>k__BackingField: 1
    <Duration>k__BackingField: 1
  _aiConditions:
    _aiEnabled: 1
    _onlyAttackState: 1
    _enemyRadius: 15
    _enemyWeightMinLimit: 10
    _allyRadius: 0
    _allyHealthMinLimit: 0
  _effects:
  - <Id>k__BackingField: effect_wave
    <RepeatsData>k__BackingField:
      _type: 0
      _repeatsCount: 0
      _repeatDelay: 0
    <TargetData>k__BackingField:
      _type: 0
      _filterData:
        _filterParams:
          UnitTypeSelector: 2
          PlayerTypeSelector: 0
          PropertiesSelector: []
        _orderedAvailableTypes: 
      _detectionData:
        _type: 2
        _value1: 10
        _value2: 60
        _rotation: 0
        _offset: {x: 0, y: 0, z: 0}
        _maxTargets: 2147483647
    <ActivationData>k__BackingField:
      _type: 0
      _delay: 0.5
      _delayByDistance:
        serializedVersion: 2
        m_Curve: []
        m_PreInfinity: 2
        m_PostInfinity: 2
        m_RotationOrder: 4
    <AffectAreaData>k__BackingField:
      _type: 0
      _value1: 15
      _value2: 45
      _rotation: 0
      _offset: {x: 0, y: 0, z: 0}
    _affectData:
    - _repeatsPerTarget:
        <Type>k__BackingField: 0
        <ExactCount>k__BackingField: 1
        <UseLimits>k__BackingField: 0
        <Limits>k__BackingField: {x: 0, y: 0}
      _type: 2
      _buffs: []
      _unitEffectReplacements: []
      _health: -300
      _healPercent: 0
      _statDurationData:
        _type: 0
        _duration: 0
        _repeatCount: 0
        _repeatCooldown: 0
      _prefab: {fileID: 1637961311388326512, guid: e60888ba751ab4554b5d3f3f0528bf13, type: 3}
      _prefabOffsetData:
        _type: 0
        _radius: 0
      _unitActions: []
