%YAML 1.1
%TAG !u! tag:unity3d.com,2011:
--- !u!1001 &5640256604041081663
PrefabInstance:
  m_ObjectHideFlags: 0
  serializedVersion: 2
  m_Modification:
    m_TransformParent: {fileID: 0}
    m_Modifications:
    - target: {fileID: 446038171286663991, guid: 00cf83aff3c2cbf4e8306da43684d6ab, type: 3}
      propertyPath: m_Height
      value: 2
      objectReference: {fileID: 0}
    - target: {fileID: 446038171286663991, guid: 00cf83aff3c2cbf4e8306da43684d6ab, type: 3}
      propertyPath: m_Radius
      value: 0.5
      objectReference: {fileID: 0}
    - target: {fileID: 446038171286663991, guid: 00cf83aff3c2cbf4e8306da43684d6ab, type: 3}
      propertyPath: m_Center.y
      value: 1
      objectReference: {fileID: 0}
    - target: {fileID: 1012106840942404319, guid: 00cf83aff3c2cbf4e8306da43684d6ab, type: 3}
      propertyPath: m_LocalPosition.y
      value: 1.5
      objectReference: {fileID: 0}
    - target: {fileID: 1179800410657110674, guid: 00cf83aff3c2cbf4e8306da43684d6ab, type: 3}
      propertyPath: m_Name
      value: ZombieCrusherViewConfig_Phase3
      objectReference: {fileID: 0}
    - target: {fileID: 2409455723470284381, guid: 00cf83aff3c2cbf4e8306da43684d6ab, type: 3}
      propertyPath: m_Radius
      value: 10
      objectReference: {fileID: 0}
    - target: {fileID: 3286878922114958425, guid: 00cf83aff3c2cbf4e8306da43684d6ab, type: 3}
      propertyPath: m_Radius
      value: 1.1
      objectReference: {fileID: 0}
    - target: {fileID: 5640191777760127786, guid: 00cf83aff3c2cbf4e8306da43684d6ab, type: 3}
      propertyPath: <DamageZones>k__BackingField
      value: 
      objectReference: {fileID: 11400000, guid: 501c5423b14d94a2891905960e719cad, type: 2}
    - target: {fileID: 5640191777760127786, guid: 00cf83aff3c2cbf4e8306da43684d6ab, type: 3}
      propertyPath: <AttackCollider>k__BackingField
      value: 
      objectReference: {fileID: 0}
    - target: {fileID: 5640191777760127786, guid: 00cf83aff3c2cbf4e8306da43684d6ab, type: 3}
      propertyPath: <VisionCollider>k__BackingField
      value: 
      objectReference: {fileID: 0}
    - target: {fileID: 7873902949505524344, guid: 00cf83aff3c2cbf4e8306da43684d6ab, type: 3}
      propertyPath: m_RootOrder
      value: 3
      objectReference: {fileID: 0}
    - target: {fileID: 7873902949505524344, guid: 00cf83aff3c2cbf4e8306da43684d6ab, type: 3}
      propertyPath: m_LocalPosition.y
      value: 1.373
      objectReference: {fileID: 0}
    - target: {fileID: 8052255709296277690, guid: 00cf83aff3c2cbf4e8306da43684d6ab, type: 3}
      propertyPath: m_RootOrder
      value: 0
      objectReference: {fileID: 0}
    - target: {fileID: 8052255709296277690, guid: 00cf83aff3c2cbf4e8306da43684d6ab, type: 3}
      propertyPath: m_LocalScale.x
      value: 1.1
      objectReference: {fileID: 0}
    - target: {fileID: 8052255709296277690, guid: 00cf83aff3c2cbf4e8306da43684d6ab, type: 3}
      propertyPath: m_LocalScale.y
      value: 1.1
      objectReference: {fileID: 0}
    - target: {fileID: 8052255709296277690, guid: 00cf83aff3c2cbf4e8306da43684d6ab, type: 3}
      propertyPath: m_LocalScale.z
      value: 1.1
      objectReference: {fileID: 0}
    - target: {fileID: 8052255709296277690, guid: 00cf83aff3c2cbf4e8306da43684d6ab, type: 3}
      propertyPath: m_LocalPosition.x
      value: 0
      objectReference: {fileID: 0}
    - target: {fileID: 8052255709296277690, guid: 00cf83aff3c2cbf4e8306da43684d6ab, type: 3}
      propertyPath: m_LocalPosition.y
      value: 0
      objectReference: {fileID: 0}
    - target: {fileID: 8052255709296277690, guid: 00cf83aff3c2cbf4e8306da43684d6ab, type: 3}
      propertyPath: m_LocalPosition.z
      value: 0
      objectReference: {fileID: 0}
    - target: {fileID: 8052255709296277690, guid: 00cf83aff3c2cbf4e8306da43684d6ab, type: 3}
      propertyPath: m_LocalRotation.w
      value: 1
      objectReference: {fileID: 0}
    - target: {fileID: 8052255709296277690, guid: 00cf83aff3c2cbf4e8306da43684d6ab, type: 3}
      propertyPath: m_LocalRotation.x
      value: 0
      objectReference: {fileID: 0}
    - target: {fileID: 8052255709296277690, guid: 00cf83aff3c2cbf4e8306da43684d6ab, type: 3}
      propertyPath: m_LocalRotation.y
      value: 0
      objectReference: {fileID: 0}
    - target: {fileID: 8052255709296277690, guid: 00cf83aff3c2cbf4e8306da43684d6ab, type: 3}
      propertyPath: m_LocalRotation.z
      value: 0
      objectReference: {fileID: 0}
    - target: {fileID: 8052255709296277690, guid: 00cf83aff3c2cbf4e8306da43684d6ab, type: 3}
      propertyPath: m_LocalEulerAnglesHint.x
      value: 0
      objectReference: {fileID: 0}
    - target: {fileID: 8052255709296277690, guid: 00cf83aff3c2cbf4e8306da43684d6ab, type: 3}
      propertyPath: m_LocalEulerAnglesHint.y
      value: 0
      objectReference: {fileID: 0}
    - target: {fileID: 8052255709296277690, guid: 00cf83aff3c2cbf4e8306da43684d6ab, type: 3}
      propertyPath: m_LocalEulerAnglesHint.z
      value: 0
      objectReference: {fileID: 0}
    m_RemovedComponents: []
  m_SourcePrefab: {fileID: 100100000, guid: 00cf83aff3c2cbf4e8306da43684d6ab, type: 3}
