%YAML 1.1
%TAG !u! tag:unity3d.com,2011:
--- !u!114 &11400000
MonoBehaviour:
  m_ObjectHideFlags: 0
  m_CorrespondingSourceObject: {fileID: 0}
  m_PrefabInstance: {fileID: 0}
  m_PrefabAsset: {fileID: 0}
  m_GameObject: {fileID: 0}
  m_Enabled: 1
  m_EditorHideFlags: 0
  m_Script: {fileID: 11500000, guid: 66c857b9dd0f4ca49505eef26ae616a9, type: 3}
  m_Name: ZombiePoliceGirl1Config
  m_EditorClassIdentifier: 
  <Id>k__BackingField: bot_zombie_police_girl
  <Name>k__BackingField: 
  <Sprite>k__BackingField: {fileID: 0}
  <Class>k__BackingField: 0
  <RoleIcon>k__BackingField: {fileID: 0}
  <GoldRoleIcon>k__BackingField: {fileID: 0}
  <IsBoss>k__BackingField: 0
  <View>k__BackingField: {fileID: 1655015890418872360, guid: 74e0f817376eb2c4a8d0b7393f505049, type: 3}
  <ViewConfig>k__BackingField: {fileID: 1068684761356309, guid: 6ba62f31e59d801429e02781ba77ee27, type: 3}
  <ClientModule>k__BackingField: {fileID: 0}
  <ServerModule>k__BackingField: {fileID: 0}
  <UnitAIConfig>k__BackingField: {fileID: 11400000, guid: a881ba62eb8cef24fb38e1c4845cc8ad, type: 2}
  <UnitPhaseConfig>k__BackingField: {fileID: 0}
  <Phase>k__BackingField: 1
  <UnitActionRoster>k__BackingField: {fileID: 11400000, guid: 147aa4318782370469f75b1c817bd6a9, type: 2}
  <UpgradeTable>k__BackingField: {fileID: 11400000, guid: 7d7ccd6edaf397346a06f5bd721c8614, type: 2}
  <BodyMass>k__BackingField: 80
  _damageMultipliers: []
  <DeathRewards>k__BackingField:
    <Exp>k__BackingField: 80
    <EnergyCapsule>k__BackingField:
      <Energy>k__BackingField: 3
      <DropChance>k__BackingField: 10
      <MaxRandomPositionOffset>k__BackingField: 0.7
    _lootSet: {fileID: 11400000, guid: fb471da3a38816f4eb84870922285920, type: 2}
  <DefaultWeapon>k__BackingField: {fileID: 0}
  <DefaultMeleeWeapon>k__BackingField: {fileID: 11400000, guid: 592970b82ab997d4cb4f4b007fce8334, type: 2}
  <GearScore>k__BackingField: 10
  <Health>k__BackingField: 130
  <Stamina>k__BackingField: 0
  <Energy>k__BackingField: 0
  <Speed>k__BackingField: 5
  <TurnSpeed>k__BackingField: 500
  <HpAutoRecovery>k__BackingField:
    <PercentPerSecond>k__BackingField: 0
    <DamageCooldown>k__BackingField: 0
  <EnergyAutoRecovery>k__BackingField:
    <Speed>k__BackingField: 0
  <StaminaAutoRecovery>k__BackingField:
    <Speed>k__BackingField: 20
  <Impacts>k__BackingField:
    _death:
      _config: {fileID: 0}
      _delayVariant: 0
      _delay: 0
      _cooldown: 0
    _ultimate:
      _config: {fileID: 0}
      _delayVariant: 0
      _delay: 0
      _cooldown: 0
    _ability:
      _config: {fileID: 0}
      _delayVariant: 0
      _delay: 0
      _cooldown: 0
    _extraAbility:
      _config: {fileID: 0}
      _delayVariant: 0
      _delay: 0
      _cooldown: 0
    _special:
      _config: {fileID: 0}
      _delayVariant: 0
      _delay: 0
      _cooldown: 0
