%YAML 1.1
%TAG !u! tag:unity3d.com,2011:
--- !u!114 &11400000
MonoBehaviour:
  m_ObjectHideFlags: 0
  m_CorrespondingSourceObject: {fileID: 0}
  m_PrefabInstance: {fileID: 0}
  m_PrefabAsset: {fileID: 0}
  m_GameObject: {fileID: 0}
  m_Enabled: 1
  m_EditorHideFlags: 0
  m_Script: {fileID: 11500000, guid: 0e357d34f8c249369fb837cf974d34d1, type: 3}
  m_Name: TrapPrefabRoster
  m_EditorClassIdentifier: 
  _prefabs:
  - {fileID: 7481629820799676406, guid: 85b46621e862a4d9a91328f7f3c518b6, type: 3}
