%YAML 1.1
%TAG !u! tag:unity3d.com,2011:
--- !u!114 &11400000
MonoBehaviour:
  m_ObjectHideFlags: 0
  m_CorrespondingSourceObject: {fileID: 0}
  m_PrefabInstance: {fileID: 0}
  m_PrefabAsset: {fileID: 0}
  m_GameObject: {fileID: 0}
  m_Enabled: 1
  m_EditorHideFlags: 0
  m_Script: {fileID: 11500000, guid: b1289be40cd4410eb5ee2d18610566cc, type: 3}
  m_Name: InventoryHero_Jack
  m_EditorClassIdentifier: 
  _id: HERO_JACK
  _iconRef:
    m_AssetGUID: 45464e493574aba4bbce5ca19b467e67
    m_SubObjectName: 
    m_SubObjectType: 
    m_EditorAssetChanged: 0
  _name: Jack
  _description: Jack descriptions
  _rarity: 0
  _config: {fileID: 11400000, guid: 022d3017c19022645903fc9ff85adce6, type: 2}
