%YAML 1.1
%TAG !u! tag:unity3d.com,2011:
--- !u!1001 &9187483091108975595
PrefabInstance:
  m_ObjectHideFlags: 0
  serializedVersion: 2
  m_Modification:
    m_TransformParent: {fileID: 0}
    m_Modifications:
    - target: {fileID: 5148625851949726291, guid: 1f187bc1ce137b6468a67c7a724eec19, type: 3}
      propertyPath: m_Sprite
      value: 
      objectReference: {fileID: 21300000, guid: f391d3ad8a0089c469359e814846bafc, type: 3}
    - target: {fileID: 5148625851949726291, guid: 1f187bc1ce137b6468a67c7a724eec19, type: 3}
      propertyPath: m_Color.b
      value: 0.30980393
      objectReference: {fileID: 0}
    - target: {fileID: 5148625851949726291, guid: 1f187bc1ce137b6468a67c7a724eec19, type: 3}
      propertyPath: m_Color.g
      value: 0.80784315
      objectReference: {fileID: 0}
    - target: {fileID: 5148625851949726302, guid: 1f187bc1ce137b6468a67c7a724eec19, type: 3}
      propertyPath: m_Pivot.x
      value: 0.5
      objectReference: {fileID: 0}
    - target: {fileID: 5148625851949726302, guid: 1f187bc1ce137b6468a67c7a724eec19, type: 3}
      propertyPath: m_Pivot.y
      value: 0.5
      objectReference: {fileID: 0}
    - target: {fileID: 5148625851949726302, guid: 1f187bc1ce137b6468a67c7a724eec19, type: 3}
      propertyPath: m_RootOrder
      value: 0
      objectReference: {fileID: 0}
    - target: {fileID: 5148625851949726302, guid: 1f187bc1ce137b6468a67c7a724eec19, type: 3}
      propertyPath: m_AnchorMax.x
      value: 0.5
      objectReference: {fileID: 0}
    - target: {fileID: 5148625851949726302, guid: 1f187bc1ce137b6468a67c7a724eec19, type: 3}
      propertyPath: m_AnchorMax.y
      value: 0.5
      objectReference: {fileID: 0}
    - target: {fileID: 5148625851949726302, guid: 1f187bc1ce137b6468a67c7a724eec19, type: 3}
      propertyPath: m_AnchorMin.x
      value: 0.5
      objectReference: {fileID: 0}
    - target: {fileID: 5148625851949726302, guid: 1f187bc1ce137b6468a67c7a724eec19, type: 3}
      propertyPath: m_AnchorMin.y
      value: 0.5
      objectReference: {fileID: 0}
    - target: {fileID: 5148625851949726302, guid: 1f187bc1ce137b6468a67c7a724eec19, type: 3}
      propertyPath: m_SizeDelta.x
      value: 420
      objectReference: {fileID: 0}
    - target: {fileID: 5148625851949726302, guid: 1f187bc1ce137b6468a67c7a724eec19, type: 3}
      propertyPath: m_SizeDelta.y
      value: 60
      objectReference: {fileID: 0}
    - target: {fileID: 5148625851949726302, guid: 1f187bc1ce137b6468a67c7a724eec19, type: 3}
      propertyPath: m_LocalPosition.x
      value: 0
      objectReference: {fileID: 0}
    - target: {fileID: 5148625851949726302, guid: 1f187bc1ce137b6468a67c7a724eec19, type: 3}
      propertyPath: m_LocalPosition.y
      value: 0
      objectReference: {fileID: 0}
    - target: {fileID: 5148625851949726302, guid: 1f187bc1ce137b6468a67c7a724eec19, type: 3}
      propertyPath: m_LocalPosition.z
      value: 0
      objectReference: {fileID: 0}
    - target: {fileID: 5148625851949726302, guid: 1f187bc1ce137b6468a67c7a724eec19, type: 3}
      propertyPath: m_LocalRotation.w
      value: 1
      objectReference: {fileID: 0}
    - target: {fileID: 5148625851949726302, guid: 1f187bc1ce137b6468a67c7a724eec19, type: 3}
      propertyPath: m_LocalRotation.x
      value: 0
      objectReference: {fileID: 0}
    - target: {fileID: 5148625851949726302, guid: 1f187bc1ce137b6468a67c7a724eec19, type: 3}
      propertyPath: m_LocalRotation.y
      value: 0
      objectReference: {fileID: 0}
    - target: {fileID: 5148625851949726302, guid: 1f187bc1ce137b6468a67c7a724eec19, type: 3}
      propertyPath: m_LocalRotation.z
      value: 0
      objectReference: {fileID: 0}
    - target: {fileID: 5148625851949726302, guid: 1f187bc1ce137b6468a67c7a724eec19, type: 3}
      propertyPath: m_AnchoredPosition.x
      value: 0
      objectReference: {fileID: 0}
    - target: {fileID: 5148625851949726302, guid: 1f187bc1ce137b6468a67c7a724eec19, type: 3}
      propertyPath: m_AnchoredPosition.y
      value: -475
      objectReference: {fileID: 0}
    - target: {fileID: 5148625851949726302, guid: 1f187bc1ce137b6468a67c7a724eec19, type: 3}
      propertyPath: m_LocalEulerAnglesHint.x
      value: 0
      objectReference: {fileID: 0}
    - target: {fileID: 5148625851949726302, guid: 1f187bc1ce137b6468a67c7a724eec19, type: 3}
      propertyPath: m_LocalEulerAnglesHint.y
      value: 0
      objectReference: {fileID: 0}
    - target: {fileID: 5148625851949726302, guid: 1f187bc1ce137b6468a67c7a724eec19, type: 3}
      propertyPath: m_LocalEulerAnglesHint.z
      value: 0
      objectReference: {fileID: 0}
    - target: {fileID: 5148625851949726303, guid: 1f187bc1ce137b6468a67c7a724eec19, type: 3}
      propertyPath: m_Name
      value: SquareButtonGold
      objectReference: {fileID: 0}
    - target: {fileID: 5148625852833674868, guid: 1f187bc1ce137b6468a67c7a724eec19, type: 3}
      propertyPath: m_text
      value: TEXT
      objectReference: {fileID: 0}
    m_RemovedComponents: []
  m_SourcePrefab: {fileID: 100100000, guid: 1f187bc1ce137b6468a67c7a724eec19, type: 3}
