%YAML 1.1
%TAG !u! tag:unity3d.com,2011:
--- !u!114 &11400000
MonoBehaviour:
  m_ObjectHideFlags: 0
  m_CorrespondingSourceObject: {fileID: 0}
  m_PrefabInstance: {fileID: 0}
  m_PrefabAsset: {fileID: 0}
  m_GameObject: {fileID: 0}
  m_Enabled: 1
  m_EditorHideFlags: 0
  m_Script: {fileID: 11500000, guid: ecae85734d5044079aa6fcd498a3d783, type: 3}
  m_Name: ClientModulePrefabRepository
  m_EditorClassIdentifier: 
  _keyValuePairs:
  - Config: {fileID: 11400000, guid: f0afcd28688d24d749c1e28fc016b44b, type: 2}
    Value: {fileID: -8011274083451148472, guid: 2e0a3122a7af6499483d66376d53bfc3, type: 3}
