%YAML 1.1
%TAG !u! tag:unity3d.com,2011:
--- !u!114 &11400000
MonoBehaviour:
  m_ObjectHideFlags: 0
  m_CorrespondingSourceObject: {fileID: 0}
  m_PrefabInstance: {fileID: 0}
  m_PrefabAsset: {fileID: 0}
  m_GameObject: {fileID: 0}
  m_Enabled: 1
  m_EditorHideFlags: 0
  m_Script: {fileID: 11500000, guid: c1d13905b6d14fe3abd8d195fc7f3f25, type: 3}
  m_Name: Arena_2_FinishOff_TaskViewConfig
  m_EditorClassIdentifier: 
  <Id>k__BackingField: FinishOffActivityViewConfig_939fd827-53c0-4aac-8da8-10dd2540602e
  _overridePopUp: 0
  _inPanelDescription:
    _title: Secure the area 2
    _goals:
    - _title: Kill remaining enemies
      _isMarkerEnabled: 0
      _markerBgColor: {r: 0, g: 0, b: 0, a: 0}
      _markerSprite: {fileID: 0}
  _inPopUpDescription:
    _title: Secure the area 2
    _goals:
    - _title: Kill remaining enemies
      _isMarkerEnabled: 0
      _markerBgColor: {r: 0, g: 0, b: 0, a: 0}
      _markerSprite: {fileID: 0}
  _panelItemPrefab: {fileID: -4062982460065526501, guid: 05f5d13bb61ab72439074e4d5aa5f3fa, type: 3}
  _panelItemGoalPrefab: {fileID: 4886006278544224311, guid: eec7213ab2e9ebd4792d522a5442fe89, type: 3}
