%YAML 1.1
%TAG !u! tag:unity3d.com,2011:
--- !u!114 &11400000
MonoBehaviour:
  m_ObjectHideFlags: 0
  m_CorrespondingSourceObject: {fileID: 0}
  m_PrefabInstance: {fileID: 0}
  m_PrefabAsset: {fileID: 0}
  m_GameObject: {fileID: 0}
  m_Enabled: 1
  m_EditorHideFlags: 0
  m_Script: {fileID: 11500000, guid: bbb281ee3bf0b054c82ac2347e9e782c, type: 3}
  m_Name: Default Local Group
  m_EditorClassIdentifier: 
  m_GroupName: Default Local Group
  m_Data:
    m_SerializedData: []
  m_GUID: d4e0816d4b7052048860ab901ac3edda
  m_SerializeEntries:
  - m_GUID: fe1ab62a7812b494cb8f6ca34689af56
    m_Address: UnitNetwork
    m_ReadOnly: 0
    m_SerializedLabels: []
    FlaggedDuringContentUpdateRestriction: 0
  - m_GUID: 46fb46a88a8f2504ca019b5c5e052865
    m_Address: BattleContext
    m_ReadOnly: 0
    m_SerializedLabels: []
    FlaggedDuringContentUpdateRestriction: 0
  - m_GUID: f0ee597a7f91cba40911d107a0a58e4f
    m_Address: BattleCamera
    m_ReadOnly: 0
    m_SerializedLabels: []
    FlaggedDuringContentUpdateRestriction: 0
  - m_GUID: bb565e1230fc54347929f79470836a8a
    m_Address: LootBox
    m_ReadOnly: 0
    m_SerializedLabels: []
    FlaggedDuringContentUpdateRestriction: 0
  - m_GUID: e8f36d0223eb14c5da9b0dc5558d3917
    m_Address: LootBox_Blue
    m_ReadOnly: 0
    m_SerializedLabels: []
    FlaggedDuringContentUpdateRestriction: 0
  - m_GUID: 9ac267d59c73b4adfa5946932bf57177
    m_Address: LootBox_Green
    m_ReadOnly: 0
    m_SerializedLabels: []
    FlaggedDuringContentUpdateRestriction: 0
  - m_GUID: 05c8ed32cf8f446f190fb7105d5bab6c
    m_Address: LootBox_Purple
    m_ReadOnly: 0
    m_SerializedLabels: []
    FlaggedDuringContentUpdateRestriction: 0
  - m_GUID: 9a99d0291f577e54aa108f9d850d862c
    m_Address: LootBoxesPanel
    m_ReadOnly: 0
    m_SerializedLabels: []
    FlaggedDuringContentUpdateRestriction: 0
  - m_GUID: 45fa2e2cd3e51414fa57ef1b5ae72c08
    m_Address: LootBoxItem
    m_ReadOnly: 0
    m_SerializedLabels: []
    FlaggedDuringContentUpdateRestriction: 0
  - m_GUID: 315e710a151f0744da2f0a61768a13b6
    m_Address: EnergyCapsule
    m_ReadOnly: 0
    m_SerializedLabels: []
    FlaggedDuringContentUpdateRestriction: 0
  - m_GUID: 81494f09864ac7347a386ffbd7a180e4
    m_Address: UILoadingScreen
    m_ReadOnly: 0
    m_SerializedLabels: []
    FlaggedDuringContentUpdateRestriction: 0
  - m_GUID: 58c2c1aa38a04754ca54a1381ec5e846
    m_Address: UIMainScreen
    m_ReadOnly: 0
    m_SerializedLabels: []
    FlaggedDuringContentUpdateRestriction: 0
  - m_GUID: 10183d10bb487a74695d9b8ea8de03f5
    m_Address: HeroJackAbilityGrenade
    m_ReadOnly: 0
    m_SerializedLabels: []
    FlaggedDuringContentUpdateRestriction: 0
  - m_GUID: 32df507a79cc8164f9c82dded6fdc330
    m_Address: VFX_StyleBloodA_BulletHit
    m_ReadOnly: 0
    m_SerializedLabels: []
    FlaggedDuringContentUpdateRestriction: 0
  - m_GUID: 3d79171705c81104e8b8c9b3221de46d
    m_Address: VFX_BloodA_Opened_Artery
    m_ReadOnly: 0
    m_SerializedLabels: []
    FlaggedDuringContentUpdateRestriction: 0
  - m_GUID: eaade400b663d0d46aa89e5eec910786
    m_Address: VFX_SpawnUnits
    m_ReadOnly: 0
    m_SerializedLabels: []
    FlaggedDuringContentUpdateRestriction: 0
  - m_GUID: 4124bcd25ead6874eb9c83ebc2b1586b
    m_Address: VFX_ConcreteImpact
    m_ReadOnly: 0
    m_SerializedLabels: []
    FlaggedDuringContentUpdateRestriction: 0
  - m_GUID: 88256508e68b57444bdcc1841639298c
    m_Address: UI_VFX_Exp_Item
    m_ReadOnly: 0
    m_SerializedLabels: []
    FlaggedDuringContentUpdateRestriction: 0
  - m_GUID: d95609749ef19408aa4971f0ff5c9a0b
    m_Address: UI_VFX_Health_Item_Heal
    m_ReadOnly: 0
    m_SerializedLabels: []
    FlaggedDuringContentUpdateRestriction: 0
  - m_GUID: ae65cf3d6345e7249b531f9ac956818e
    m_Address: VFX_Healing_cast
    m_ReadOnly: 0
    m_SerializedLabels: []
    FlaggedDuringContentUpdateRestriction: 0
  - m_GUID: bc46ecd00a66682488e429956855ef89
    m_Address: UI_VFX_Health_Item_Invul
    m_ReadOnly: 0
    m_SerializedLabels: []
    FlaggedDuringContentUpdateRestriction: 0
  - m_GUID: 3c0d3614bf36c42aa8d3e994924d59fb
    m_Address: ScoresPanel_Item_Local
    m_ReadOnly: 0
    m_SerializedLabels: []
    FlaggedDuringContentUpdateRestriction: 0
  - m_GUID: 2116f42dd11d740509bbd67919b31c36
    m_Address: ScoresPanel_Item_Remote
    m_ReadOnly: 0
    m_SerializedLabels: []
    FlaggedDuringContentUpdateRestriction: 0
  - m_GUID: e591f60b4cec44c909438c9db626467f
    m_Address: ScoresPanel_Item
    m_ReadOnly: 0
    m_SerializedLabels: []
    FlaggedDuringContentUpdateRestriction: 0
  - m_GUID: 1ec874223404449088a068238806b689
    m_Address: TargetArea_Idle
    m_ReadOnly: 0
    m_SerializedLabels: []
    FlaggedDuringContentUpdateRestriction: 0
  - m_GUID: f0144c64453d4b7468d1e62760cb1f4b
    m_Address: UIMissionObjectives
    m_ReadOnly: 0
    m_SerializedLabels: []
    FlaggedDuringContentUpdateRestriction: 0
  - m_GUID: d09161a8dbbc54607a217204256377b9
    m_Address: Target_Object
    m_ReadOnly: 0
    m_SerializedLabels: []
    FlaggedDuringContentUpdateRestriction: 0
  - m_GUID: c2bca6f6c97c24567984f1f96dc493cb
    m_Address: Area
    m_ReadOnly: 0
    m_SerializedLabels: []
    FlaggedDuringContentUpdateRestriction: 0
  - m_GUID: 906fcae7c9a8447e2a49932a9bc30318
    m_Address: Target_Deactivated
    m_ReadOnly: 0
    m_SerializedLabels: []
    FlaggedDuringContentUpdateRestriction: 0
  - m_GUID: e4ee218348c984ab0b8baade5d56c7fb
    m_Address: Target_Deactivating
    m_ReadOnly: 0
    m_SerializedLabels: []
    FlaggedDuringContentUpdateRestriction: 0
  - m_GUID: 53ccd37ad5cb8478fa9171edc8140d1e
    m_Address: Target_Animator
    m_ReadOnly: 0
    m_SerializedLabels: []
    FlaggedDuringContentUpdateRestriction: 0
  - m_GUID: 43b9a4815cfde43e6885bffeff1d29f7
    m_Address: Target_Activating
    m_ReadOnly: 0
    m_SerializedLabels: []
    FlaggedDuringContentUpdateRestriction: 0
  - m_GUID: 7d95ee4f3ba70493997bb1b1ddc4887f
    m_Address: ReanimationPanel
    m_ReadOnly: 0
    m_SerializedLabels: []
    FlaggedDuringContentUpdateRestriction: 0
  - m_GUID: 3031b7ac7270bb24eb193eb14eaf686a
    m_Address: RelationsColorSettings
    m_ReadOnly: 0
    m_SerializedLabels: []
    FlaggedDuringContentUpdateRestriction: 0
  - m_GUID: 4ab3d7dcb224087498054bf57831f799
    m_Address: PlayerInfoPanel
    m_ReadOnly: 0
    m_SerializedLabels: []
    FlaggedDuringContentUpdateRestriction: 0
  - m_GUID: b4f6525e1e49d8a4d9555f2bb3a1da6b
    m_Address: UIMissionCompleteScreen
    m_ReadOnly: 0
    m_SerializedLabels: []
    FlaggedDuringContentUpdateRestriction: 0
  - m_GUID: f112629f153b8c5439c73b6056fd689d
    m_Address: CharacterSelectionView
    m_ReadOnly: 0
    m_SerializedLabels: []
    FlaggedDuringContentUpdateRestriction: 0
  - m_GUID: 0b53236b0202b4a6984b0904d6045739
    m_Address: AllyPanel
    m_ReadOnly: 0
    m_SerializedLabels: []
    FlaggedDuringContentUpdateRestriction: 0
  - m_GUID: d3f2d96ff6bb64d2f8d19a87b467b31e
    m_Address: PointerPanel
    m_ReadOnly: 0
    m_SerializedLabels: []
    FlaggedDuringContentUpdateRestriction: 0
  - m_GUID: 71d63799bc4084fd9aea7c8a794bfdcb
    m_Address: UI_VFX_Aggro_Item
    m_ReadOnly: 0
    m_SerializedLabels: []
    FlaggedDuringContentUpdateRestriction: 0
  - m_GUID: 8b7e3ab7c0415487bac0ef30a6141642
    m_Address: UI_VFX_Health_Item
    m_ReadOnly: 0
    m_SerializedLabels: []
    FlaggedDuringContentUpdateRestriction: 0
  - m_GUID: 358f2da63429e45c4871d3a1c1baae48
    m_Address: Checkpoint
    m_ReadOnly: 0
    m_SerializedLabels: []
    FlaggedDuringContentUpdateRestriction: 0
  - m_GUID: 54c08badf48c24b7aa3fe50ef8b50f85
    m_Address: AffectZone
    m_ReadOnly: 0
    m_SerializedLabels: []
    FlaggedDuringContentUpdateRestriction: 0
  - m_GUID: 492e46070b48344b09a6e534196caa74
    m_Address: TargetPanel
    m_ReadOnly: 0
    m_SerializedLabels: []
    FlaggedDuringContentUpdateRestriction: 0
  - m_GUID: 85b46621e862a4d9a91328f7f3c518b6
    m_Address: Trap
    m_ReadOnly: 0
    m_SerializedLabels: []
    FlaggedDuringContentUpdateRestriction: 0
  - m_GUID: f9b8a2d5a15d8bb41aa46fcc9abf28b2
    m_Address: AffectZoneFillable
    m_ReadOnly: 0
    m_SerializedLabels: []
    FlaggedDuringContentUpdateRestriction: 0
  - m_GUID: b32a9c3b1584b44d98d10d9dcd19e220
    m_Address: Totem
    m_ReadOnly: 0
    m_SerializedLabels: []
    FlaggedDuringContentUpdateRestriction: 0
  - m_GUID: 61b89cea61446456cb1f73f1c19c47a3
    m_Address: AffectZoneFillable_AutoDestroy
    m_ReadOnly: 0
    m_SerializedLabels: []
    FlaggedDuringContentUpdateRestriction: 0
  - m_GUID: dd90c005e707448ee86bbe39d3afa93a
    m_Address: TotemsPanelItem
    m_ReadOnly: 0
    m_SerializedLabels: []
    FlaggedDuringContentUpdateRestriction: 0
  - m_GUID: 0a519c0507c8f42cc930a883516bdd5d
    m_Address: VFX_IAD_Dog_Explode
    m_ReadOnly: 0
    m_SerializedLabels: []
    FlaggedDuringContentUpdateRestriction: 0
  - m_GUID: 58a8646547e0a488f9e8641a7d62ac6c
    m_Address: VFX_IAD_Dog_Ground
    m_ReadOnly: 0
    m_SerializedLabels: []
    FlaggedDuringContentUpdateRestriction: 0
  - m_GUID: e60888ba751ab4554b5d3f3f0528bf13
    m_Address: ImpactWave_Jack Variant
    m_ReadOnly: 0
    m_SerializedLabels: []
    FlaggedDuringContentUpdateRestriction: 0
  - m_GUID: b6dfc4d52ffec45f8b58873b393b5b3e
    m_Address: ImpactWave
    m_ReadOnly: 0
    m_SerializedLabels: []
    FlaggedDuringContentUpdateRestriction: 0
  - m_GUID: 60f7c2af613d741608945b62b8785d32
    m_Address: ImpactLink
    m_ReadOnly: 0
    m_SerializedLabels: []
    FlaggedDuringContentUpdateRestriction: 0
  - m_GUID: 9262bec8c1af1433aa41c64d5ec236a8
    m_Address: ImpactLink_HeroTaylor
    m_ReadOnly: 0
    m_SerializedLabels: []
    FlaggedDuringContentUpdateRestriction: 0
  - m_GUID: 8c7223599e2086d489b2c64b0a13b873
    m_Address: AllyMarker
    m_ReadOnly: 0
    m_SerializedLabels: []
    FlaggedDuringContentUpdateRestriction: 0
  - m_GUID: 86a67d2360b5a4cc284b4a768f89879e
    m_Address: AffectZoneFillable_Rect
    m_ReadOnly: 0
    m_SerializedLabels: []
    FlaggedDuringContentUpdateRestriction: 0
  - m_GUID: 4a80d937985eb44c898fee607df57972
    m_Address: AffectZoneFillable_Sector
    m_ReadOnly: 0
    m_SerializedLabels: []
    FlaggedDuringContentUpdateRestriction: 0
  - m_GUID: 4f71df44185c9b94b9d2f0fd767b3f43
    m_Address: UIHeroInfoScreen
    m_ReadOnly: 0
    m_SerializedLabels: []
    FlaggedDuringContentUpdateRestriction: 0
  - m_GUID: 130dec5680352cb4e94afa28c0d31e37
    m_Address: UIInventoryScreen
    m_ReadOnly: 0
    m_SerializedLabels: []
    FlaggedDuringContentUpdateRestriction: 0
  - m_GUID: ffc7ec9718f16c344bb798a17b9c9049
    m_Address: Assets/Frostgate.RiftHunters.Core/Battle/Totem/Prefabs/Totem_Tech.prefab
    m_ReadOnly: 0
    m_SerializedLabels: []
    FlaggedDuringContentUpdateRestriction: 0
  - m_GUID: ebb63dc787e036049a47fa969f9656c4
    m_Address: Assets/Frostgate.RiftHunters.Core/Battle/Totem/Prefabs/Crusher_Totem_Special_3.prefab
    m_ReadOnly: 0
    m_SerializedLabels: []
    FlaggedDuringContentUpdateRestriction: 0
  - m_GUID: 4ee6c7c49fed8cd48be50c7fcd00020b
    m_Address: UICampaignScreen
    m_ReadOnly: 0
    m_SerializedLabels: []
    FlaggedDuringContentUpdateRestriction: 0
  - m_GUID: db70f22547d506a4cbcbc7e58d4545c3
    m_Address: UIAuthScreen
    m_ReadOnly: 0
    m_SerializedLabels: []
    FlaggedDuringContentUpdateRestriction: 0
  - m_GUID: 886f6bcae94844648b7f41fef25eff78
    m_Address: UIAuthFailedScreen
    m_ReadOnly: 0
    m_SerializedLabels: []
    FlaggedDuringContentUpdateRestriction: 0
  - m_GUID: 52f6aec3aeaac644faad69c0bf653919
    m_Address: UIAuthInProgressScreen
    m_ReadOnly: 0
    m_SerializedLabels: []
    FlaggedDuringContentUpdateRestriction: 0
  - m_GUID: 654aab5d20958064182e6774a35b15fd
    m_Address: ActivityRelatedViewConfigRoster
    m_ReadOnly: 0
    m_SerializedLabels: []
    FlaggedDuringContentUpdateRestriction: 0
  m_ReadOnly: 0
  m_Settings: {fileID: 11400000, guid: 55009b699d161594fbcf66916dde2d55, type: 2}
  m_SchemaSet:
    m_Schemas:
    - {fileID: 11400000, guid: f5cea2d2cb565bf47882ab30e10d6e47, type: 2}
    - {fileID: 11400000, guid: 1a3a9eec970491949acb06cd1607250a, type: 2}
