%YAML 1.1
%TAG !u! tag:unity3d.com,2011:
--- !u!114 &11400000
MonoBehaviour:
  m_ObjectHideFlags: 0
  m_CorrespondingSourceObject: {fileID: 0}
  m_PrefabInstance: {fileID: 0}
  m_PrefabAsset: {fileID: 0}
  m_GameObject: {fileID: 0}
  m_Enabled: 1
  m_EditorHideFlags: 0
  m_Script: {fileID: 11500000, guid: bbb281ee3bf0b054c82ac2347e9e782c, type: 3}
  m_Name: Localization-Locales
  m_EditorClassIdentifier: 
  m_GroupName: Localization-Locales
  m_Data:
    m_SerializedData: []
  m_GUID: 1a07ac7837279f04d987a6ebde8250e1
  m_SerializeEntries:
  - m_GUID: 94d2a0cd23674bf48b6033feba94db5d
    m_Address: English (en)
    m_ReadOnly: 1
    m_SerializedLabels:
    - Locale
    FlaggedDuringContentUpdateRestriction: 0
  - m_GUID: a57a890ecf0c7bc40a954084fba56de6
    m_Address: Russian (ru)
    m_ReadOnly: 1
    m_SerializedLabels:
    - Locale
    FlaggedDuringContentUpdateRestriction: 0
  m_ReadOnly: 1
  m_Settings: {fileID: 11400000, guid: 55009b699d161594fbcf66916dde2d55, type: 2}
  m_SchemaSet:
    m_Schemas:
    - {fileID: 11400000, guid: 36b0adbe76bcb3645915cee4bd39f55e, type: 2}
    - {fileID: 11400000, guid: 6b3f6defe4f7b6641ba384c42d65928d, type: 2}
