%YAML 1.1
%TAG !u! tag:unity3d.com,2011:
--- !u!114 &11400000
MonoBehaviour:
  m_ObjectHideFlags: 0
  m_CorrespondingSourceObject: {fileID: 0}
  m_PrefabInstance: {fileID: 0}
  m_PrefabAsset: {fileID: 0}
  m_GameObject: {fileID: 0}
  m_Enabled: 1
  m_EditorHideFlags: 0
  m_Script: {fileID: 11500000, guid: 30bb4ded80254aa48eb5c513d8642063, type: 3}
  m_Name: Suburb1_Arena1_SapperActivityConfig
  m_EditorClassIdentifier: 
  <Id>k__BackingField: SapperActivityConfig_150d24e1-1a0e-491d-9772-fb6f05cdcb9d
  _areaConfigs:
  - _id: Area_A
    _radius: 3
    _requiredCapturePoints: 100
    _captureIncreaseRate: 5
    _captureDecreaseRate: 0
    _increaseRateScales:
    - _invadersCount: 1
      _scale: 1
    - _invadersCount: 1
      _scale: 1.5
    - _invadersCount: 1
      _scale: 1.75
  - _id: Area_B
    _radius: 3
    _requiredCapturePoints: 100
    _captureIncreaseRate: 5
    _captureDecreaseRate: 0
    _increaseRateScales:
    - _invadersCount: 1
      _scale: 1
    - _invadersCount: 1
      _scale: 1.5
    - _invadersCount: 1
      _scale: 1.75
  - _id: Area_C
    _radius: 3
    _requiredCapturePoints: 100
    _captureIncreaseRate: 5
    _captureDecreaseRate: 0
    _increaseRateScales:
    - _invadersCount: 1
      _scale: 1
    - _invadersCount: 1
      _scale: 1.5
    - _invadersCount: 1
      _scale: 1.75
  - _id: Area_D
    _radius: 3
    _requiredCapturePoints: 100
    _captureIncreaseRate: 5
    _captureDecreaseRate: 0
    _increaseRateScales:
    - _invadersCount: 1
      _scale: 1
    - _invadersCount: 1
      _scale: 1.5
    - _invadersCount: 1
      _scale: 1.75
