%YAML 1.1
%TAG !u! tag:unity3d.com,2011:
--- !u!114 &11400000
MonoBehaviour:
  m_ObjectHideFlags: 0
  m_CorrespondingSourceObject: {fileID: 0}
  m_PrefabInstance: {fileID: 0}
  m_PrefabAsset: {fileID: 0}
  m_GameObject: {fileID: 0}
  m_Enabled: 1
  m_EditorHideFlags: 0
  m_Script: {fileID: 11500000, guid: 50661c4e1bab45d982bc52c92b6b29a9, type: 3}
  m_Name: SimonMeleeWeaponConfig
  m_EditorClassIdentifier: 
  _id: SimonMeleeWeaponConfig
  _iconRef:
    m_AssetGUID: 
    m_SubObjectName: 
    m_SubObjectType: 
    m_EditorAssetChanged: 1
  _name: SimonMeleeWeaponConfig
  _description: SimonMeleeWeaponConfig
  _type: 0
  _class: 0
  _rarity: 0
  _gearScore: 3
  _rank: 1
  _modifications: []
  <AnimationKey>k__BackingField: 
  SyncEveryShoot: 0
  <InAttackMoveSpeedMultiplier>k__BackingField: 1
  <CriticalDamageChance>k__BackingField: 0
  <CriticalDamageMultiplier>k__BackingField: 0
  <BreakShieldChance>k__BackingField: 0
  <UnitEffects>k__BackingField: []
  <DamageByDistanceMultiplier>k__BackingField:
    serializedVersion: 2
    m_Curve:
    - serializedVersion: 3
      time: 0
      value: 1
      inSlope: 0
      outSlope: 0
      tangentMode: 0
      weightedMode: 0
      inWeight: 0.33333334
      outWeight: 0.33333334
    - serializedVersion: 3
      time: 1
      value: 1
      inSlope: 0
      outSlope: 0
      tangentMode: 0
      weightedMode: 0
      inWeight: 0.33333334
      outWeight: 0.33333334
    m_PreInfinity: 2
    m_PostInfinity: 2
    m_RotationOrder: 4
  <Damage>k__BackingField: 15
  <MaxDistance>k__BackingField: 0.7
  <AttackAngle>k__BackingField: 65
  <AttackVerticalAngle>k__BackingField: 45
  <AttackOriginHalfSize>k__BackingField: 0.3
  <ShootTime>k__BackingField: 0.4
  <FreezeBeforeShootDuration>k__BackingField: 0
  <Cooldown>k__BackingField: 1.4
  _unitActionDamageTriggers: []
