%YAML 1.1
%TAG !u! tag:unity3d.com,2011:
--- !u!114 &11400000
MonoBehaviour:
  m_ObjectHideFlags: 0
  m_CorrespondingSourceObject: {fileID: 0}
  m_PrefabInstance: {fileID: 0}
  m_PrefabAsset: {fileID: 0}
  m_GameObject: {fileID: 0}
  m_Enabled: 1
  m_EditorHideFlags: 0
  m_Script: {fileID: 11500000, guid: a2f9b21bf40a4e28a7f3d02125b85d95, type: 3}
  m_Name: CrusherImpactConfig_Ability_2
  m_EditorClassIdentifier: 
  <Id>k__BackingField: crusher_ability_2
  _castData:
    <CanMove>k__BackingField: 0
    <Duration>k__BackingField: 2
  _aiConditions:
    _aiEnabled: 1
    _onlyAttackState: 1
    _enemyRadius: 4
    _enemyWeightMinLimit: 1
    _allyRadius: 0
    _allyHealthMinLimit: 0
  _effects:
  - <Id>k__BackingField: strike
    <RepeatsData>k__BackingField:
      _type: 0
      _repeatsCount: 0
      _repeatDelay: 0
    <TargetData>k__BackingField:
      _type: 1
      _filterData:
        _filterParams:
          UnitTypeSelector: 1
          PlayerTypeSelector: 3
          PropertiesSelector:
          - Property: 0
            Condition: 2
          - Property: 2
            Condition: 2
        _orderedAvailableTypes: 01000000
      _detectionData:
        _type: 2
        _value1: 30
        _value2: 0
        _rotation: 0
        _offset: {x: 0, y: 0, z: 0}
        _maxTargets: 2147483647
    <ActivationData>k__BackingField:
      _type: 1
      _delay: 1
      _delayByDistance:
        serializedVersion: 2
        m_Curve: []
        m_PreInfinity: 2
        m_PostInfinity: 2
        m_RotationOrder: 4
    <AffectAreaData>k__BackingField:
      _type: 1
      _value1: 5
      _value2: 80
      _rotation: 0
      _offset: {x: 0, y: 0, z: 0.5}
    _affectData:
    - _repeatsPerTarget:
        <Type>k__BackingField: 0
        <ExactCount>k__BackingField: 1
        <UseLimits>k__BackingField: 0
        <Limits>k__BackingField: {x: 0, y: 0}
      _type: 1
      _buffs: []
      _unitEffectReplacements: []
      _health: -120
      _healPercent: 0
      _statDurationData:
        _type: 0
        _duration: 0
        _repeatCount: 0
        _repeatCooldown: 0
      _prefab: {fileID: 0}
      _prefabOffsetData:
        _type: 0
        _radius: 0
      _unitActions: []
