%YAML 1.1
%TAG !u! tag:unity3d.com,2011:
--- !u!1001 &511243913088534042
PrefabInstance:
  m_ObjectHideFlags: 0
  serializedVersion: 2
  m_Modification:
    m_TransformParent: {fileID: 0}
    m_Modifications:
    - target: {fileID: 963430370142084913, guid: 5cd5af444fe27f544a764ac18570b6f5, type: 3}
      propertyPath: m_Pivot.x
      value: 0.5
      objectReference: {fileID: 0}
    - target: {fileID: 963430370142084913, guid: 5cd5af444fe27f544a764ac18570b6f5, type: 3}
      propertyPath: m_Pivot.y
      value: 0.5
      objectReference: {fileID: 0}
    - target: {fileID: 963430370142084913, guid: 5cd5af444fe27f544a764ac18570b6f5, type: 3}
      propertyPath: m_RootOrder
      value: 0
      objectReference: {fileID: 0}
    - target: {fileID: 963430370142084913, guid: 5cd5af444fe27f544a764ac18570b6f5, type: 3}
      propertyPath: m_AnchorMax.x
      value: 0
      objectReference: {fileID: 0}
    - target: {fileID: 963430370142084913, guid: 5cd5af444fe27f544a764ac18570b6f5, type: 3}
      propertyPath: m_AnchorMax.y
      value: 0
      objectReference: {fileID: 0}
    - target: {fileID: 963430370142084913, guid: 5cd5af444fe27f544a764ac18570b6f5, type: 3}
      propertyPath: m_AnchorMin.x
      value: 0
      objectReference: {fileID: 0}
    - target: {fileID: 963430370142084913, guid: 5cd5af444fe27f544a764ac18570b6f5, type: 3}
      propertyPath: m_AnchorMin.y
      value: 0
      objectReference: {fileID: 0}
    - target: {fileID: 963430370142084913, guid: 5cd5af444fe27f544a764ac18570b6f5, type: 3}
      propertyPath: m_SizeDelta.x
      value: 302
      objectReference: {fileID: 0}
    - target: {fileID: 963430370142084913, guid: 5cd5af444fe27f544a764ac18570b6f5, type: 3}
      propertyPath: m_SizeDelta.y
      value: 26
      objectReference: {fileID: 0}
    - target: {fileID: 963430370142084913, guid: 5cd5af444fe27f544a764ac18570b6f5, type: 3}
      propertyPath: m_LocalPosition.x
      value: 0
      objectReference: {fileID: 0}
    - target: {fileID: 963430370142084913, guid: 5cd5af444fe27f544a764ac18570b6f5, type: 3}
      propertyPath: m_LocalPosition.y
      value: 0
      objectReference: {fileID: 0}
    - target: {fileID: 963430370142084913, guid: 5cd5af444fe27f544a764ac18570b6f5, type: 3}
      propertyPath: m_LocalPosition.z
      value: 0
      objectReference: {fileID: 0}
    - target: {fileID: 963430370142084913, guid: 5cd5af444fe27f544a764ac18570b6f5, type: 3}
      propertyPath: m_LocalRotation.w
      value: 1
      objectReference: {fileID: 0}
    - target: {fileID: 963430370142084913, guid: 5cd5af444fe27f544a764ac18570b6f5, type: 3}
      propertyPath: m_LocalRotation.x
      value: 0
      objectReference: {fileID: 0}
    - target: {fileID: 963430370142084913, guid: 5cd5af444fe27f544a764ac18570b6f5, type: 3}
      propertyPath: m_LocalRotation.y
      value: 0
      objectReference: {fileID: 0}
    - target: {fileID: 963430370142084913, guid: 5cd5af444fe27f544a764ac18570b6f5, type: 3}
      propertyPath: m_LocalRotation.z
      value: 0
      objectReference: {fileID: 0}
    - target: {fileID: 963430370142084913, guid: 5cd5af444fe27f544a764ac18570b6f5, type: 3}
      propertyPath: m_AnchoredPosition.x
      value: 0
      objectReference: {fileID: 0}
    - target: {fileID: 963430370142084913, guid: 5cd5af444fe27f544a764ac18570b6f5, type: 3}
      propertyPath: m_AnchoredPosition.y
      value: 0
      objectReference: {fileID: 0}
    - target: {fileID: 963430370142084913, guid: 5cd5af444fe27f544a764ac18570b6f5, type: 3}
      propertyPath: m_LocalEulerAnglesHint.x
      value: 0
      objectReference: {fileID: 0}
    - target: {fileID: 963430370142084913, guid: 5cd5af444fe27f544a764ac18570b6f5, type: 3}
      propertyPath: m_LocalEulerAnglesHint.y
      value: 0
      objectReference: {fileID: 0}
    - target: {fileID: 963430370142084913, guid: 5cd5af444fe27f544a764ac18570b6f5, type: 3}
      propertyPath: m_LocalEulerAnglesHint.z
      value: 0
      objectReference: {fileID: 0}
    - target: {fileID: 4780411628257440812, guid: 5cd5af444fe27f544a764ac18570b6f5, type: 3}
      propertyPath: m_Name
      value: HealthBarBoss
      objectReference: {fileID: 0}
    - target: {fileID: 4847961115410050905, guid: 5cd5af444fe27f544a764ac18570b6f5, type: 3}
      propertyPath: m_Sprite
      value: 
      objectReference: {fileID: 21300000, guid: 754cb852f608bed40a92c530f8ec55f5, type: 3}
    - target: {fileID: 6571209609496890110, guid: 5cd5af444fe27f544a764ac18570b6f5, type: 3}
      propertyPath: m_AnchorMax.x
      value: 0
      objectReference: {fileID: 0}
    - target: {fileID: 6571209609496890110, guid: 5cd5af444fe27f544a764ac18570b6f5, type: 3}
      propertyPath: m_AnchorMax.y
      value: 0
      objectReference: {fileID: 0}
    m_RemovedComponents: []
  m_SourcePrefab: {fileID: 100100000, guid: 5cd5af444fe27f544a764ac18570b6f5, type: 3}
