%YAML 1.1
%TAG !u! tag:unity3d.com,2011:
--- !u!114 &11400000
MonoBehaviour:
  m_ObjectHideFlags: 0
  m_CorrespondingSourceObject: {fileID: 0}
  m_PrefabInstance: {fileID: 0}
  m_PrefabAsset: {fileID: 0}
  m_GameObject: {fileID: 0}
  m_Enabled: 1
  m_EditorHideFlags: 0
  m_Script: {fileID: 11500000, guid: c26c5471f05d4f11958eb90160051987, type: 3}
  m_Name: UltraWeaponDamageTrigger
  m_EditorClassIdentifier: 
  _triggerType: 0
  <ActionType>k__BackingField: 13
