%YAML 1.1
%TAG !u! tag:unity3d.com,2011:
--- !u!114 &11400000
MonoBehaviour:
  m_ObjectHideFlags: 0
  m_CorrespondingSourceObject: {fileID: 0}
  m_PrefabInstance: {fileID: 0}
  m_PrefabAsset: {fileID: 0}
  m_GameObject: {fileID: 0}
  m_Enabled: 1
  m_EditorHideFlags: 0
  m_Script: {fileID: 11500000, guid: 54601bc0ddd74614bef5ce9dd515c7b2, type: 3}
  m_Name: BotJack_WeaponConfig
  m_EditorClassIdentifier: 
  _id: BotJack_WeaponConfig
  _iconRef:
    m_AssetGUID: 0d1a19203b968bc448046a060ef83e80
    m_SubObjectName: 
    m_SubObjectType: 
    m_EditorAssetChanged: 0
  _name: BotJack_WeaponConfig
  _description: BotJack_WeaponConfig
  _type: 4
  _class: 0
  _rarity: 0
  _gearScore: 5
  _rank: 1
  _modifications: []
  <AnimationKey>k__BackingField: 
  SyncEveryShoot: 0
  <InAttackMoveSpeedMultiplier>k__BackingField: 0.5
  <CriticalDamageChance>k__BackingField: 0
  <CriticalDamageMultiplier>k__BackingField: 2
  <BreakShieldChance>k__BackingField: 0
  <UnitEffects>k__BackingField: []
  <DamageByDistanceMultiplier>k__BackingField:
    serializedVersion: 2
    m_Curve:
    - serializedVersion: 3
      time: 0
      value: 1
      inSlope: 0
      outSlope: 0
      tangentMode: 0
      weightedMode: 0
      inWeight: 0.33333334
      outWeight: 0.33333334
    - serializedVersion: 3
      time: 1
      value: 1
      inSlope: 0
      outSlope: 0
      tangentMode: 0
      weightedMode: 0
      inWeight: 0.33333334
      outWeight: 0.33333334
    m_PreInfinity: 2
    m_PostInfinity: 2
    m_RotationOrder: 4
  <Damage>k__BackingField: 5
  <MaxDistance>k__BackingField: 8
  <AttackAngle>k__BackingField: 8
  <AttackVerticalAngle>k__BackingField: 45
  <AttackOriginHalfSize>k__BackingField: 0.3
  <ShootTime>k__BackingField: 0
  <FreezeBeforeShootDuration>k__BackingField: 0
  <Cooldown>k__BackingField: 0.143
  _unitActionDamageTriggers: []
  <AttackAnimation>k__BackingField: RifleAttack
  <ReloadSeconds>k__BackingField: 2
  <InReloadMoveSpeedMultiplier>k__BackingField: 1
  <PatronsCount>k__BackingField: 40
  <BulletsPerShoot>k__BackingField: 1
  <ScatterAngle>k__BackingField: 1.2
  <BulletSpeed>k__BackingField: 2000
