%YAML 1.1
%TAG !u! tag:unity3d.com,2011:
--- !u!114 &11400000
MonoBehaviour:
  m_ObjectHideFlags: 0
  m_CorrespondingSourceObject: {fileID: 0}
  m_PrefabInstance: {fileID: 0}
  m_PrefabAsset: {fileID: 0}
  m_GameObject: {fileID: 0}
  m_Enabled: 1
  m_EditorHideFlags: 0
  m_Script: {fileID: 11500000, guid: c98c00d0470b4f09ad8903a477a07319, type: 3}
  m_Name: Arena_3
  m_EditorClassIdentifier: 
  <Id>k__BackingField: BotArenaConfig_54844d99-4ff9-4f0d-943e-e524b024f07f
  _activityConfigs:
  - {fileID: 11400000, guid: b6992a6e0e36145e19dd4a72b0ffc10c, type: 2}
  - {fileID: 11400000, guid: b8569994359cb6145ba40b4ab21b7527, type: 2}
  _respawnData:
    _respawnTypeFlags: 3
    _respawnTimerInterval: 10
    _invincibleDuration: 1
