%YAML 1.1
%TAG !u! tag:unity3d.com,2011:
--- !u!114 &11400000
MonoBehaviour:
  m_ObjectHideFlags: 0
  m_CorrespondingSourceObject: {fileID: 0}
  m_PrefabInstance: {fileID: 0}
  m_PrefabAsset: {fileID: 0}
  m_GameObject: {fileID: 0}
  m_Enabled: 1
  m_EditorHideFlags: 0
  m_Script: {fileID: 11500000, guid: 0cb4e07232dd44f789a1a03cf5d48ca4, type: 3}
  m_Name: TestScene_0_MoveToPointActivity
  m_EditorClassIdentifier: 
  <Id>k__BackingField: ActivityConfig_ce34270b-ae81-4468-83d0-9d5a4e1197fc
  _taskSequence:
    _nodes:
    - _config: {fileID: 11400000, guid: bf9ac598575cd75489af79e8aecaa7b9, type: 2}
