%YAML 1.1
%TAG !u! tag:unity3d.com,2011:
--- !u!114 &11400000
MonoBehaviour:
  m_ObjectHideFlags: 0
  m_CorrespondingSourceObject: {fileID: 0}
  m_PrefabInstance: {fileID: 0}
  m_PrefabAsset: {fileID: 0}
  m_GameObject: {fileID: 0}
  m_Enabled: 1
  m_EditorHideFlags: 0
  m_Script: {fileID: 11500000, guid: 1a3b1958c06449609e68d9f83a3fe89c, type: 3}
  m_Name: Arena_4_Waves_G
  m_EditorClassIdentifier: 
  <Id>k__BackingField: BotSpawnerConfig_e76bc76f-556a-4b14-8d2c-0b8f04f44c73
  _isEndless: 0
  _unlimitedUnits: 1
  _maxUnitsInFrame: 0
  _delay: 0
  _autoUnspawnBots: 0
  _waves:
  - _delay: 2
    _repeatsCount: 1
    _waveEndCondition: 1
    _waveEndTime: 0
    _ddaSetups:
    - <DdaLevel>k__BackingField: 1
      _botConfigs:
      - {fileID: 11400000, guid: 4efea671f3f9c3640b3f72b8e7f21329, type: 2}
      - {fileID: 11400000, guid: 4efea671f3f9c3640b3f72b8e7f21329, type: 2}
      - {fileID: 11400000, guid: 4efea671f3f9c3640b3f72b8e7f21329, type: 2}
      - {fileID: 11400000, guid: 4efea671f3f9c3640b3f72b8e7f21329, type: 2}
      - {fileID: 11400000, guid: 4efea671f3f9c3640b3f72b8e7f21329, type: 2}
      - {fileID: 11400000, guid: 4efea671f3f9c3640b3f72b8e7f21329, type: 2}
      - {fileID: 11400000, guid: 4efea671f3f9c3640b3f72b8e7f21329, type: 2}
      - {fileID: 11400000, guid: 4efea671f3f9c3640b3f72b8e7f21329, type: 2}
      - {fileID: 11400000, guid: 4efea671f3f9c3640b3f72b8e7f21329, type: 2}
      - {fileID: 11400000, guid: 4efea671f3f9c3640b3f72b8e7f21329, type: 2}
      - {fileID: 11400000, guid: 4efea671f3f9c3640b3f72b8e7f21329, type: 2}
      - {fileID: 11400000, guid: 4efea671f3f9c3640b3f72b8e7f21329, type: 2}
      - {fileID: 11400000, guid: 4efea671f3f9c3640b3f72b8e7f21329, type: 2}
      - {fileID: 11400000, guid: 4efea671f3f9c3640b3f72b8e7f21329, type: 2}
    - <DdaLevel>k__BackingField: 2
      _botConfigs:
      - {fileID: 11400000, guid: 4efea671f3f9c3640b3f72b8e7f21329, type: 2}
      - {fileID: 11400000, guid: 4efea671f3f9c3640b3f72b8e7f21329, type: 2}
      - {fileID: 11400000, guid: 4efea671f3f9c3640b3f72b8e7f21329, type: 2}
      - {fileID: 11400000, guid: 4efea671f3f9c3640b3f72b8e7f21329, type: 2}
      - {fileID: 11400000, guid: 4efea671f3f9c3640b3f72b8e7f21329, type: 2}
      - {fileID: 11400000, guid: 4efea671f3f9c3640b3f72b8e7f21329, type: 2}
      - {fileID: 11400000, guid: 4efea671f3f9c3640b3f72b8e7f21329, type: 2}
      - {fileID: 11400000, guid: 4efea671f3f9c3640b3f72b8e7f21329, type: 2}
      - {fileID: 11400000, guid: 4efea671f3f9c3640b3f72b8e7f21329, type: 2}
      - {fileID: 11400000, guid: 4efea671f3f9c3640b3f72b8e7f21329, type: 2}
      - {fileID: 11400000, guid: 4efea671f3f9c3640b3f72b8e7f21329, type: 2}
      - {fileID: 11400000, guid: 4efea671f3f9c3640b3f72b8e7f21329, type: 2}
      - {fileID: 11400000, guid: 4efea671f3f9c3640b3f72b8e7f21329, type: 2}
      - {fileID: 11400000, guid: 4efea671f3f9c3640b3f72b8e7f21329, type: 2}
      - {fileID: 11400000, guid: 4efea671f3f9c3640b3f72b8e7f21329, type: 2}
      - {fileID: 11400000, guid: 4efea671f3f9c3640b3f72b8e7f21329, type: 2}
      - {fileID: 11400000, guid: 4efea671f3f9c3640b3f72b8e7f21329, type: 2}
    - <DdaLevel>k__BackingField: 3
      _botConfigs:
      - {fileID: 11400000, guid: 4efea671f3f9c3640b3f72b8e7f21329, type: 2}
      - {fileID: 11400000, guid: 4efea671f3f9c3640b3f72b8e7f21329, type: 2}
      - {fileID: 11400000, guid: 4efea671f3f9c3640b3f72b8e7f21329, type: 2}
      - {fileID: 11400000, guid: 4efea671f3f9c3640b3f72b8e7f21329, type: 2}
      - {fileID: 11400000, guid: 4efea671f3f9c3640b3f72b8e7f21329, type: 2}
      - {fileID: 11400000, guid: 4efea671f3f9c3640b3f72b8e7f21329, type: 2}
      - {fileID: 11400000, guid: 4efea671f3f9c3640b3f72b8e7f21329, type: 2}
      - {fileID: 11400000, guid: 4efea671f3f9c3640b3f72b8e7f21329, type: 2}
      - {fileID: 11400000, guid: 4efea671f3f9c3640b3f72b8e7f21329, type: 2}
      - {fileID: 11400000, guid: 4efea671f3f9c3640b3f72b8e7f21329, type: 2}
      - {fileID: 11400000, guid: 4efea671f3f9c3640b3f72b8e7f21329, type: 2}
      - {fileID: 11400000, guid: 4efea671f3f9c3640b3f72b8e7f21329, type: 2}
      - {fileID: 11400000, guid: 4efea671f3f9c3640b3f72b8e7f21329, type: 2}
      - {fileID: 11400000, guid: 4efea671f3f9c3640b3f72b8e7f21329, type: 2}
      - {fileID: 11400000, guid: 4efea671f3f9c3640b3f72b8e7f21329, type: 2}
      - {fileID: 11400000, guid: 4efea671f3f9c3640b3f72b8e7f21329, type: 2}
      - {fileID: 11400000, guid: 4efea671f3f9c3640b3f72b8e7f21329, type: 2}
      - {fileID: 11400000, guid: 4efea671f3f9c3640b3f72b8e7f21329, type: 2}
      - {fileID: 11400000, guid: 4efea671f3f9c3640b3f72b8e7f21329, type: 2}
      - {fileID: 11400000, guid: 4efea671f3f9c3640b3f72b8e7f21329, type: 2}
