%YAML 1.1
%TAG !u! tag:unity3d.com,2011:
--- !u!114 &11400000
MonoBehaviour:
  m_ObjectHideFlags: 0
  m_CorrespondingSourceObject: {fileID: 0}
  m_PrefabInstance: {fileID: 0}
  m_PrefabAsset: {fileID: 0}
  m_GameObject: {fileID: 0}
  m_Enabled: 1
  m_EditorHideFlags: 0
  m_Script: {fileID: 11500000, guid: 681a925c768c4d2e9ed09169da1af76b, type: 3}
  m_Name: Support_Body_Rank1_Uncommon
  m_EditorClassIdentifier: 
  _id: SUPPORT_BODY_RANK1_UNCOMMON
  _icon: {fileID: 21300000, guid: f6b42f26c9a39bb42aa85fc21a78135b, type: 3}
  _name: Hazmat Suit
  _description: Complete protective suit for hazardous materials handling
  _type: 1
  _class: 2
  _rarity: 1
  _gearScore: 23
  _rank: 1
  _modifications:
  - _operation: 2
    _property: 0
    _value: 8
    _measure: 0
