%YAML 1.1
%TAG !u! tag:unity3d.com,2011:
--- !u!1001 &3316097446924424315
PrefabInstance:
  m_ObjectHideFlags: 0
  serializedVersion: 2
  m_Modification:
    m_TransformParent: {fileID: 0}
    m_Modifications:
    - target: {fileID: 1855670327650027768, guid: aea3797d3edc0ea489a1267745e2e45d, type: 3}
      propertyPath: m_AnchorMax.x
      value: 1
      objectReference: {fileID: 0}
    - target: {fileID: 1855670327650027768, guid: aea3797d3edc0ea489a1267745e2e45d, type: 3}
      propertyPath: m_AnchorMax.y
      value: 1
      objectReference: {fileID: 0}
    - target: {fileID: 2125043366027548891, guid: aea3797d3edc0ea489a1267745e2e45d, type: 3}
      propertyPath: m_IsActive
      value: 0
      objectReference: {fileID: 0}
    - target: {fileID: 2625192371351788638, guid: aea3797d3edc0ea489a1267745e2e45d, type: 3}
      propertyPath: m_IsActive
      value: 0
      objectReference: {fileID: 0}
    - target: {fileID: 2725128887330227539, guid: aea3797d3edc0ea489a1267745e2e45d, type: 3}
      propertyPath: m_AnchorMax.x
      value: 1
      objectReference: {fileID: 0}
    - target: {fileID: 2725128887330227539, guid: aea3797d3edc0ea489a1267745e2e45d, type: 3}
      propertyPath: m_AnchorMax.y
      value: 1
      objectReference: {fileID: 0}
    - target: {fileID: 2725128887660493971, guid: aea3797d3edc0ea489a1267745e2e45d, type: 3}
      propertyPath: m_AnchorMax.x
      value: 1
      objectReference: {fileID: 0}
    - target: {fileID: 2725128887660493971, guid: aea3797d3edc0ea489a1267745e2e45d, type: 3}
      propertyPath: m_AnchorMax.y
      value: 1
      objectReference: {fileID: 0}
    - target: {fileID: 2982164015507023856, guid: aea3797d3edc0ea489a1267745e2e45d, type: 3}
      propertyPath: m_AnchorMax.y
      value: 1
      objectReference: {fileID: 0}
    - target: {fileID: 2982164015507023856, guid: aea3797d3edc0ea489a1267745e2e45d, type: 3}
      propertyPath: m_AnchorMin.y
      value: 1
      objectReference: {fileID: 0}
    - target: {fileID: 2982164015507023856, guid: aea3797d3edc0ea489a1267745e2e45d, type: 3}
      propertyPath: m_AnchoredPosition.x
      value: 60
      objectReference: {fileID: 0}
    - target: {fileID: 2982164015507023856, guid: aea3797d3edc0ea489a1267745e2e45d, type: 3}
      propertyPath: m_AnchoredPosition.y
      value: -25
      objectReference: {fileID: 0}
    - target: {fileID: 4375059117075938177, guid: aea3797d3edc0ea489a1267745e2e45d, type: 3}
      propertyPath: m_IsActive
      value: 0
      objectReference: {fileID: 0}
    - target: {fileID: 4375059117416694337, guid: aea3797d3edc0ea489a1267745e2e45d, type: 3}
      propertyPath: m_IsActive
      value: 0
      objectReference: {fileID: 0}
    - target: {fileID: 4569975694704928044, guid: aea3797d3edc0ea489a1267745e2e45d, type: 3}
      propertyPath: m_AnchorMax.y
      value: 1
      objectReference: {fileID: 0}
    - target: {fileID: 4569975694704928044, guid: aea3797d3edc0ea489a1267745e2e45d, type: 3}
      propertyPath: m_AnchorMin.y
      value: 1
      objectReference: {fileID: 0}
    - target: {fileID: 4569975694704928044, guid: aea3797d3edc0ea489a1267745e2e45d, type: 3}
      propertyPath: m_AnchoredPosition.x
      value: 85
      objectReference: {fileID: 0}
    - target: {fileID: 4569975694704928044, guid: aea3797d3edc0ea489a1267745e2e45d, type: 3}
      propertyPath: m_AnchoredPosition.y
      value: -23
      objectReference: {fileID: 0}
    - target: {fileID: 4716972979857620831, guid: aea3797d3edc0ea489a1267745e2e45d, type: 3}
      propertyPath: <HealthBar>k__BackingField
      value: 
      objectReference: {fileID: 6577689725313898046}
    - target: {fileID: 4716972979857620831, guid: aea3797d3edc0ea489a1267745e2e45d, type: 3}
      propertyPath: <StaminaBar>k__BackingField
      value: 
      objectReference: {fileID: 0}
    - target: {fileID: 4716972979857620831, guid: aea3797d3edc0ea489a1267745e2e45d, type: 3}
      propertyPath: <BulletsView>k__BackingField
      value: 
      objectReference: {fileID: 0}
    - target: {fileID: 4716972979857620831, guid: aea3797d3edc0ea489a1267745e2e45d, type: 3}
      propertyPath: <BarAutoFader>k__BackingField
      value: 
      objectReference: {fileID: 3383981339460380559}
    - target: {fileID: 5603128936261802401, guid: aea3797d3edc0ea489a1267745e2e45d, type: 3}
      propertyPath: m_AnchoredPosition.y
      value: -0.4
      objectReference: {fileID: 0}
    - target: {fileID: 6045223739197339063, guid: aea3797d3edc0ea489a1267745e2e45d, type: 3}
      propertyPath: m_RootOrder
      value: 3
      objectReference: {fileID: 0}
    - target: {fileID: 6308675107999045074, guid: aea3797d3edc0ea489a1267745e2e45d, type: 3}
      propertyPath: m_Name
      value: UnitStateLayoutMiniBoss
      objectReference: {fileID: 0}
    - target: {fileID: 7716980522659058977, guid: aea3797d3edc0ea489a1267745e2e45d, type: 3}
      propertyPath: m_IsActive
      value: 0
      objectReference: {fileID: 0}
    - target: {fileID: 7798836156247134294, guid: aea3797d3edc0ea489a1267745e2e45d, type: 3}
      propertyPath: m_Pivot.x
      value: 0.5
      objectReference: {fileID: 0}
    - target: {fileID: 7798836156247134294, guid: aea3797d3edc0ea489a1267745e2e45d, type: 3}
      propertyPath: m_Pivot.y
      value: 0.5
      objectReference: {fileID: 0}
    - target: {fileID: 7798836156247134294, guid: aea3797d3edc0ea489a1267745e2e45d, type: 3}
      propertyPath: m_RootOrder
      value: 0
      objectReference: {fileID: 0}
    - target: {fileID: 7798836156247134294, guid: aea3797d3edc0ea489a1267745e2e45d, type: 3}
      propertyPath: m_AnchorMax.x
      value: 0.5
      objectReference: {fileID: 0}
    - target: {fileID: 7798836156247134294, guid: aea3797d3edc0ea489a1267745e2e45d, type: 3}
      propertyPath: m_AnchorMax.y
      value: 0.5
      objectReference: {fileID: 0}
    - target: {fileID: 7798836156247134294, guid: aea3797d3edc0ea489a1267745e2e45d, type: 3}
      propertyPath: m_AnchorMin.x
      value: 0.5
      objectReference: {fileID: 0}
    - target: {fileID: 7798836156247134294, guid: aea3797d3edc0ea489a1267745e2e45d, type: 3}
      propertyPath: m_AnchorMin.y
      value: 0.5
      objectReference: {fileID: 0}
    - target: {fileID: 7798836156247134294, guid: aea3797d3edc0ea489a1267745e2e45d, type: 3}
      propertyPath: m_SizeDelta.x
      value: 1.2
      objectReference: {fileID: 0}
    - target: {fileID: 7798836156247134294, guid: aea3797d3edc0ea489a1267745e2e45d, type: 3}
      propertyPath: m_SizeDelta.y
      value: 1.2
      objectReference: {fileID: 0}
    - target: {fileID: 7798836156247134294, guid: aea3797d3edc0ea489a1267745e2e45d, type: 3}
      propertyPath: m_LocalPosition.x
      value: 0
      objectReference: {fileID: 0}
    - target: {fileID: 7798836156247134294, guid: aea3797d3edc0ea489a1267745e2e45d, type: 3}
      propertyPath: m_LocalPosition.y
      value: 0
      objectReference: {fileID: 0}
    - target: {fileID: 7798836156247134294, guid: aea3797d3edc0ea489a1267745e2e45d, type: 3}
      propertyPath: m_LocalPosition.z
      value: 0
      objectReference: {fileID: 0}
    - target: {fileID: 7798836156247134294, guid: aea3797d3edc0ea489a1267745e2e45d, type: 3}
      propertyPath: m_LocalRotation.w
      value: 1
      objectReference: {fileID: 0}
    - target: {fileID: 7798836156247134294, guid: aea3797d3edc0ea489a1267745e2e45d, type: 3}
      propertyPath: m_LocalRotation.x
      value: -0
      objectReference: {fileID: 0}
    - target: {fileID: 7798836156247134294, guid: aea3797d3edc0ea489a1267745e2e45d, type: 3}
      propertyPath: m_LocalRotation.y
      value: -0
      objectReference: {fileID: 0}
    - target: {fileID: 7798836156247134294, guid: aea3797d3edc0ea489a1267745e2e45d, type: 3}
      propertyPath: m_LocalRotation.z
      value: -0
      objectReference: {fileID: 0}
    - target: {fileID: 7798836156247134294, guid: aea3797d3edc0ea489a1267745e2e45d, type: 3}
      propertyPath: m_AnchoredPosition.x
      value: 0
      objectReference: {fileID: 0}
    - target: {fileID: 7798836156247134294, guid: aea3797d3edc0ea489a1267745e2e45d, type: 3}
      propertyPath: m_AnchoredPosition.y
      value: 2.3
      objectReference: {fileID: 0}
    - target: {fileID: 7798836156247134294, guid: aea3797d3edc0ea489a1267745e2e45d, type: 3}
      propertyPath: m_LocalEulerAnglesHint.x
      value: 0
      objectReference: {fileID: 0}
    - target: {fileID: 7798836156247134294, guid: aea3797d3edc0ea489a1267745e2e45d, type: 3}
      propertyPath: m_LocalEulerAnglesHint.y
      value: 0
      objectReference: {fileID: 0}
    - target: {fileID: 7798836156247134294, guid: aea3797d3edc0ea489a1267745e2e45d, type: 3}
      propertyPath: m_LocalEulerAnglesHint.z
      value: 0
      objectReference: {fileID: 0}
    - target: {fileID: 8373515801644870650, guid: aea3797d3edc0ea489a1267745e2e45d, type: 3}
      propertyPath: m_AnchorMax.x
      value: 1
      objectReference: {fileID: 0}
    - target: {fileID: 8373515801644870650, guid: aea3797d3edc0ea489a1267745e2e45d, type: 3}
      propertyPath: m_AnchorMax.y
      value: 1
      objectReference: {fileID: 0}
    m_RemovedComponents: []
  m_SourcePrefab: {fileID: 100100000, guid: aea3797d3edc0ea489a1267745e2e45d, type: 3}
--- !u!224 &5829099466702483362 stripped
RectTransform:
  m_CorrespondingSourceObject: {fileID: 9142371127941331929, guid: aea3797d3edc0ea489a1267745e2e45d, type: 3}
  m_PrefabInstance: {fileID: 3316097446924424315}
  m_PrefabAsset: {fileID: 0}
--- !u!1001 &7570584355067939337
PrefabInstance:
  m_ObjectHideFlags: 0
  serializedVersion: 2
  m_Modification:
    m_TransformParent: {fileID: 5829099466702483362}
    m_Modifications:
    - target: {fileID: 654602661826230061, guid: ee6c2bf1d6d1d1d418c6cf1b7d872134, type: 3}
      propertyPath: m_Name
      value: HealthBarMiniBoss
      objectReference: {fileID: 0}
    - target: {fileID: 1185382359414934015, guid: ee6c2bf1d6d1d1d418c6cf1b7d872134, type: 3}
      propertyPath: m_AnchorMax.x
      value: 0
      objectReference: {fileID: 0}
    - target: {fileID: 1185382359414934015, guid: ee6c2bf1d6d1d1d418c6cf1b7d872134, type: 3}
      propertyPath: m_AnchorMax.y
      value: 0
      objectReference: {fileID: 0}
    - target: {fileID: 5051974980576173104, guid: ee6c2bf1d6d1d1d418c6cf1b7d872134, type: 3}
      propertyPath: m_Pivot.x
      value: 0.5
      objectReference: {fileID: 0}
    - target: {fileID: 5051974980576173104, guid: ee6c2bf1d6d1d1d418c6cf1b7d872134, type: 3}
      propertyPath: m_Pivot.y
      value: 0.5
      objectReference: {fileID: 0}
    - target: {fileID: 5051974980576173104, guid: ee6c2bf1d6d1d1d418c6cf1b7d872134, type: 3}
      propertyPath: m_RootOrder
      value: 2
      objectReference: {fileID: 0}
    - target: {fileID: 5051974980576173104, guid: ee6c2bf1d6d1d1d418c6cf1b7d872134, type: 3}
      propertyPath: m_AnchorMax.x
      value: 0
      objectReference: {fileID: 0}
    - target: {fileID: 5051974980576173104, guid: ee6c2bf1d6d1d1d418c6cf1b7d872134, type: 3}
      propertyPath: m_AnchorMax.y
      value: 0
      objectReference: {fileID: 0}
    - target: {fileID: 5051974980576173104, guid: ee6c2bf1d6d1d1d418c6cf1b7d872134, type: 3}
      propertyPath: m_AnchorMin.x
      value: 0
      objectReference: {fileID: 0}
    - target: {fileID: 5051974980576173104, guid: ee6c2bf1d6d1d1d418c6cf1b7d872134, type: 3}
      propertyPath: m_AnchorMin.y
      value: 0
      objectReference: {fileID: 0}
    - target: {fileID: 5051974980576173104, guid: ee6c2bf1d6d1d1d418c6cf1b7d872134, type: 3}
      propertyPath: m_SizeDelta.x
      value: 226
      objectReference: {fileID: 0}
    - target: {fileID: 5051974980576173104, guid: ee6c2bf1d6d1d1d418c6cf1b7d872134, type: 3}
      propertyPath: m_SizeDelta.y
      value: 18
      objectReference: {fileID: 0}
    - target: {fileID: 5051974980576173104, guid: ee6c2bf1d6d1d1d418c6cf1b7d872134, type: 3}
      propertyPath: m_LocalPosition.x
      value: 0
      objectReference: {fileID: 0}
    - target: {fileID: 5051974980576173104, guid: ee6c2bf1d6d1d1d418c6cf1b7d872134, type: 3}
      propertyPath: m_LocalPosition.y
      value: 0
      objectReference: {fileID: 0}
    - target: {fileID: 5051974980576173104, guid: ee6c2bf1d6d1d1d418c6cf1b7d872134, type: 3}
      propertyPath: m_LocalPosition.z
      value: 0
      objectReference: {fileID: 0}
    - target: {fileID: 5051974980576173104, guid: ee6c2bf1d6d1d1d418c6cf1b7d872134, type: 3}
      propertyPath: m_LocalRotation.w
      value: 1
      objectReference: {fileID: 0}
    - target: {fileID: 5051974980576173104, guid: ee6c2bf1d6d1d1d418c6cf1b7d872134, type: 3}
      propertyPath: m_LocalRotation.x
      value: -0
      objectReference: {fileID: 0}
    - target: {fileID: 5051974980576173104, guid: ee6c2bf1d6d1d1d418c6cf1b7d872134, type: 3}
      propertyPath: m_LocalRotation.y
      value: -0
      objectReference: {fileID: 0}
    - target: {fileID: 5051974980576173104, guid: ee6c2bf1d6d1d1d418c6cf1b7d872134, type: 3}
      propertyPath: m_LocalRotation.z
      value: -0
      objectReference: {fileID: 0}
    - target: {fileID: 5051974980576173104, guid: ee6c2bf1d6d1d1d418c6cf1b7d872134, type: 3}
      propertyPath: m_AnchoredPosition.x
      value: 0
      objectReference: {fileID: 0}
    - target: {fileID: 5051974980576173104, guid: ee6c2bf1d6d1d1d418c6cf1b7d872134, type: 3}
      propertyPath: m_AnchoredPosition.y
      value: 0
      objectReference: {fileID: 0}
    - target: {fileID: 5051974980576173104, guid: ee6c2bf1d6d1d1d418c6cf1b7d872134, type: 3}
      propertyPath: m_LocalEulerAnglesHint.x
      value: 0
      objectReference: {fileID: 0}
    - target: {fileID: 5051974980576173104, guid: ee6c2bf1d6d1d1d418c6cf1b7d872134, type: 3}
      propertyPath: m_LocalEulerAnglesHint.y
      value: 0
      objectReference: {fileID: 0}
    - target: {fileID: 5051974980576173104, guid: ee6c2bf1d6d1d1d418c6cf1b7d872134, type: 3}
      propertyPath: m_LocalEulerAnglesHint.z
      value: 0
      objectReference: {fileID: 0}
    m_RemovedComponents: []
  m_SourcePrefab: {fileID: 100100000, guid: ee6c2bf1d6d1d1d418c6cf1b7d872134, type: 3}
--- !u!114 &3383981339460380559 stripped
MonoBehaviour:
  m_CorrespondingSourceObject: {fileID: 5180915580598906246, guid: ee6c2bf1d6d1d1d418c6cf1b7d872134, type: 3}
  m_PrefabInstance: {fileID: 7570584355067939337}
  m_PrefabAsset: {fileID: 0}
  m_GameObject: {fileID: 0}
  m_Enabled: 1
  m_EditorHideFlags: 0
  m_Script: {fileID: 11500000, guid: a366d4b35db54f7187e3b5ee1b7508fb, type: 3}
  m_Name: 
  m_EditorClassIdentifier: 
--- !u!114 &6577689725313898046 stripped
MonoBehaviour:
  m_CorrespondingSourceObject: {fileID: 3627855833194699831, guid: ee6c2bf1d6d1d1d418c6cf1b7d872134, type: 3}
  m_PrefabInstance: {fileID: 7570584355067939337}
  m_PrefabAsset: {fileID: 0}
  m_GameObject: {fileID: 0}
  m_Enabled: 1
  m_EditorHideFlags: 0
  m_Script: {fileID: 11500000, guid: 76dfbda135f95df4da4d262dfe85a98c, type: 3}
  m_Name: 
  m_EditorClassIdentifier: 
