%YAML 1.1
%TAG !u! tag:unity3d.com,2011:
--- !u!114 &11400000
MonoBehaviour:
  m_ObjectHideFlags: 0
  m_CorrespondingSourceObject: {fileID: 0}
  m_PrefabInstance: {fileID: 0}
  m_PrefabAsset: {fileID: 0}
  m_GameObject: {fileID: 0}
  m_Enabled: 1
  m_EditorHideFlags: 0
  m_Script: {fileID: 11500000, guid: cbd94935d9d94e168e5e431afed4471e, type: 3}
  m_Name: HeroJackImpactUIConfig_Ultimate
  m_EditorClassIdentifier: 
  _config: {fileID: 11400000, guid: 765192d8ad07743d2a5d10e977ce8a98, type: 2}
  <Name>k__BackingField: Command Link
  <Description>k__BackingField: Creates a bond with allies that grants empowering
    buffs while the bond is active.
  <Icon>k__BackingField: {fileID: 21300000, guid: 5ef5f0c77c1211349ae72d169a663bff, type: 3}
