%YAML 1.1
%TAG !u! tag:unity3d.com,2011:
--- !u!1001 &6353239791204356762
PrefabInstance:
  m_ObjectHideFlags: 0
  serializedVersion: 2
  m_Modification:
    m_TransformParent: {fileID: 0}
    m_Modifications:
    - target: {fileID: 5368461874573037876, guid: 4a80d937985eb44c898fee607df57972, type: 3}
      propertyPath: m_Enabled
      value: 0
      objectReference: {fileID: 0}
    - target: {fileID: 7512322289545169226, guid: 4a80d937985eb44c898fee607df57972, type: 3}
      propertyPath: m_RootOrder
      value: 0
      objectReference: {fileID: 0}
    - target: {fileID: 7512322289545169226, guid: 4a80d937985eb44c898fee607df57972, type: 3}
      propertyPath: m_LocalEulerAnglesHint.x
      value: 0
      objectReference: {fileID: 0}
    - target: {fileID: 7512322289545169226, guid: 4a80d937985eb44c898fee607df57972, type: 3}
      propertyPath: m_LocalEulerAnglesHint.y
      value: 0
      objectReference: {fileID: 0}
    - target: {fileID: 7512322289545169226, guid: 4a80d937985eb44c898fee607df57972, type: 3}
      propertyPath: m_LocalEulerAnglesHint.z
      value: 0
      objectReference: {fileID: 0}
    - target: {fileID: 7512322289545169229, guid: 4a80d937985eb44c898fee607df57972, type: 3}
      propertyPath: m_Name
      value: CrusherAffectZone_Ability_2_Sector
      objectReference: {fileID: 0}
    - target: {fileID: 7512322291182033560, guid: 4a80d937985eb44c898fee607df57972, type: 3}
      propertyPath: m_LocalScale.x
      value: 7.3341484
      objectReference: {fileID: 0}
    - target: {fileID: 7512322291182033560, guid: 4a80d937985eb44c898fee607df57972, type: 3}
      propertyPath: m_LocalScale.y
      value: 5.4
      objectReference: {fileID: 0}
    - target: {fileID: 7512322291182033560, guid: 4a80d937985eb44c898fee607df57972, type: 3}
      propertyPath: m_LocalPosition.z
      value: 0.5
      objectReference: {fileID: 0}
    - target: {fileID: 7512322291182033560, guid: 4a80d937985eb44c898fee607df57972, type: 3}
      propertyPath: m_LocalEulerAnglesHint.y
      value: -90
      objectReference: {fileID: 0}
    m_RemovedComponents: []
  m_SourcePrefab: {fileID: 100100000, guid: 4a80d937985eb44c898fee607df57972, type: 3}
