%YAML 1.1
%TAG !u! tag:unity3d.com,2011:
--- !u!1001 &7159791636658379549
PrefabInstance:
  m_ObjectHideFlags: 0
  serializedVersion: 2
  m_Modification:
    m_TransformParent: {fileID: 0}
    m_Modifications:
    - target: {fileID: 7512322289545169226, guid: 61b89cea61446456cb1f73f1c19c47a3, type: 3}
      propertyPath: m_RootOrder
      value: 0
      objectReference: {fileID: 0}
    - target: {fileID: 7512322289545169226, guid: 61b89cea61446456cb1f73f1c19c47a3, type: 3}
      propertyPath: m_LocalPosition.x
      value: 0
      objectReference: {fileID: 0}
    - target: {fileID: 7512322289545169226, guid: 61b89cea61446456cb1f73f1c19c47a3, type: 3}
      propertyPath: m_LocalPosition.y
      value: 0
      objectReference: {fileID: 0}
    - target: {fileID: 7512322289545169226, guid: 61b89cea61446456cb1f73f1c19c47a3, type: 3}
      propertyPath: m_LocalPosition.z
      value: 0
      objectReference: {fileID: 0}
    - target: {fileID: 7512322289545169226, guid: 61b89cea61446456cb1f73f1c19c47a3, type: 3}
      propertyPath: m_LocalRotation.w
      value: 1
      objectReference: {fileID: 0}
    - target: {fileID: 7512322289545169226, guid: 61b89cea61446456cb1f73f1c19c47a3, type: 3}
      propertyPath: m_LocalRotation.x
      value: 0
      objectReference: {fileID: 0}
    - target: {fileID: 7512322289545169226, guid: 61b89cea61446456cb1f73f1c19c47a3, type: 3}
      propertyPath: m_LocalRotation.y
      value: 0
      objectReference: {fileID: 0}
    - target: {fileID: 7512322289545169226, guid: 61b89cea61446456cb1f73f1c19c47a3, type: 3}
      propertyPath: m_LocalRotation.z
      value: 0
      objectReference: {fileID: 0}
    - target: {fileID: 7512322289545169226, guid: 61b89cea61446456cb1f73f1c19c47a3, type: 3}
      propertyPath: m_LocalEulerAnglesHint.x
      value: 0
      objectReference: {fileID: 0}
    - target: {fileID: 7512322289545169226, guid: 61b89cea61446456cb1f73f1c19c47a3, type: 3}
      propertyPath: m_LocalEulerAnglesHint.y
      value: 0
      objectReference: {fileID: 0}
    - target: {fileID: 7512322289545169226, guid: 61b89cea61446456cb1f73f1c19c47a3, type: 3}
      propertyPath: m_LocalEulerAnglesHint.z
      value: 0
      objectReference: {fileID: 0}
    - target: {fileID: 7512322289545169229, guid: 61b89cea61446456cb1f73f1c19c47a3, type: 3}
      propertyPath: m_Name
      value: PatriciaAffectZoneFillable
      objectReference: {fileID: 0}
    - target: {fileID: 7512322291182033560, guid: 61b89cea61446456cb1f73f1c19c47a3, type: 3}
      propertyPath: m_LocalScale.x
      value: 7.4
      objectReference: {fileID: 0}
    - target: {fileID: 7512322291182033560, guid: 61b89cea61446456cb1f73f1c19c47a3, type: 3}
      propertyPath: m_LocalScale.y
      value: 7.4
      objectReference: {fileID: 0}
    - target: {fileID: 7512322291182033560, guid: 61b89cea61446456cb1f73f1c19c47a3, type: 3}
      propertyPath: m_LocalScale.z
      value: 7.4
      objectReference: {fileID: 0}
    m_RemovedComponents: []
  m_SourcePrefab: {fileID: 100100000, guid: 61b89cea61446456cb1f73f1c19c47a3, type: 3}
