%YAML 1.1
%TAG !u! tag:unity3d.com,2011:
--- !u!114 &11400000
MonoBehaviour:
  m_ObjectHideFlags: 0
  m_CorrespondingSourceObject: {fileID: 0}
  m_PrefabInstance: {fileID: 0}
  m_PrefabAsset: {fileID: 0}
  m_GameObject: {fileID: 0}
  m_Enabled: 1
  m_EditorHideFlags: 0
  m_Script: {fileID: 11500000, guid: 66c857b9dd0f4ca49505eef26ae616a9, type: 3}
  m_Name: ZombieCrusherConfig_Phase2
  m_EditorClassIdentifier: 
  <Id>k__BackingField: boss_crusher_2
  <Name>k__BackingField: 
  <Sprite>k__BackingField: {fileID: 0}
  <Class>k__BackingField: 0
  <RoleIcon>k__BackingField: {fileID: 0}
  <GoldRoleIcon>k__BackingField: {fileID: 0}
  <IsBoss>k__BackingField: 1
  <View>k__BackingField: {fileID: 8887498222900235131, guid: b07484f5bcf82b545b334fa8c2dcb6cb, type: 3}
  <ViewConfig>k__BackingField: {fileID: 1068684761356309, guid: 657358b5f35a1c049b7c8a111f49af56, type: 3}
  <ClientModule>k__BackingField: {fileID: 0}
  <ServerModule>k__BackingField: {fileID: 0}
  <UnitAIConfig>k__BackingField: {fileID: 11400000, guid: 6ee5697ae01e44baeba70705c92a136b, type: 2}
  <UnitPhaseConfig>k__BackingField: {fileID: 11400000, guid: 801c151d1bb8445058cdb37bc637bd94, type: 2}
  <Phase>k__BackingField: 2
  <UnitActionRoster>k__BackingField: {fileID: 11400000, guid: dcf82193613859b40a01ba38f2e9192c, type: 2}
  <UpgradeTable>k__BackingField: {fileID: 11400000, guid: 7d7ccd6edaf397346a06f5bd721c8614, type: 2}
  <BodyMass>k__BackingField: 100000
  _damageMultipliers:
  - _type: 3
    _multiplier: 0.1
  <DeathRewards>k__BackingField:
    <Exp>k__BackingField: 200
    <EnergyCapsule>k__BackingField:
      <Energy>k__BackingField: 50
      <DropChance>k__BackingField: 0
      <MaxRandomPositionOffset>k__BackingField: 0.7
    _lootSet: {fileID: 11400000, guid: 9d45ccd6ca3ac9140ad7f512c61969ff, type: 2}
  <DefaultWeapon>k__BackingField: {fileID: 0}
  <DefaultMeleeWeapon>k__BackingField: {fileID: 0}
  <GearScore>k__BackingField: 10
  <Health>k__BackingField: 28000
  <Stamina>k__BackingField: 0
  <Energy>k__BackingField: 100
  <Speed>k__BackingField: 4
  <TurnSpeed>k__BackingField: 500
  <HpAutoRecovery>k__BackingField:
    <PercentPerSecond>k__BackingField: 0
    <DamageCooldown>k__BackingField: 0
  <EnergyAutoRecovery>k__BackingField:
    <Speed>k__BackingField: 7
  <StaminaAutoRecovery>k__BackingField:
    <Speed>k__BackingField: 0
  <Impacts>k__BackingField:
    _death:
      _config: {fileID: 0}
      _delayVariant: 0
      _delay: 0
      _cooldown: 0
    _ultimate:
      _config: {fileID: 11400000, guid: 4d32909f2ba174a9ea556c6c55c69546, type: 2}
      _delayVariant: 0
      _delay: 0
      _cooldown: 0
    _ability:
      _config: {fileID: 11400000, guid: fa1ce2b4eec6e4c23b224b85eebb3880, type: 2}
      _delayVariant: 0
      _delay: 0
      _cooldown: 3
    _extraAbility:
      _config: {fileID: 11400000, guid: 98ddc6af216344a9b8e98072b9c42a6a, type: 2}
      _delayVariant: 0
      _delay: 0
      _cooldown: 13
    _special:
      _config: {fileID: 0}
      _delayVariant: 0
      _delay: 0
      _cooldown: 0
