%YAML 1.1
%TAG !u! tag:unity3d.com,2011:
--- !u!114 &11400000
MonoBehaviour:
  m_ObjectHideFlags: 0
  m_CorrespondingSourceObject: {fileID: 0}
  m_PrefabInstance: {fileID: 0}
  m_PrefabAsset: {fileID: 0}
  m_GameObject: {fileID: 0}
  m_Enabled: 1
  m_EditorHideFlags: 0
  m_Script: {fileID: 11500000, guid: c98c00d0470b4f09ad8903a477a07319, type: 3}
  m_Name: Tutorial_ph1_1_ArenaConfig
  m_EditorClassIdentifier: 
  <Id>k__BackingField: BotArenaConfig_025a2c28-8194-454a-8ace-32196635cdf1
  _activityConfigs:
  - {fileID: 11400000, guid: d5f54cd249a348d4192da8b253fdeab1, type: 2}
  - {fileID: 11400000, guid: 0bd8094b775078f4392589b15ced4b23, type: 2}
  - {fileID: 11400000, guid: 686534693db4ecd4089bd0e18cd2b0df, type: 2}
  - {fileID: 11400000, guid: b1043f7e8b0b68f4daf148f5a64815fc, type: 2}
  _respawnData:
    _respawnTypeFlags: 3
    _respawnTimerInterval: 5
    _invincibleDuration: 1
