%YAML 1.1
%TAG !u! tag:unity3d.com,2011:
--- !u!114 &11400000
MonoBehaviour:
  m_ObjectHideFlags: 0
  m_CorrespondingSourceObject: {fileID: 0}
  m_PrefabInstance: {fileID: 0}
  m_PrefabAsset: {fileID: 0}
  m_GameObject: {fileID: 0}
  m_Enabled: 1
  m_EditorHideFlags: 0
  m_Script: {fileID: 11500000, guid: c98c00d0470b4f09ad8903a477a07319, type: 3}
  m_Name: Tutorial_ph1_0_ArenaConfig
  m_EditorClassIdentifier: 
  <Id>k__BackingField: BotArenaConfig_9784e552-03b2-4679-89ab-3877c113edca
  _activityConfigs:
  - {fileID: 11400000, guid: ee1ea7379f5b39340ac8985db0d4ca25, type: 2}
  _respawnData:
    _respawnTypeFlags: 3
    _respawnTimerInterval: 5
    _invincibleDuration: 1
