%YAML 1.1
%TAG !u! tag:unity3d.com,2011:
--- !u!114 &11400000
MonoBehaviour:
  m_ObjectHideFlags: 0
  m_CorrespondingSourceObject: {fileID: 0}
  m_PrefabInstance: {fileID: 0}
  m_PrefabAsset: {fileID: 0}
  m_GameObject: {fileID: 0}
  m_Enabled: 1
  m_EditorHideFlags: 0
  m_Script: {fileID: 11500000, guid: 0cb4e07232dd44f789a1a03cf5d48ca4, type: 3}
  m_Name: Arena4_MoveToPoint_ActivityConfig
  m_EditorClassIdentifier: 
  <Id>k__BackingField: ActivityConfig_54d5a712-e6d4-4480-9d22-d0854dc7c0a1
  _taskSequence:
    _nodes:
    - _config: {fileID: 11400000, guid: 13e76b12be35c44e8be0614935ea7ff1, type: 2}
