%YAML 1.1
%TAG !u! tag:unity3d.com,2011:
--- !u!78 &1
TagManager:
  serializedVersion: 2
  tags:
  - BattleCamera
  - Bot
  - Cart
  layers:
  - Default
  - TransparentFX
  - Ignore Raycast
  - DynamicMesh
  - Water
  - UI
  - 
  - UnitTrigger
  - 
  - Unit
  - LootBoxCollector
  - LootBox
  - EnergyCapsuleCollector
  - EnergyCapsule
  - 
  - 
  - SpawnSystem
  - CameraBlocker
  - 
  - SpawnBlockZone
  - UnitBodyPartCollider
  - PassableAimTarget
  - ImpassableAimTarget
  - Shield
  - MoveBlock
  - MovableObstacle
  - 
  - 
  - 
  - 
  - 
  - 
  m_SortingLayers:
  - name: Default
    uniqueID: 0
    locked: 0
