%YAML 1.1
%TAG !u! tag:unity3d.com,2011:
--- !u!114 &11400000
MonoBehaviour:
  m_ObjectHideFlags: 0
  m_CorrespondingSourceObject: {fileID: 0}
  m_PrefabInstance: {fileID: 0}
  m_PrefabAsset: {fileID: 0}
  m_GameObject: {fileID: 0}
  m_Enabled: 1
  m_EditorHideFlags: 0
  m_Script: {fileID: 11500000, guid: cbd94935d9d94e168e5e431afed4471e, type: 3}
  m_Name: HeroTaylorImpactUIConfig_ExtraAbility
  m_EditorClassIdentifier: 
  _config: {fileID: 11400000, guid: 986d99916e0a8e4418bd28371b14d987, type: 2}
  <Name>k__BackingField: Wall of Fire
  <Description>k__BackingField: Creates a stationary field, shooting through which
    inflicts burning on enemies.
  <Icon>k__BackingField: {fileID: 21300000, guid: b2187b78a20b5e64590405f8b2a5df71, type: 3}
