%YAML 1.1
%TAG !u! tag:unity3d.com,2011:
--- !u!114 &11400000
MonoBehaviour:
  m_ObjectHideFlags: 0
  m_CorrespondingSourceObject: {fileID: 0}
  m_PrefabInstance: {fileID: 0}
  m_PrefabAsset: {fileID: 0}
  m_GameObject: {fileID: 0}
  m_Enabled: 1
  m_EditorHideFlags: 0
  m_Script: {fileID: 11500000, guid: a2f9b21bf40a4e28a7f3d02125b85d95, type: 3}
  m_Name: HeroKadzuoImpact_Ability
  m_EditorClassIdentifier: 
  <Id>k__BackingField: hero_kadzuo_ability
  _castData:
    <CanMove>k__BackingField: 1
    <Duration>k__BackingField: 0.8
  _aiConditions:
    _aiEnabled: 1
    _onlyAttackState: 1
    _enemyRadius: 15
    _enemyWeightMinLimit: 3
    _allyRadius: 0
    _allyHealthMinLimit: 0
  _effects:
  - <Id>k__BackingField: effect_enemy
    <RepeatsData>k__BackingField:
      _type: 1
      _repeatsCount: 5
      _repeatDelay: 2
    <TargetData>k__BackingField:
      _type: 1
      _filterData:
        _filterParams:
          UnitTypeSelector: 2
          PlayerTypeSelector: 0
          PropertiesSelector:
          - Property: 0
            Condition: 2
        _orderedAvailableTypes: 01000000
      _detectionData:
        _type: 0
        _value1: 15
        _value2: 0
        _rotation: 0
        _offset: {x: 0, y: 0, z: 0}
        _maxTargets: 2147483647
    <ActivationData>k__BackingField:
      _type: 0
      _delay: 0
      _delayByDistance:
        serializedVersion: 2
        m_Curve: []
        m_PreInfinity: 2
        m_PostInfinity: 2
        m_RotationOrder: 4
    <AffectAreaData>k__BackingField:
      _type: 0
      _value1: 0
      _value2: 0
      _rotation: 0
      _offset: {x: 0, y: 0, z: 0}
    _affectData:
    - _repeatsPerTarget:
        <Type>k__BackingField: 0
        <ExactCount>k__BackingField: 1
        <UseLimits>k__BackingField: 0
        <Limits>k__BackingField: {x: 0, y: 0}
      _type: 0
      _buffs:
      - {fileID: 11400000, guid: a0577fc036ec57e46a646894f6930a62, type: 2}
      _unitEffectReplacements: []
      _health: 0
      _healPercent: 0
      _statDurationData:
        _type: 0
        _duration: 0
        _repeatCount: 0
        _repeatCooldown: 0
      _prefab: {fileID: 0}
      _prefabOffsetData:
        _type: 0
        _radius: 0
      _unitActions: []
  - <Id>k__BackingField: effect_self
    <RepeatsData>k__BackingField:
      _type: 0
      _repeatsCount: 0
      _repeatDelay: 0
    <TargetData>k__BackingField:
      _type: 0
      _filterData:
        _filterParams:
          UnitTypeSelector: 1
          PlayerTypeSelector: 1
          PropertiesSelector: []
        _orderedAvailableTypes: 
      _detectionData:
        _type: 1
        _value1: 0
        _value2: 0
        _rotation: 0
        _offset: {x: 0, y: 0, z: 0}
        _maxTargets: 2147483647
    <ActivationData>k__BackingField:
      _type: 0
      _delay: 0
      _delayByDistance:
        serializedVersion: 2
        m_Curve: []
        m_PreInfinity: 2
        m_PostInfinity: 2
        m_RotationOrder: 4
    <AffectAreaData>k__BackingField:
      _type: 0
      _value1: 0
      _value2: 0
      _rotation: 0
      _offset: {x: 0, y: 0, z: 0}
    _affectData:
    - _repeatsPerTarget:
        <Type>k__BackingField: 0
        <ExactCount>k__BackingField: 1
        <UseLimits>k__BackingField: 0
        <Limits>k__BackingField: {x: 0, y: 0}
      _type: 0
      _buffs:
      - {fileID: 11400000, guid: 6a8c043a16d577445beb0cec89cc5ffb, type: 2}
      _unitEffectReplacements: []
      _health: 0
      _healPercent: 0
      _statDurationData:
        _type: 0
        _duration: 0
        _repeatCount: 0
        _repeatCooldown: 0
      _prefab: {fileID: 0}
      _prefabOffsetData:
        _type: 0
        _radius: 0
      _unitActions: []
