%YAML 1.1
%TAG !u! tag:unity3d.com,2011:
--- !u!114 &11400000
MonoBehaviour:
  m_ObjectHideFlags: 0
  m_CorrespondingSourceObject: {fileID: 0}
  m_PrefabInstance: {fileID: 0}
  m_PrefabAsset: {fileID: 0}
  m_GameObject: {fileID: 0}
  m_Enabled: 1
  m_EditorHideFlags: 0
  m_Script: {fileID: 11500000, guid: 0cb4e07232dd44f789a1a03cf5d48ca4, type: 3}
  m_Name: TestScene3_ActivityConfig
  m_EditorClassIdentifier: 
  <Id>k__BackingField: ActivityConfig_43e34039-7338-4548-a289-76f5fefde8b0
  _taskSequence:
    _nodes:
    - _config: {fileID: 11400000, guid: 6c001f8fe22706e4094c255303421d82, type: 2}
