%YAML 1.1
%TAG !u! tag:unity3d.com,2011:
--- !u!1001 &7659453635246349602
PrefabInstance:
  m_ObjectHideFlags: 0
  serializedVersion: 2
  m_Modification:
    m_TransformParent: {fileID: 0}
    m_Modifications:
    - target: {fileID: 1602341907133395176, guid: 8b7e3ab7c0415487bac0ef30a6141642, type: 3}
      propertyPath: Offset.y
      value: 0.35
      objectReference: {fileID: 0}
    - target: {fileID: 2197840482707385659, guid: 8b7e3ab7c0415487bac0ef30a6141642, type: 3}
      propertyPath: m_text
      value: +
      objectReference: {fileID: 0}
    - target: {fileID: 2197840482707385659, guid: 8b7e3ab7c0415487bac0ef30a6141642, type: 3}
      propertyPath: m_fontColor.b
      value: 0.0990566
      objectReference: {fileID: 0}
    - target: {fileID: 2197840482707385659, guid: 8b7e3ab7c0415487bac0ef30a6141642, type: 3}
      propertyPath: m_fontColor.g
      value: 1
      objectReference: {fileID: 0}
    - target: {fileID: 2197840482707385659, guid: 8b7e3ab7c0415487bac0ef30a6141642, type: 3}
      propertyPath: m_fontColor.r
      value: 0.18051046
      objectReference: {fileID: 0}
    - target: {fileID: 2197840482707385659, guid: 8b7e3ab7c0415487bac0ef30a6141642, type: 3}
      propertyPath: m_fontColor32.rgba
      value: 4279893806
      objectReference: {fileID: 0}
    - target: {fileID: 2904663987788851590, guid: 8b7e3ab7c0415487bac0ef30a6141642, type: 3}
      propertyPath: m_AnchorMax.y
      value: 0
      objectReference: {fileID: 0}
    - target: {fileID: 2904663987788851590, guid: 8b7e3ab7c0415487bac0ef30a6141642, type: 3}
      propertyPath: m_AnchorMin.y
      value: 0
      objectReference: {fileID: 0}
    - target: {fileID: 2904663987788851590, guid: 8b7e3ab7c0415487bac0ef30a6141642, type: 3}
      propertyPath: m_SizeDelta.x
      value: 0
      objectReference: {fileID: 0}
    - target: {fileID: 2904663987788851590, guid: 8b7e3ab7c0415487bac0ef30a6141642, type: 3}
      propertyPath: m_SizeDelta.y
      value: 0
      objectReference: {fileID: 0}
    - target: {fileID: 2904663987788851590, guid: 8b7e3ab7c0415487bac0ef30a6141642, type: 3}
      propertyPath: m_AnchoredPosition.x
      value: 0
      objectReference: {fileID: 0}
    - target: {fileID: 2904663987788851590, guid: 8b7e3ab7c0415487bac0ef30a6141642, type: 3}
      propertyPath: m_AnchoredPosition.y
      value: 0
      objectReference: {fileID: 0}
    - target: {fileID: 4133869307333062083, guid: 8b7e3ab7c0415487bac0ef30a6141642, type: 3}
      propertyPath: m_AnchorMax.y
      value: 0
      objectReference: {fileID: 0}
    - target: {fileID: 4133869307333062083, guid: 8b7e3ab7c0415487bac0ef30a6141642, type: 3}
      propertyPath: m_AnchorMin.y
      value: 0
      objectReference: {fileID: 0}
    - target: {fileID: 4133869307333062083, guid: 8b7e3ab7c0415487bac0ef30a6141642, type: 3}
      propertyPath: m_SizeDelta.x
      value: 0
      objectReference: {fileID: 0}
    - target: {fileID: 4133869307333062083, guid: 8b7e3ab7c0415487bac0ef30a6141642, type: 3}
      propertyPath: m_SizeDelta.y
      value: 0
      objectReference: {fileID: 0}
    - target: {fileID: 4133869307333062083, guid: 8b7e3ab7c0415487bac0ef30a6141642, type: 3}
      propertyPath: m_AnchoredPosition.x
      value: 0
      objectReference: {fileID: 0}
    - target: {fileID: 4133869307333062083, guid: 8b7e3ab7c0415487bac0ef30a6141642, type: 3}
      propertyPath: m_AnchoredPosition.y
      value: 0
      objectReference: {fileID: 0}
    - target: {fileID: 4765135182420249896, guid: 8b7e3ab7c0415487bac0ef30a6141642, type: 3}
      propertyPath: m_fontColor.b
      value: 0.0990566
      objectReference: {fileID: 0}
    - target: {fileID: 4765135182420249896, guid: 8b7e3ab7c0415487bac0ef30a6141642, type: 3}
      propertyPath: m_fontColor.g
      value: 1
      objectReference: {fileID: 0}
    - target: {fileID: 4765135182420249896, guid: 8b7e3ab7c0415487bac0ef30a6141642, type: 3}
      propertyPath: m_fontColor.r
      value: 0.18051046
      objectReference: {fileID: 0}
    - target: {fileID: 4765135182420249896, guid: 8b7e3ab7c0415487bac0ef30a6141642, type: 3}
      propertyPath: m_fontColor32.rgba
      value: 4279893806
      objectReference: {fileID: 0}
    - target: {fileID: 5100649043046063059, guid: 8b7e3ab7c0415487bac0ef30a6141642, type: 3}
      propertyPath: m_Pivot.x
      value: 0.5
      objectReference: {fileID: 0}
    - target: {fileID: 5100649043046063059, guid: 8b7e3ab7c0415487bac0ef30a6141642, type: 3}
      propertyPath: m_Pivot.y
      value: 0.5
      objectReference: {fileID: 0}
    - target: {fileID: 5100649043046063059, guid: 8b7e3ab7c0415487bac0ef30a6141642, type: 3}
      propertyPath: m_RootOrder
      value: 0
      objectReference: {fileID: 0}
    - target: {fileID: 5100649043046063059, guid: 8b7e3ab7c0415487bac0ef30a6141642, type: 3}
      propertyPath: m_AnchorMax.x
      value: 0.5
      objectReference: {fileID: 0}
    - target: {fileID: 5100649043046063059, guid: 8b7e3ab7c0415487bac0ef30a6141642, type: 3}
      propertyPath: m_AnchorMax.y
      value: 0.5
      objectReference: {fileID: 0}
    - target: {fileID: 5100649043046063059, guid: 8b7e3ab7c0415487bac0ef30a6141642, type: 3}
      propertyPath: m_AnchorMin.x
      value: 0.5
      objectReference: {fileID: 0}
    - target: {fileID: 5100649043046063059, guid: 8b7e3ab7c0415487bac0ef30a6141642, type: 3}
      propertyPath: m_AnchorMin.y
      value: 0.5
      objectReference: {fileID: 0}
    - target: {fileID: 5100649043046063059, guid: 8b7e3ab7c0415487bac0ef30a6141642, type: 3}
      propertyPath: m_SizeDelta.x
      value: 0
      objectReference: {fileID: 0}
    - target: {fileID: 5100649043046063059, guid: 8b7e3ab7c0415487bac0ef30a6141642, type: 3}
      propertyPath: m_SizeDelta.y
      value: 0
      objectReference: {fileID: 0}
    - target: {fileID: 5100649043046063059, guid: 8b7e3ab7c0415487bac0ef30a6141642, type: 3}
      propertyPath: m_LocalPosition.x
      value: 0
      objectReference: {fileID: 0}
    - target: {fileID: 5100649043046063059, guid: 8b7e3ab7c0415487bac0ef30a6141642, type: 3}
      propertyPath: m_LocalPosition.y
      value: 0
      objectReference: {fileID: 0}
    - target: {fileID: 5100649043046063059, guid: 8b7e3ab7c0415487bac0ef30a6141642, type: 3}
      propertyPath: m_LocalPosition.z
      value: 0
      objectReference: {fileID: 0}
    - target: {fileID: 5100649043046063059, guid: 8b7e3ab7c0415487bac0ef30a6141642, type: 3}
      propertyPath: m_LocalRotation.w
      value: 1
      objectReference: {fileID: 0}
    - target: {fileID: 5100649043046063059, guid: 8b7e3ab7c0415487bac0ef30a6141642, type: 3}
      propertyPath: m_LocalRotation.x
      value: 0
      objectReference: {fileID: 0}
    - target: {fileID: 5100649043046063059, guid: 8b7e3ab7c0415487bac0ef30a6141642, type: 3}
      propertyPath: m_LocalRotation.y
      value: 0
      objectReference: {fileID: 0}
    - target: {fileID: 5100649043046063059, guid: 8b7e3ab7c0415487bac0ef30a6141642, type: 3}
      propertyPath: m_LocalRotation.z
      value: 0
      objectReference: {fileID: 0}
    - target: {fileID: 5100649043046063059, guid: 8b7e3ab7c0415487bac0ef30a6141642, type: 3}
      propertyPath: m_AnchoredPosition.x
      value: 0
      objectReference: {fileID: 0}
    - target: {fileID: 5100649043046063059, guid: 8b7e3ab7c0415487bac0ef30a6141642, type: 3}
      propertyPath: m_AnchoredPosition.y
      value: 0
      objectReference: {fileID: 0}
    - target: {fileID: 5100649043046063059, guid: 8b7e3ab7c0415487bac0ef30a6141642, type: 3}
      propertyPath: m_LocalEulerAnglesHint.x
      value: 0
      objectReference: {fileID: 0}
    - target: {fileID: 5100649043046063059, guid: 8b7e3ab7c0415487bac0ef30a6141642, type: 3}
      propertyPath: m_LocalEulerAnglesHint.y
      value: 0
      objectReference: {fileID: 0}
    - target: {fileID: 5100649043046063059, guid: 8b7e3ab7c0415487bac0ef30a6141642, type: 3}
      propertyPath: m_LocalEulerAnglesHint.z
      value: 0
      objectReference: {fileID: 0}
    - target: {fileID: 6129638436470945508, guid: 8b7e3ab7c0415487bac0ef30a6141642, type: 3}
      propertyPath: m_SizeDelta.x
      value: 0
      objectReference: {fileID: 0}
    - target: {fileID: 6129638436470945508, guid: 8b7e3ab7c0415487bac0ef30a6141642, type: 3}
      propertyPath: m_SizeDelta.y
      value: 0
      objectReference: {fileID: 0}
    - target: {fileID: 6129638436470945508, guid: 8b7e3ab7c0415487bac0ef30a6141642, type: 3}
      propertyPath: m_LocalScale.x
      value: 0.005
      objectReference: {fileID: 0}
    - target: {fileID: 6129638436470945508, guid: 8b7e3ab7c0415487bac0ef30a6141642, type: 3}
      propertyPath: m_LocalScale.y
      value: 0.005
      objectReference: {fileID: 0}
    - target: {fileID: 6129638436470945508, guid: 8b7e3ab7c0415487bac0ef30a6141642, type: 3}
      propertyPath: m_LocalScale.z
      value: 0.005
      objectReference: {fileID: 0}
    - target: {fileID: 6241125355738072890, guid: 8b7e3ab7c0415487bac0ef30a6141642, type: 3}
      propertyPath: m_AnchorMax.y
      value: 0
      objectReference: {fileID: 0}
    - target: {fileID: 6241125355738072890, guid: 8b7e3ab7c0415487bac0ef30a6141642, type: 3}
      propertyPath: m_AnchorMin.y
      value: 0
      objectReference: {fileID: 0}
    - target: {fileID: 6241125355738072890, guid: 8b7e3ab7c0415487bac0ef30a6141642, type: 3}
      propertyPath: m_SizeDelta.x
      value: 0
      objectReference: {fileID: 0}
    - target: {fileID: 6241125355738072890, guid: 8b7e3ab7c0415487bac0ef30a6141642, type: 3}
      propertyPath: m_SizeDelta.y
      value: 0
      objectReference: {fileID: 0}
    - target: {fileID: 6241125355738072890, guid: 8b7e3ab7c0415487bac0ef30a6141642, type: 3}
      propertyPath: m_AnchoredPosition.x
      value: 0
      objectReference: {fileID: 0}
    - target: {fileID: 6241125355738072890, guid: 8b7e3ab7c0415487bac0ef30a6141642, type: 3}
      propertyPath: m_AnchoredPosition.y
      value: 0
      objectReference: {fileID: 0}
    - target: {fileID: 7928973356861308875, guid: 8b7e3ab7c0415487bac0ef30a6141642, type: 3}
      propertyPath: m_Name
      value: UI_VFX_Health_Item_Heal
      objectReference: {fileID: 0}
    m_RemovedComponents: []
  m_SourcePrefab: {fileID: 100100000, guid: 8b7e3ab7c0415487bac0ef30a6141642, type: 3}
