%YAML 1.1
%TAG !u! tag:unity3d.com,2011:
--- !u!114 &11400000
MonoBehaviour:
  m_ObjectHideFlags: 0
  m_CorrespondingSourceObject: {fileID: 0}
  m_PrefabInstance: {fileID: 0}
  m_PrefabAsset: {fileID: 0}
  m_GameObject: {fileID: 0}
  m_Enabled: 1
  m_EditorHideFlags: 0
  m_Script: {fileID: 11500000, guid: 6c943fc2bd9f47baa5d8103f5ca46720, type: 3}
  m_Name: LowDamageMiniBossL
  m_EditorClassIdentifier: 
  <Id>k__BackingField: LowDamageMiniBossL
  <Name>k__BackingField: 
  <Sprite>k__BackingField: {fileID: 0}
  <Type>k__BackingField: 12
  <AnimationTrigger>k__BackingField: LowDamageL
  <ForwardMoveCurve>k__BackingField:
    serializedVersion: 2
    m_Curve:
    - serializedVersion: 3
      time: 0
      value: 0
      inSlope: 0
      outSlope: 0
      tangentMode: 0
      weightedMode: 0
      inWeight: 0
      outWeight: 0.079921976
    - serializedVersion: 3
      time: 1
      value: 0
      inSlope: 0
      outSlope: 0
      tangentMode: 0
      weightedMode: 0
      inWeight: 0.2294872
      outWeight: 0.33333334
    m_PreInfinity: 2
    m_PostInfinity: 2
    m_RotationOrder: 4
  <StaminaCost>k__BackingField: 0
  _damageImmunity: 0
