%YAML 1.1
%TAG !u! tag:unity3d.com,2011:
--- !u!114 &11400000
MonoBehaviour:
  m_ObjectHideFlags: 0
  m_CorrespondingSourceObject: {fileID: 0}
  m_PrefabInstance: {fileID: 0}
  m_PrefabAsset: {fileID: 0}
  m_GameObject: {fileID: 0}
  m_Enabled: 1
  m_EditorHideFlags: 0
  m_Script: {fileID: 11500000, guid: 1a3b1958c06449609e68d9f83a3fe89c, type: 3}
  m_Name: Arena_2_1_D_Waves
  m_EditorClassIdentifier: 
  <Id>k__BackingField: BotSpawnerConfig_fa713395-940a-4a88-8e12-79e9b498a221
  _isEndless: 0
  _unlimitedUnits: 1
  _maxUnitsInFrame: 0
  _delay: 0
  _autoUnspawnBots: 0
  _waves:
  - _delay: 2
    _repeatsCount: 1
    _waveEndCondition: 1
    _waveEndTime: 0
    _ddaSetups:
    - <DdaLevel>k__BackingField: 1
      _botConfigs:
      - {fileID: 11400000, guid: 0ce26a3a81750f5499a693b3f4d94d90, type: 2}
      - {fileID: 11400000, guid: 0ce26a3a81750f5499a693b3f4d94d90, type: 2}
      - {fileID: 11400000, guid: 0ce26a3a81750f5499a693b3f4d94d90, type: 2}
      - {fileID: 11400000, guid: 0ce26a3a81750f5499a693b3f4d94d90, type: 2}
      - {fileID: 11400000, guid: 0ce26a3a81750f5499a693b3f4d94d90, type: 2}
      - {fileID: 11400000, guid: 0ce26a3a81750f5499a693b3f4d94d90, type: 2}
      - {fileID: 11400000, guid: 52831f0233d5cbe4b8fc92975a36ca29, type: 2}
      - {fileID: 11400000, guid: 52831f0233d5cbe4b8fc92975a36ca29, type: 2}
      - {fileID: 11400000, guid: 46ae1a85c4dede7498d7c34a7a61faed, type: 2}
    - <DdaLevel>k__BackingField: 2
      _botConfigs:
      - {fileID: 11400000, guid: 0ce26a3a81750f5499a693b3f4d94d90, type: 2}
      - {fileID: 11400000, guid: 0ce26a3a81750f5499a693b3f4d94d90, type: 2}
      - {fileID: 11400000, guid: 0ce26a3a81750f5499a693b3f4d94d90, type: 2}
      - {fileID: 11400000, guid: 0ce26a3a81750f5499a693b3f4d94d90, type: 2}
      - {fileID: 11400000, guid: 0ce26a3a81750f5499a693b3f4d94d90, type: 2}
      - {fileID: 11400000, guid: 0ce26a3a81750f5499a693b3f4d94d90, type: 2}
      - {fileID: 11400000, guid: 52831f0233d5cbe4b8fc92975a36ca29, type: 2}
      - {fileID: 11400000, guid: 52831f0233d5cbe4b8fc92975a36ca29, type: 2}
      - {fileID: 11400000, guid: 46ae1a85c4dede7498d7c34a7a61faed, type: 2}
      - {fileID: 11400000, guid: 0ce26a3a81750f5499a693b3f4d94d90, type: 2}
    - <DdaLevel>k__BackingField: 3
      _botConfigs:
      - {fileID: 11400000, guid: 0ce26a3a81750f5499a693b3f4d94d90, type: 2}
      - {fileID: 11400000, guid: 0ce26a3a81750f5499a693b3f4d94d90, type: 2}
      - {fileID: 11400000, guid: 0ce26a3a81750f5499a693b3f4d94d90, type: 2}
      - {fileID: 11400000, guid: 0ce26a3a81750f5499a693b3f4d94d90, type: 2}
      - {fileID: 11400000, guid: 0ce26a3a81750f5499a693b3f4d94d90, type: 2}
      - {fileID: 11400000, guid: 0ce26a3a81750f5499a693b3f4d94d90, type: 2}
      - {fileID: 11400000, guid: 52831f0233d5cbe4b8fc92975a36ca29, type: 2}
      - {fileID: 11400000, guid: 52831f0233d5cbe4b8fc92975a36ca29, type: 2}
      - {fileID: 11400000, guid: 46ae1a85c4dede7498d7c34a7a61faed, type: 2}
      - {fileID: 11400000, guid: 0ce26a3a81750f5499a693b3f4d94d90, type: 2}
      - {fileID: 11400000, guid: 46ae1a85c4dede7498d7c34a7a61faed, type: 2}
