%YAML 1.1
%TAG !u! tag:unity3d.com,2011:
--- !u!114 &11400000
MonoBehaviour:
  m_ObjectHideFlags: 0
  m_CorrespondingSourceObject: {fileID: 0}
  m_PrefabInstance: {fileID: 0}
  m_PrefabAsset: {fileID: 0}
  m_GameObject: {fileID: 0}
  m_Enabled: 1
  m_EditorHideFlags: 0
  m_Script: {fileID: 11500000, guid: 3c63d1f3d142e8d46ba4bcc45528c458, type: 3}
  m_Name: UltimateTaylorIsReady
  m_EditorClassIdentifier: 
  <Id>k__BackingField: UltimateTaylorIsReady
  <Name>k__BackingField: Ultimate is Ready
  <Sprite>k__BackingField: {fileID: 21300000, guid: bdddb233cf5e2bd45a3745a0dc4660d9, type: 3}
  <GlowSprite>k__BackingField: {fileID: 21300000, guid: c48526ab7cc9ae746927eff63ce049d1, type: 3}
  <ShowDuration>k__BackingField: 4
