%YAML 1.1
%TAG !u! tag:unity3d.com,2011:
--- !u!114 &11400000
MonoBehaviour:
  m_ObjectHideFlags: 0
  m_CorrespondingSourceObject: {fileID: 0}
  m_PrefabInstance: {fileID: 0}
  m_PrefabAsset: {fileID: 0}
  m_GameObject: {fileID: 0}
  m_Enabled: 1
  m_EditorHideFlags: 0
  m_Script: {fileID: 11500000, guid: e77afde98abe46d79d5d22fc5d7e8985, type: 3}
  m_Name: KillStreakConfig
  m_EditorClassIdentifier: 
  _killsForBonus: 15
  _streakCooldown: 3
  _bonusConfigs:
  - {fileID: 11400000, guid: f0afcd28688d24d749c1e28fc016b44b, type: 2}
