%YAML 1.1
%TAG !u! tag:unity3d.com,2011:
--- !u!1001 &983471482909297540
PrefabInstance:
  m_ObjectHideFlags: 0
  serializedVersion: 2
  m_Modification:
    m_TransformParent: {fileID: 0}
    m_Modifications:
    - target: {fileID: 2540109765128399425, guid: a0c4cc2688fc0bc4c9cd3970b482ac1d, type: 3}
      propertyPath: m_AssetId
      value: bb6a9bf5655d83d429a3c248f1cf7bec
      objectReference: {fileID: 0}
    - target: {fileID: 2596665702756614462, guid: a0c4cc2688fc0bc4c9cd3970b482ac1d, type: 3}
      propertyPath: m_Name
      value: CartEscortActivity
      objectReference: {fileID: 0}
    - target: {fileID: 4122479403915897241, guid: a0c4cc2688fc0bc4c9cd3970b482ac1d, type: 3}
      propertyPath: m_RootOrder
      value: 0
      objectReference: {fileID: 0}
    - target: {fileID: 4122479403915897241, guid: a0c4cc2688fc0bc4c9cd3970b482ac1d, type: 3}
      propertyPath: m_LocalPosition.x
      value: 0
      objectReference: {fileID: 0}
    - target: {fileID: 4122479403915897241, guid: a0c4cc2688fc0bc4c9cd3970b482ac1d, type: 3}
      propertyPath: m_LocalPosition.y
      value: 0
      objectReference: {fileID: 0}
    - target: {fileID: 4122479403915897241, guid: a0c4cc2688fc0bc4c9cd3970b482ac1d, type: 3}
      propertyPath: m_LocalPosition.z
      value: 0
      objectReference: {fileID: 0}
    - target: {fileID: 4122479403915897241, guid: a0c4cc2688fc0bc4c9cd3970b482ac1d, type: 3}
      propertyPath: m_LocalRotation.w
      value: 1
      objectReference: {fileID: 0}
    - target: {fileID: 4122479403915897241, guid: a0c4cc2688fc0bc4c9cd3970b482ac1d, type: 3}
      propertyPath: m_LocalRotation.x
      value: 0
      objectReference: {fileID: 0}
    - target: {fileID: 4122479403915897241, guid: a0c4cc2688fc0bc4c9cd3970b482ac1d, type: 3}
      propertyPath: m_LocalRotation.y
      value: 0
      objectReference: {fileID: 0}
    - target: {fileID: 4122479403915897241, guid: a0c4cc2688fc0bc4c9cd3970b482ac1d, type: 3}
      propertyPath: m_LocalRotation.z
      value: 0
      objectReference: {fileID: 0}
    - target: {fileID: 4122479403915897241, guid: a0c4cc2688fc0bc4c9cd3970b482ac1d, type: 3}
      propertyPath: m_LocalEulerAnglesHint.x
      value: 0
      objectReference: {fileID: 0}
    - target: {fileID: 4122479403915897241, guid: a0c4cc2688fc0bc4c9cd3970b482ac1d, type: 3}
      propertyPath: m_LocalEulerAnglesHint.y
      value: 0
      objectReference: {fileID: 0}
    - target: {fileID: 4122479403915897241, guid: a0c4cc2688fc0bc4c9cd3970b482ac1d, type: 3}
      propertyPath: m_LocalEulerAnglesHint.z
      value: 0
      objectReference: {fileID: 0}
    - target: {fileID: 4225777306539074809, guid: a0c4cc2688fc0bc4c9cd3970b482ac1d, type: 3}
      propertyPath: _tasksData.Array.size
      value: 1
      objectReference: {fileID: 0}
    - target: {fileID: 4225777306539074809, guid: a0c4cc2688fc0bc4c9cd3970b482ac1d, type: 3}
      propertyPath: _tasksData.Array.data[0]
      value: 
      objectReference: {fileID: 4497208710566779975}
    m_RemovedComponents: []
  m_SourcePrefab: {fileID: 100100000, guid: a0c4cc2688fc0bc4c9cd3970b482ac1d, type: 3}
--- !u!4 &7703883011465885596 stripped
Transform:
  m_CorrespondingSourceObject: {fileID: 7443410949330844696, guid: a0c4cc2688fc0bc4c9cd3970b482ac1d, type: 3}
  m_PrefabInstance: {fileID: 983471482909297540}
  m_PrefabAsset: {fileID: 0}
--- !u!1001 &2922433137468107655
PrefabInstance:
  m_ObjectHideFlags: 0
  serializedVersion: 2
  m_Modification:
    m_TransformParent: {fileID: 7703883011465885596}
    m_Modifications:
    - target: {fileID: 1736225360870392119, guid: 1d866bb69e12b9e408e97fd820cd8018, type: 3}
      propertyPath: m_Name
      value: CartEscort
      objectReference: {fileID: 0}
    - target: {fileID: 3342143834611726487, guid: 1d866bb69e12b9e408e97fd820cd8018, type: 3}
      propertyPath: m_AssetId
      value: bb6a9bf5655d83d429a3c248f1cf7bec
      objectReference: {fileID: 0}
    - target: {fileID: 3527570737405604409, guid: 1d866bb69e12b9e408e97fd820cd8018, type: 3}
      propertyPath: m_AssetId
      value: bb6a9bf5655d83d429a3c248f1cf7bec
      objectReference: {fileID: 0}
    - target: {fileID: 3875148345187152849, guid: 1d866bb69e12b9e408e97fd820cd8018, type: 3}
      propertyPath: m_RootOrder
      value: 0
      objectReference: {fileID: 0}
    - target: {fileID: 3875148345187152849, guid: 1d866bb69e12b9e408e97fd820cd8018, type: 3}
      propertyPath: m_LocalPosition.x
      value: 0
      objectReference: {fileID: 0}
    - target: {fileID: 3875148345187152849, guid: 1d866bb69e12b9e408e97fd820cd8018, type: 3}
      propertyPath: m_LocalPosition.y
      value: 0
      objectReference: {fileID: 0}
    - target: {fileID: 3875148345187152849, guid: 1d866bb69e12b9e408e97fd820cd8018, type: 3}
      propertyPath: m_LocalPosition.z
      value: 0
      objectReference: {fileID: 0}
    - target: {fileID: 3875148345187152849, guid: 1d866bb69e12b9e408e97fd820cd8018, type: 3}
      propertyPath: m_LocalRotation.w
      value: 1
      objectReference: {fileID: 0}
    - target: {fileID: 3875148345187152849, guid: 1d866bb69e12b9e408e97fd820cd8018, type: 3}
      propertyPath: m_LocalRotation.x
      value: 0
      objectReference: {fileID: 0}
    - target: {fileID: 3875148345187152849, guid: 1d866bb69e12b9e408e97fd820cd8018, type: 3}
      propertyPath: m_LocalRotation.y
      value: 0
      objectReference: {fileID: 0}
    - target: {fileID: 3875148345187152849, guid: 1d866bb69e12b9e408e97fd820cd8018, type: 3}
      propertyPath: m_LocalRotation.z
      value: 0
      objectReference: {fileID: 0}
    - target: {fileID: 3875148345187152849, guid: 1d866bb69e12b9e408e97fd820cd8018, type: 3}
      propertyPath: m_LocalEulerAnglesHint.x
      value: 0
      objectReference: {fileID: 0}
    - target: {fileID: 3875148345187152849, guid: 1d866bb69e12b9e408e97fd820cd8018, type: 3}
      propertyPath: m_LocalEulerAnglesHint.y
      value: 0
      objectReference: {fileID: 0}
    - target: {fileID: 3875148345187152849, guid: 1d866bb69e12b9e408e97fd820cd8018, type: 3}
      propertyPath: m_LocalEulerAnglesHint.z
      value: 0
      objectReference: {fileID: 0}
    - target: {fileID: 6789158852795917728, guid: 1d866bb69e12b9e408e97fd820cd8018, type: 3}
      propertyPath: _backgroundColor.b
      value: 1
      objectReference: {fileID: 0}
    - target: {fileID: 6789158852795917728, guid: 1d866bb69e12b9e408e97fd820cd8018, type: 3}
      propertyPath: _backgroundColor.g
      value: 0.7411765
      objectReference: {fileID: 0}
    - target: {fileID: 6789158852795917728, guid: 1d866bb69e12b9e408e97fd820cd8018, type: 3}
      propertyPath: _backgroundColor.r
      value: 0.24313726
      objectReference: {fileID: 0}
    m_RemovedComponents: []
  m_SourcePrefab: {fileID: 100100000, guid: 1d866bb69e12b9e408e97fd820cd8018, type: 3}
--- !u!114 &4497208710566779975 stripped
MonoBehaviour:
  m_CorrespondingSourceObject: {fileID: 1650527528508323776, guid: 1d866bb69e12b9e408e97fd820cd8018, type: 3}
  m_PrefabInstance: {fileID: 2922433137468107655}
  m_PrefabAsset: {fileID: 0}
  m_GameObject: {fileID: 0}
  m_Enabled: 1
  m_EditorHideFlags: 0
  m_Script: {fileID: 11500000, guid: d435da2223d24496b20a21788f6c8f52, type: 3}
  m_Name: 
  m_EditorClassIdentifier: 
