%YAML 1.1
%TAG !u! tag:unity3d.com,2011:
--- !u!221 &22100000
AnimatorOverrideController:
  m_ObjectHideFlags: 0
  m_CorrespondingSourceObject: {fileID: 0}
  m_PrefabInstance: {fileID: 0}
  m_PrefabAsset: {fileID: 0}
  m_Name: ZombieDogDobermanAnimator
  m_Controller: {fileID: 9100000, guid: 76abe7af1517f6342bb75fa3365a59a8, type: 2}
  m_Clips:
  - m_OriginalClip: {fileID: -310949540564020661, guid: e6e985811ff05394b81173f3f8112624, type: 3}
    m_OverrideClip: {fileID: 7400000, guid: 919e1dc08dabcc34ca39eea806f91da2, type: 2}
  - m_OriginalClip: {fileID: 4252389541269213003, guid: e6e985811ff05394b81173f3f8112624, type: 3}
    m_OverrideClip: {fileID: 7400000, guid: de8be46e98ebe2244a04a3c91089e4ac, type: 2}
  - m_OriginalClip: {fileID: 2645761746825683943, guid: e6e985811ff05394b81173f3f8112624, type: 3}
    m_OverrideClip: {fileID: 7400000, guid: de8be46e98ebe2244a04a3c91089e4ac, type: 2}
  - m_OriginalClip: {fileID: -4018235431919141024, guid: e6e985811ff05394b81173f3f8112624, type: 3}
    m_OverrideClip: {fileID: 7400000, guid: 803105ae93ae0c8429f6ce8424b881ab, type: 2}
  - m_OriginalClip: {fileID: 1579887664227891798, guid: e6e985811ff05394b81173f3f8112624, type: 3}
    m_OverrideClip: {fileID: 7400000, guid: f86cc37b5feba04468aeeb40d58cd37c, type: 2}
  - m_OriginalClip: {fileID: 7400000, guid: 796ffef7f1072704dbf2d4b399343311, type: 2}
    m_OverrideClip: {fileID: 7400000, guid: e709e4fc58e516a44873e7bb1aa2c818, type: 2}
  - m_OriginalClip: {fileID: 7400000, guid: a045c33f9212169428767c9382be934a, type: 2}
    m_OverrideClip: {fileID: 7400000, guid: 803105ae93ae0c8429f6ce8424b881ab, type: 2}
