{
    "name": "RiftHuntersInput",
    "maps": [
        {
            "name": "Player",
            "id": "57694fae-9a8b-47d6-aa1a-99786b7609a2",
            "actions": [
                {
                    "name": "Move",
                    "type": "Value",
                    "id": "226f4f72-26cd-41a7-aede-fdb7c7433a87",
                    "expectedControlType": "Vector2",
                    "processors": "NormalizeVector2",
                    "interactions": "",
                    "initialStateCheck": true
                },
                {
                    "name": "Look",
                    "type": "Value",
                    "id": "372bd0ef-0e74-4408-97b9-1fe1d3c6d2b5",
                    "expectedControlType": "Vector2",
                    "processors": "",
                    "interactions": "",
                    "initialStateCheck": true
                },
                {
                    "name": "Reload",
                    "type": "Button",
                    "id": "c815e678-a93c-4040-b572-6fc633af1165",
                    "expectedControlType": "Button",
                    "processors": "",
                    "interactions": "Tap",
                    "initialStateCheck": false
                },
                {
                    "name": "Ability",
                    "type": "Button",
                    "id": "9007ee47-8160-4f92-b7f8-6092b7c56391",
                    "expectedControlType": "Button",
                    "processors": "",
                    "interactions": "Tap(duration=60)",
                    "initialStateCheck": false
                },
                {
                    "name": "ExtraAbility",
                    "type": "Button",
                    "id": "14a807ec-2e54-486e-8f76-b4978e057597",
                    "expectedControlType": "Button",
                    "processors": "",
                    "interactions": "Tap(duration=60)",
                    "initialStateCheck": false
                },
                {
                    "name": "Ultimate",
                    "type": "Button",
                    "id": "320f06db-cdfd-4827-9ba0-2ac14768fd1f",
                    "expectedControlType": "Button",
                    "processors": "",
                    "interactions": "Tap(duration=60)",
                    "initialStateCheck": false
                },
                {
                    "name": "Dodge",
                    "type": "Button",
                    "id": "6f935150-83f2-4567-ab9c-6368689e4d28",
                    "expectedControlType": "Button",
                    "processors": "",
                    "interactions": "Tap",
                    "initialStateCheck": false
                },
                {
                    "name": "Emotion",
                    "type": "Value",
                    "id": "6cd792c1-2186-40cc-a412-d953464f68af",
                    "expectedControlType": "Integer",
                    "processors": "",
                    "interactions": "Press",
                    "initialStateCheck": true
                },
                {
                    "name": "MuteSelfVoice",
                    "type": "Button",
                    "id": "58754b60-aeb3-4a1f-943c-80b9cc804aa2",
                    "expectedControlType": "Button",
                    "processors": "",
                    "interactions": "",
                    "initialStateCheck": false
                },
                {
                    "name": "MuteParticipantsVoice",
                    "type": "Button",
                    "id": "95e08249-ae51-4424-b0b2-baf1319895a2",
                    "expectedControlType": "Button",
                    "processors": "",
                    "interactions": "",
                    "initialStateCheck": false
                }
            ],
            "bindings": [
                {
                    "name": "WASD",
                    "id": "00ca640b-d935-4593-8157-c05846ea39b3",
                    "path": "Dpad",
                    "interactions": "",
                    "processors": "",
                    "groups": "",
                    "action": "Move",
                    "isComposite": true,
                    "isPartOfComposite": false
                },
                {
                    "name": "up",
                    "id": "e2062cb9-1b15-46a2-838c-2f8d72a0bdd9",
                    "path": "<Keyboard>/w",
                    "interactions": "",
                    "processors": "",
                    "groups": "Keyboard&Mouse",
                    "action": "Move",
                    "isComposite": false,
                    "isPartOfComposite": true
                },
                {
                    "name": "up",
                    "id": "8180e8bd-4097-4f4e-ab88-4523101a6ce9",
                    "path": "<Keyboard>/upArrow",
                    "interactions": "",
                    "processors": "",
                    "groups": "Keyboard&Mouse",
                    "action": "Move",
                    "isComposite": false,
                    "isPartOfComposite": true
                },
                {
                    "name": "down",
                    "id": "320bffee-a40b-4347-ac70-c210eb8bc73a",
                    "path": "<Keyboard>/s",
                    "interactions": "",
                    "processors": "",
                    "groups": "Keyboard&Mouse",
                    "action": "Move",
                    "isComposite": false,
                    "isPartOfComposite": true
                },
                {
                    "name": "down",
                    "id": "1c5327b5-f71c-4f60-99c7-4e737386f1d1",
                    "path": "<Keyboard>/downArrow",
                    "interactions": "",
                    "processors": "",
                    "groups": "Keyboard&Mouse",
                    "action": "Move",
                    "isComposite": false,
                    "isPartOfComposite": true
                },
                {
                    "name": "left",
                    "id": "d2581a9b-1d11-4566-b27d-b92aff5fabbc",
                    "path": "<Keyboard>/a",
                    "interactions": "",
                    "processors": "",
                    "groups": "Keyboard&Mouse",
                    "action": "Move",
                    "isComposite": false,
                    "isPartOfComposite": true
                },
                {
                    "name": "left",
                    "id": "2e46982e-44cc-431b-9f0b-c11910bf467a",
                    "path": "<Keyboard>/leftArrow",
                    "interactions": "",
                    "processors": "",
                    "groups": "Keyboard&Mouse",
                    "action": "Move",
                    "isComposite": false,
                    "isPartOfComposite": true
                },
                {
                    "name": "right",
                    "id": "fcfe95b8-67b9-4526-84b5-5d0bc98d6400",
                    "path": "<Keyboard>/d",
                    "interactions": "",
                    "processors": "",
                    "groups": "Keyboard&Mouse",
                    "action": "Move",
                    "isComposite": false,
                    "isPartOfComposite": true
                },
                {
                    "name": "right",
                    "id": "77bff152-3580-4b21-b6de-dcd0c7e41164",
                    "path": "<Keyboard>/rightArrow",
                    "interactions": "",
                    "processors": "",
                    "groups": "Keyboard&Mouse",
                    "action": "Move",
                    "isComposite": false,
                    "isPartOfComposite": true
                },
                {
                    "name": "",
                    "id": "3ea4d645-4504-4529-b061-ab81934c3752",
                    "path": "<Mobile>/Stick",
                    "interactions": "",
                    "processors": "",
                    "groups": "Mobile",
                    "action": "Move",
                    "isComposite": false,
                    "isPartOfComposite": false
                },
                {
                    "name": "",
                    "id": "b96bb507-8e1f-40b1-8395-209120aedc2a",
                    "path": "<Mouse>/delta",
                    "interactions": "",
                    "processors": "ScaleVector2(x=0.1,y=0.1)",
                    "groups": "Keyboard&Mouse",
                    "action": "Look",
                    "isComposite": false,
                    "isPartOfComposite": false
                },
                {
                    "name": "",
                    "id": "9bf5c448-c64c-4e07-a482-52f1dca26128",
                    "path": "<Mobile>/Delta",
                    "interactions": "",
                    "processors": "ScaleVector2(x=100,y=100)",
                    "groups": "Mobile",
                    "action": "Look",
                    "isComposite": false,
                    "isPartOfComposite": false
                },
                {
                    "name": "",
                    "id": "c1f7a91b-d0fd-4a62-997e-7fb9b69bf235",
                    "path": "<Gamepad>/rightStick",
                    "interactions": "",
                    "processors": "",
                    "groups": "Gamepad",
                    "action": "Look",
                    "isComposite": false,
                    "isPartOfComposite": false
                },
                {
                    "name": "",
                    "id": "55082e14-4b0a-47ee-a963-59288246e9cc",
                    "path": "<Keyboard>/r",
                    "interactions": "",
                    "processors": "",
                    "groups": "Keyboard&Mouse",
                    "action": "Reload",
                    "isComposite": false,
                    "isPartOfComposite": false
                },
                {
                    "name": "",
                    "id": "d2c3a588-4009-4889-879d-843c95ccabd7",
                    "path": "<Keyboard>/2",
                    "interactions": "",
                    "processors": "",
                    "groups": "Keyboard&Mouse",
                    "action": "Ability",
                    "isComposite": false,
                    "isPartOfComposite": false
                },
                {
                    "name": "",
                    "id": "5da6820b-9344-4a15-8ed0-63d9820670dd",
                    "path": "<Mobile>/Ability",
                    "interactions": "",
                    "processors": "",
                    "groups": "Mobile",
                    "action": "Ability",
                    "isComposite": false,
                    "isPartOfComposite": false
                },
                {
                    "name": "",
                    "id": "d1565a0a-9bde-4943-959b-313530d51548",
                    "path": "<Gamepad>/dpad/left",
                    "interactions": "",
                    "processors": "",
                    "groups": "Gamepad",
                    "action": "Ability",
                    "isComposite": false,
                    "isPartOfComposite": false
                },
                {
                    "name": "",
                    "id": "978bfe49-cc26-4a3d-ab7b-7d7a29327403",
                    "path": "<Gamepad>/leftStick",
                    "interactions": "",
                    "processors": "",
                    "groups": "Gamepad",
                    "action": "Move",
                    "isComposite": false,
                    "isPartOfComposite": false
                },
                {
                    "name": "",
                    "id": "a7199430-3bd4-48f1-80c5-b1a9be6e07ac",
                    "path": "<Mobile>/Reload",
                    "interactions": "",
                    "processors": "",
                    "groups": "Mobile",
                    "action": "Reload",
                    "isComposite": false,
                    "isPartOfComposite": false
                },
                {
                    "name": "",
                    "id": "dee115a8-e77d-45eb-b46b-4060d5f19141",
                    "path": "<Gamepad>/buttonWest",
                    "interactions": "",
                    "processors": "",
                    "groups": "Gamepad",
                    "action": "Reload",
                    "isComposite": false,
                    "isPartOfComposite": false
                },
                {
                    "name": "",
                    "id": "05fb760d-3bb1-4242-8440-8231c0390c16",
                    "path": "<Keyboard>/1",
                    "interactions": "",
                    "processors": "",
                    "groups": "Keyboard&Mouse",
                    "action": "Ultimate",
                    "isComposite": false,
                    "isPartOfComposite": false
                },
                {
                    "name": "",
                    "id": "90896b4a-76af-4068-82de-7fb49d348a83",
                    "path": "<Mobile>/Ultimate",
                    "interactions": "",
                    "processors": "",
                    "groups": "Mobile",
                    "action": "Ultimate",
                    "isComposite": false,
                    "isPartOfComposite": false
                },
                {
                    "name": "",
                    "id": "9bb1607a-77f9-4c3d-bbe6-560cd0739651",
                    "path": "<Gamepad>/dpad/up",
                    "interactions": "",
                    "processors": "",
                    "groups": "Gamepad",
                    "action": "Ultimate",
                    "isComposite": false,
                    "isPartOfComposite": false
                },
                {
                    "name": "",
                    "id": "4a3741eb-311a-4f88-b9cc-09d6bba2b627",
                    "path": "<Keyboard>/space",
                    "interactions": "",
                    "processors": "",
                    "groups": "Keyboard&Mouse",
                    "action": "Dodge",
                    "isComposite": false,
                    "isPartOfComposite": false
                },
                {
                    "name": "",
                    "id": "183a09e8-2517-4f41-bf29-91776e0f04ae",
                    "path": "<Mobile>/Dodge",
                    "interactions": "",
                    "processors": "",
                    "groups": "Mobile",
                    "action": "Dodge",
                    "isComposite": false,
                    "isPartOfComposite": false
                },
                {
                    "name": "",
                    "id": "f1df0c31-df99-40f2-b5a6-e227c061be88",
                    "path": "<Gamepad>/buttonEast",
                    "interactions": "",
                    "processors": "",
                    "groups": "Gamepad",
                    "action": "Dodge",
                    "isComposite": false,
                    "isPartOfComposite": false
                },
                {
                    "name": "",
                    "id": "2b6bfd6c-240f-48e5-845c-1521b259a522",
                    "path": "<Keyboard>/3",
                    "interactions": "",
                    "processors": "",
                    "groups": "Keyboard&Mouse",
                    "action": "ExtraAbility",
                    "isComposite": false,
                    "isPartOfComposite": false
                },
                {
                    "name": "",
                    "id": "15e0874d-38ae-49e5-a0ed-c1a6bfb6fc0c",
                    "path": "<Mobile>/ExtraAbility",
                    "interactions": "",
                    "processors": "",
                    "groups": "Mobile",
                    "action": "ExtraAbility",
                    "isComposite": false,
                    "isPartOfComposite": false
                },
                {
                    "name": "",
                    "id": "b39f38dc-e64a-4c3b-8976-7783088a75b8",
                    "path": "<Gamepad>/dpad/right",
                    "interactions": "",
                    "processors": "",
                    "groups": "Gamepad",
                    "action": "ExtraAbility",
                    "isComposite": false,
                    "isPartOfComposite": false
                },
                {
                    "name": "",
                    "id": "632418a9-2b3e-4c73-baf4-911cb10f6165",
                    "path": "Emotion Button",
                    "interactions": "Press",
                    "processors": "",
                    "groups": "Mobile",
                    "action": "Emotion",
                    "isComposite": false,
                    "isPartOfComposite": false
                },
                {
                    "name": "",
                    "id": "3b87abc0-5128-463b-a459-a4dedf7b7929",
                    "path": "<Keyboard>/v",
                    "interactions": "Tap(duration=0.4)",
                    "processors": "",
                    "groups": "Keyboard&Mouse",
                    "action": "MuteSelfVoice",
                    "isComposite": false,
                    "isPartOfComposite": false
                },
                {
                    "name": "",
                    "id": "4d3a9d4a-d011-4734-8bb2-3327fa00ec75",
                    "path": "<Mobile>/MuteSelfVoice",
                    "interactions": "",
                    "processors": "",
                    "groups": "Mobile",
                    "action": "MuteSelfVoice",
                    "isComposite": false,
                    "isPartOfComposite": false
                },
                {
                    "name": "",
                    "id": "741e86c2-41ba-4618-847c-89438b5d16b9",
                    "path": "<Keyboard>/v",
                    "interactions": "Hold(duration=0.8)",
                    "processors": "",
                    "groups": "",
                    "action": "MuteParticipantsVoice",
                    "isComposite": false,
                    "isPartOfComposite": false
                },
                {
                    "name": "",
                    "id": "5e6eaf32-4b4b-4dba-aa63-ed0b0d300fc7",
                    "path": "<Mobile>/MuteParticipantsVoice",
                    "interactions": "",
                    "processors": "",
                    "groups": "",
                    "action": "MuteParticipantsVoice",
                    "isComposite": false,
                    "isPartOfComposite": false
                }
            ]
        },
        {
            "name": "UI",
            "id": "e5311e74-51b4-439b-bc8e-d6b13a2fc641",
            "actions": [
                {
                    "name": "Navigate",
                    "type": "PassThrough",
                    "id": "ae34275a-6285-4aa1-9f8f-5500140b72d6",
                    "expectedControlType": "Vector2",
                    "processors": "",
                    "interactions": "",
                    "initialStateCheck": false
                },
                {
                    "name": "Submit",
                    "type": "Button",
                    "id": "5d27b3c3-39e1-470e-b7f6-474fe06d58ed",
                    "expectedControlType": "Button",
                    "processors": "",
                    "interactions": "",
                    "initialStateCheck": false
                },
                {
                    "name": "Cancel",
                    "type": "Button",
                    "id": "3c76b461-bdfd-419b-99a9-f1b2985a732e",
                    "expectedControlType": "Button",
                    "processors": "",
                    "interactions": "",
                    "initialStateCheck": false
                },
                {
                    "name": "Point",
                    "type": "PassThrough",
                    "id": "bdae17e3-bcd3-4c8f-94b2-6cdb3c1e8ae8",
                    "expectedControlType": "Vector2",
                    "processors": "",
                    "interactions": "",
                    "initialStateCheck": true
                },
                {
                    "name": "Click",
                    "type": "PassThrough",
                    "id": "598cce3f-3902-404a-a3de-47730af0a4a6",
                    "expectedControlType": "Button",
                    "processors": "",
                    "interactions": "",
                    "initialStateCheck": true
                },
                {
                    "name": "ScrollWheel",
                    "type": "PassThrough",
                    "id": "ea9e00b0-719c-47a5-ae3f-0d8c7bd586ee",
                    "expectedControlType": "Vector2",
                    "processors": "",
                    "interactions": "",
                    "initialStateCheck": false
                },
                {
                    "name": "MiddleClick",
                    "type": "PassThrough",
                    "id": "9cb6b85d-9d33-45ef-acc6-c57eceafe095",
                    "expectedControlType": "Button",
                    "processors": "",
                    "interactions": "",
                    "initialStateCheck": false
                },
                {
                    "name": "RightClick",
                    "type": "PassThrough",
                    "id": "ec3731a8-132f-47fe-8253-165ce0ccb18a",
                    "expectedControlType": "Button",
                    "processors": "",
                    "interactions": "",
                    "initialStateCheck": false
                }
            ],
            "bindings": [
                {
                    "name": "Gamepad",
                    "id": "1c08d708-53b1-4514-bfc8-505daa5c462b",
                    "path": "2DVector",
                    "interactions": "",
                    "processors": "",
                    "groups": "",
                    "action": "Navigate",
                    "isComposite": true,
                    "isPartOfComposite": false
                },
                {
                    "name": "up",
                    "id": "1698c140-469e-4bbd-aadd-b75544e4f329",
                    "path": "<Gamepad>/leftStick/up",
                    "interactions": "",
                    "processors": "",
                    "groups": ";Gamepad",
                    "action": "Navigate",
                    "isComposite": false,
                    "isPartOfComposite": true
                },
                {
                    "name": "up",
                    "id": "d2da752a-97a9-4986-803a-6d06d5128aa3",
                    "path": "<Gamepad>/rightStick/up",
                    "interactions": "",
                    "processors": "",
                    "groups": ";Gamepad",
                    "action": "Navigate",
                    "isComposite": false,
                    "isPartOfComposite": true
                },
                {
                    "name": "down",
                    "id": "0e2e3055-7d6a-40ea-b095-e030a5d2a988",
                    "path": "<Gamepad>/leftStick/down",
                    "interactions": "",
                    "processors": "",
                    "groups": ";Gamepad",
                    "action": "Navigate",
                    "isComposite": false,
                    "isPartOfComposite": true
                },
                {
                    "name": "down",
                    "id": "99e59c77-b12b-43d1-a9eb-c962fa58e0b9",
                    "path": "<Gamepad>/rightStick/down",
                    "interactions": "",
                    "processors": "",
                    "groups": ";Gamepad",
                    "action": "Navigate",
                    "isComposite": false,
                    "isPartOfComposite": true
                },
                {
                    "name": "left",
                    "id": "890130d7-433b-4f89-866f-8cfef361134d",
                    "path": "<Gamepad>/leftStick/left",
                    "interactions": "",
                    "processors": "",
                    "groups": ";Gamepad",
                    "action": "Navigate",
                    "isComposite": false,
                    "isPartOfComposite": true
                },
                {
                    "name": "left",
                    "id": "d8739f8f-7ee1-4f7b-9b73-ba409d6d92a6",
                    "path": "<Gamepad>/rightStick/left",
                    "interactions": "",
                    "processors": "",
                    "groups": ";Gamepad",
                    "action": "Navigate",
                    "isComposite": false,
                    "isPartOfComposite": true
                },
                {
                    "name": "right",
                    "id": "0ca3e903-f564-4275-be63-498eded31923",
                    "path": "<Gamepad>/leftStick/right",
                    "interactions": "",
                    "processors": "",
                    "groups": ";Gamepad",
                    "action": "Navigate",
                    "isComposite": false,
                    "isPartOfComposite": true
                },
                {
                    "name": "right",
                    "id": "83515993-5a84-422f-8cc3-4189e73b021e",
                    "path": "<Gamepad>/rightStick/right",
                    "interactions": "",
                    "processors": "",
                    "groups": ";Gamepad",
                    "action": "Navigate",
                    "isComposite": false,
                    "isPartOfComposite": true
                },
                {
                    "name": "",
                    "id": "feb8ca93-9e9c-4675-90e3-26601ecedbd0",
                    "path": "<Gamepad>/dpad",
                    "interactions": "",
                    "processors": "",
                    "groups": ";Gamepad",
                    "action": "Navigate",
                    "isComposite": false,
                    "isPartOfComposite": false
                },
                {
                    "name": "Joystick",
                    "id": "dba3361b-fb5b-431e-bf06-b712113e0cc1",
                    "path": "2DVector",
                    "interactions": "",
                    "processors": "",
                    "groups": "",
                    "action": "Navigate",
                    "isComposite": true,
                    "isPartOfComposite": false
                },
                {
                    "name": "Keyboard",
                    "id": "36b530d2-02d7-4c04-ba1c-c2de127a9f1a",
                    "path": "2DVector",
                    "interactions": "",
                    "processors": "",
                    "groups": "",
                    "action": "Navigate",
                    "isComposite": true,
                    "isPartOfComposite": false
                },
                {
                    "name": "up",
                    "id": "969278f0-c2a8-4e94-b665-8cd3266f37b2",
                    "path": "<Keyboard>/w",
                    "interactions": "",
                    "processors": "",
                    "groups": "Keyboard&Mouse",
                    "action": "Navigate",
                    "isComposite": false,
                    "isPartOfComposite": true
                },
                {
                    "name": "up",
                    "id": "fdfedf60-977f-43bd-b406-b07a55cf8f7f",
                    "path": "<Keyboard>/upArrow",
                    "interactions": "",
                    "processors": "",
                    "groups": "Keyboard&Mouse",
                    "action": "Navigate",
                    "isComposite": false,
                    "isPartOfComposite": true
                },
                {
                    "name": "down",
                    "id": "dd75923e-770c-4e6e-9a57-7bbaa4e89f2e",
                    "path": "<Keyboard>/s",
                    "interactions": "",
                    "processors": "",
                    "groups": "Keyboard&Mouse",
                    "action": "Navigate",
                    "isComposite": false,
                    "isPartOfComposite": true
                },
                {
                    "name": "down",
                    "id": "9fe411e9-9043-4f84-940a-011fe640d2ba",
                    "path": "<Keyboard>/downArrow",
                    "interactions": "",
                    "processors": "",
                    "groups": "Keyboard&Mouse",
                    "action": "Navigate",
                    "isComposite": false,
                    "isPartOfComposite": true
                },
                {
                    "name": "left",
                    "id": "28fd4c0a-810f-43af-8cee-6309833507a6",
                    "path": "<Keyboard>/a",
                    "interactions": "",
                    "processors": "",
                    "groups": "Keyboard&Mouse",
                    "action": "Navigate",
                    "isComposite": false,
                    "isPartOfComposite": true
                },
                {
                    "name": "left",
                    "id": "bdcea7d0-44e5-4888-a350-36cea091d069",
                    "path": "<Keyboard>/leftArrow",
                    "interactions": "",
                    "processors": "",
                    "groups": "Keyboard&Mouse",
                    "action": "Navigate",
                    "isComposite": false,
                    "isPartOfComposite": true
                },
                {
                    "name": "right",
                    "id": "9f4de135-3c4e-46f0-9de5-5638983b730c",
                    "path": "<Keyboard>/d",
                    "interactions": "",
                    "processors": "",
                    "groups": "Keyboard&Mouse",
                    "action": "Navigate",
                    "isComposite": false,
                    "isPartOfComposite": true
                },
                {
                    "name": "right",
                    "id": "104b3f04-30a2-455b-90f3-0bdf1ae8d5bf",
                    "path": "<Keyboard>/rightArrow",
                    "interactions": "",
                    "processors": "",
                    "groups": "Keyboard&Mouse",
                    "action": "Navigate",
                    "isComposite": false,
                    "isPartOfComposite": true
                },
                {
                    "name": "",
                    "id": "1e2fdabe-6cce-47b8-9636-bcff6f16985b",
                    "path": "*/{Submit}",
                    "interactions": "",
                    "processors": "",
                    "groups": "",
                    "action": "Submit",
                    "isComposite": false,
                    "isPartOfComposite": false
                },
                {
                    "name": "",
                    "id": "181e80a3-89e9-4720-9130-21f726a623f1",
                    "path": "*/{Cancel}",
                    "interactions": "",
                    "processors": "",
                    "groups": "",
                    "action": "Cancel",
                    "isComposite": false,
                    "isPartOfComposite": false
                },
                {
                    "name": "",
                    "id": "aa7643e3-aa72-44a8-827a-edb4d0f59e36",
                    "path": "<Mouse>/position",
                    "interactions": "",
                    "processors": "",
                    "groups": "Keyboard&Mouse",
                    "action": "Point",
                    "isComposite": false,
                    "isPartOfComposite": false
                },
                {
                    "name": "",
                    "id": "121dcb1c-d89a-4155-9fbc-5811e8861508",
                    "path": "<Pen>/position",
                    "interactions": "",
                    "processors": "",
                    "groups": "Keyboard&Mouse",
                    "action": "Point",
                    "isComposite": false,
                    "isPartOfComposite": false
                },
                {
                    "name": "",
                    "id": "6b88c166-b63a-4556-8033-c0ac0f83daf6",
                    "path": "<Touchscreen>/touch*/position",
                    "interactions": "",
                    "processors": "",
                    "groups": "Touch",
                    "action": "Point",
                    "isComposite": false,
                    "isPartOfComposite": false
                },
                {
                    "name": "",
                    "id": "900889fe-fe65-4885-ba5d-a8c94a21d2ac",
                    "path": "<Mouse>/leftButton",
                    "interactions": "",
                    "processors": "",
                    "groups": ";Keyboard&Mouse",
                    "action": "Click",
                    "isComposite": false,
                    "isPartOfComposite": false
                },
                {
                    "name": "",
                    "id": "d36a28be-9222-47ec-b151-bdfbd8c091d9",
                    "path": "<Pen>/tip",
                    "interactions": "",
                    "processors": "",
                    "groups": ";Keyboard&Mouse",
                    "action": "Click",
                    "isComposite": false,
                    "isPartOfComposite": false
                },
                {
                    "name": "",
                    "id": "4c41bb34-bec8-4dbf-bf82-3ed46f3a61da",
                    "path": "<Touchscreen>/touch*/press",
                    "interactions": "",
                    "processors": "",
                    "groups": "Touch",
                    "action": "Click",
                    "isComposite": false,
                    "isPartOfComposite": false
                },
                {
                    "name": "",
                    "id": "ab0e111a-0c1c-4676-a305-0c1a975714db",
                    "path": "<Mouse>/scroll",
                    "interactions": "",
                    "processors": "",
                    "groups": ";Keyboard&Mouse",
                    "action": "ScrollWheel",
                    "isComposite": false,
                    "isPartOfComposite": false
                },
                {
                    "name": "",
                    "id": "fce3a038-1b35-4bb5-a714-5a225feec31c",
                    "path": "<Mouse>/middleButton",
                    "interactions": "",
                    "processors": "",
                    "groups": ";Keyboard&Mouse",
                    "action": "MiddleClick",
                    "isComposite": false,
                    "isPartOfComposite": false
                },
                {
                    "name": "",
                    "id": "c0ddf6b7-4118-434e-b45f-dfbe292a2b1b",
                    "path": "<Mouse>/rightButton",
                    "interactions": "",
                    "processors": "",
                    "groups": ";Keyboard&Mouse",
                    "action": "RightClick",
                    "isComposite": false,
                    "isPartOfComposite": false
                }
            ]
        }
    ],
    "controlSchemes": [
        {
            "name": "Keyboard&Mouse",
            "bindingGroup": "Keyboard&Mouse",
            "devices": [
                {
                    "devicePath": "<Keyboard>",
                    "isOptional": false,
                    "isOR": false
                },
                {
                    "devicePath": "<Mouse>",
                    "isOptional": false,
                    "isOR": false
                }
            ]
        },
        {
            "name": "Gamepad",
            "bindingGroup": "Gamepad",
            "devices": [
                {
                    "devicePath": "<Gamepad>",
                    "isOptional": false,
                    "isOR": false
                }
            ]
        },
        {
            "name": "Touch",
            "bindingGroup": "Touch",
            "devices": [
                {
                    "devicePath": "<Touchscreen>",
                    "isOptional": false,
                    "isOR": false
                }
            ]
        },
        {
            "name": "Mobile",
            "bindingGroup": "Mobile",
            "devices": [
                {
                    "devicePath": "<Mobile>",
                    "isOptional": false,
                    "isOR": false
                }
            ]
        }
    ]
}