%YAML 1.1
%TAG !u! tag:unity3d.com,2011:
--- !u!114 &11400000
MonoBehaviour:
  m_ObjectHideFlags: 0
  m_CorrespondingSourceObject: {fileID: 0}
  m_PrefabInstance: {fileID: 0}
  m_PrefabAsset: {fileID: 0}
  m_GameObject: {fileID: 0}
  m_Enabled: 1
  m_EditorHideFlags: 0
  m_Script: {fileID: 11500000, guid: c598821117eb5844fa0bb7938d37f9c4, type: 3}
  m_Name: LootBoxFakeGreenConfig
  m_EditorClassIdentifier: 
  <Type>k__BackingField: 0
  <DropRadius>k__BackingField: 4
  _unitEffects: []
