%YAML 1.1
%TAG !u! tag:unity3d.com,2011:
--- !u!114 &11400000
MonoBehaviour:
  m_ObjectHideFlags: 0
  m_CorrespondingSourceObject: {fileID: 0}
  m_PrefabInstance: {fileID: 0}
  m_PrefabAsset: {fileID: 0}
  m_GameObject: {fileID: 0}
  m_Enabled: 1
  m_EditorHideFlags: 0
  m_Script: {fileID: 11500000, guid: 66c857b9dd0f4ca49505eef26ae616a9, type: 3}
  m_Name: ZombieDogDobermanConfig
  m_EditorClassIdentifier: 
  <Id>k__BackingField: zombie_dog_doberman
  <Name>k__BackingField: 
  <Sprite>k__BackingField: {fileID: 0}
  <Class>k__BackingField: 0
  <RoleIcon>k__BackingField: {fileID: 0}
  <GoldRoleIcon>k__BackingField: {fileID: 0}
  <IsBoss>k__BackingField: 0
  <View>k__BackingField: {fileID: 1655015890418872360, guid: c0e95582faaecd248b250880b3f19d9a, type: 3}
  <ViewConfig>k__BackingField: {fileID: 5577115190006234101, guid: dcf44eb081681794b87ee8473ca2e422, type: 3}
  <ClientModule>k__BackingField: {fileID: 0}
  <ServerModule>k__BackingField: {fileID: 0}
  <UnitAIConfig>k__BackingField: {fileID: 11400000, guid: a881ba62eb8cef24fb38e1c4845cc8ad, type: 2}
  <UnitPhaseConfig>k__BackingField: {fileID: 0}
  <Phase>k__BackingField: 1
  <UnitActionRoster>k__BackingField: {fileID: 11400000, guid: e91aaa8eb967e4c329b4af399285d2b1, type: 2}
  <UpgradeTable>k__BackingField: {fileID: 11400000, guid: 7d7ccd6edaf397346a06f5bd721c8614, type: 2}
  <BodyMass>k__BackingField: 80
  _damageMultipliers: []
  <DeathRewards>k__BackingField:
    <Exp>k__BackingField: 80
    <EnergyCapsule>k__BackingField:
      <Energy>k__BackingField: 7
      <DropChance>k__BackingField: 100
      <MaxRandomPositionOffset>k__BackingField: 0.7
    _lootSet: {fileID: 11400000, guid: fb471da3a38816f4eb84870922285920, type: 2}
  <DefaultWeapon>k__BackingField: {fileID: 0}
  <DefaultMeleeWeapon>k__BackingField: {fileID: 11400000, guid: eac92bad4213347f7a4ed465ac6a13f1, type: 2}
  <GearScore>k__BackingField: 10
  <Health>k__BackingField: 60
  <Stamina>k__BackingField: 0
  <Energy>k__BackingField: 0
  <Speed>k__BackingField: 6
  <TurnSpeed>k__BackingField: 500
  <HpAutoRecovery>k__BackingField:
    <PercentPerSecond>k__BackingField: 0
    <DamageCooldown>k__BackingField: 0
  <EnergyAutoRecovery>k__BackingField:
    <Speed>k__BackingField: 0
  <StaminaAutoRecovery>k__BackingField:
    <Speed>k__BackingField: 0
  <Impacts>k__BackingField:
    _death:
      _config: {fileID: 11400000, guid: 423619972bd0248ae83c9c1da1c87397, type: 2}
      _delayVariant: 0
      _delay: 0
      _cooldown: 0
    _ultimate:
      _config: {fileID: 0}
      _delayVariant: 0
      _delay: 0
      _cooldown: 0
    _ability:
      _config: {fileID: 0}
      _delayVariant: 0
      _delay: 0
      _cooldown: 0
    _extraAbility:
      _config: {fileID: 0}
      _delayVariant: 0
      _delay: 0
      _cooldown: 0
    _special:
      _config: {fileID: 0}
      _delayVariant: 0
      _delay: 0
      _cooldown: 0
