%YAML 1.1
%TAG !u! tag:unity3d.com,2011:
--- !u!114 &11400000
MonoBehaviour:
  m_ObjectHideFlags: 0
  m_CorrespondingSourceObject: {fileID: 0}
  m_PrefabInstance: {fileID: 0}
  m_PrefabAsset: {fileID: 0}
  m_GameObject: {fileID: 0}
  m_Enabled: 1
  m_EditorHideFlags: 0
  m_Script: {fileID: 11500000, guid: cbd94935d9d94e168e5e431afed4471e, type: 3}
  m_Name: HeroTaylorImpactUIConfig_Ability
  m_EditorClassIdentifier: 
  _config: {fileID: 11400000, guid: d51b596ec8940a643b680b82c3986f61, type: 2}
  <Name>k__BackingField: Healing
  <Description>k__BackingField: Restores 50% health to yourself and all allies.
  <Icon>k__BackingField: {fileID: 21300000, guid: 525342803641ab240a924064c99a6c49, type: 3}
