{
  "__inputs": [],
  "__elements": [],
  "__requires": [
    {
      "type": "grafana",
      "id": "grafana",
      "name": "Grafana",
      "version": "9.0.0"
    },
    {
      "type": "datasource",
      "id": "prometheus",
      "name": "Prometheus",
      "version": "1.0.0"
    },
    {
      "type": "panel",
      "id": "table",
      "name": "Table",
      "version": ""
    },
    {
      "type": "panel",
      "id": "timeseries",
      "name": "Time series",
      "version": ""
    }
  ],
  "annotations": {
    "list": [
      {
        "builtIn": 1,
        "datasource": {
          "type": "grafana",
          "uid": "-- Grafana --"
        },
        "enable": true,
        "hide": true,
        "iconColor": "rgba(0, 211, 255, 1)",
        "name": "Annotations & Alerts",
        "target": {
          "limit": 100,
          "matchAny": false,
          "tags": [],
          "type": "dashboard"
        },
        "type": "dashboard"
      }
    ]
  },
  "editable": true,
  "fiscalYearStartMonth": 0,
  "graphTooltip": 0,
  "id": null,
  "iteration": 1684380068932,
  "links": [],
  "liveNow": false,
  "panels": [
    {
      "datasource": {
        "type": "prometheus",
        "uid": "${DS_PROMETHEUS}"
      },
      "fieldConfig": {
        "defaults": {
          "color": {
            "mode": "thresholds"
          },
          "custom": {
            "align": "auto",
            "displayMode": "auto",
            "inspect": false
          },
          "mappings": [],
          "thresholds": {
            "mode": "absolute",
            "steps": [
              {
                "color": "green",
                "value": null
              },
              {
                "color": "red",
                "value": 80
              }
            ]
          }
        },
        "overrides": [
          {
            "matcher": {
              "id": "byName",
              "options": "Value #B"
            },
            "properties": [
              {
                "id": "displayName",
                "value": "Total"
              }
            ]
          },
          {
            "matcher": {
              "id": "byName",
              "options": "Value #C"
            },
            "properties": [
              {
                "id": "displayName",
                "value": "Allow"
              }
            ]
          },
          {
            "matcher": {
              "id": "byName",
              "options": "Value #D"
            },
            "properties": [
              {
                "id": "displayName",
                "value": "Deny(last 15m)"
              },
              {
                "id": "thresholds",
                "value": {
                  "mode": "absolute",
                  "steps": [
                    {
                      "color": "green",
                      "value": null
                    },
                    {
                      "color": "red",
                      "value": 81
                    }
                  ]
                }
              }
            ]
          },
          {
            "matcher": {
              "id": "byName",
              "options": "Value #E"
            },
            "properties": [
              {
                "id": "displayName",
                "value": "Max Rate"
              }
            ]
          },
          {
            "matcher": {
              "id": "byName",
              "options": "node"
            },
            "properties": [
              {
                "id": "custom.width",
                "value": 156
              }
            ]
          },
          {
            "matcher": {
              "id": "byName",
              "options": "Max Rate"
            },
            "properties": [
              {
                "id": "custom.width",
                "value": 111
              }
            ]
          },
          {
            "matcher": {
              "id": "byName",
              "options": "Total"
            },
            "properties": [
              {
                "id": "custom.width",
                "value": 89
              }
            ]
          },
          {
            "matcher": {
              "id": "byName",
              "options": "Allow"
            },
            "properties": [
              {
                "id": "custom.width",
                "value": 135
              }
            ]
          },
          {
            "matcher": {
              "id": "byName",
              "options": "resource"
            },
            "properties": [
              {
                "id": "custom.width",
                "value": 161
              }
            ]
          },
          {
            "matcher": {
              "id": "byName",
              "options": "Deny(last 15m)"
            },
            "properties": [
              {
                "id": "custom.width",
                "value": 141
              }
            ]
          }
        ]
      },
      "gridPos": {
        "h": 5,
        "w": 11,
        "x": 0,
        "y": 0
      },
      "id": 2,
      "options": {
        "cellHeight": "sm",
        "footer": {
          "countRows": false,
          "fields": "",
          "reducer": [
            "sum"
          ],
          "show": false
        },
        "showHeader": true,
        "sortBy": []
      },
      "pluginVersion": "9.0.0",
      "targets": [
        {
          "datasource": {
            "type": "prometheus",
            "uid": "${DS_PROMETHEUS}"
          },
          "editorMode": "code",
          "exemplar": false,
          "expr": "max by(node, resource) (emqx_authentication_exec_max_rate{cluster=\"$cluster\", node=~\"$node\", resource=~\"$resource\"})",
          "format": "table",
          "hide": false,
          "instant": true,
          "legendFormat": "Total",
          "range": false,
          "refId": "E"
        },
        {
          "datasource": {
            "type": "prometheus",
            "uid": "${DS_PROMETHEUS}"
          },
          "editorMode": "code",
          "exemplar": false,
          "expr": "sum by(node, resource) (emqx_authentication_total{cluster=\"$cluster\", node=~\"$node\", resource=~\"$resource\"})",
          "format": "table",
          "hide": false,
          "instant": true,
          "legendFormat": "Total",
          "range": false,
          "refId": "B"
        },
        {
          "datasource": {
            "type": "prometheus",
            "uid": "${DS_PROMETHEUS}"
          },
          "editorMode": "code",
          "exemplar": false,
          "expr": "sum by(node, resource) (emqx_authentication_allow_count{cluster=\"$cluster\", node=~\"$node\", resource=~\"$resource\"})",
          "format": "table",
          "hide": false,
          "instant": true,
          "legendFormat": "Total",
          "range": false,
          "refId": "C"
        },
        {
          "datasource": {
            "type": "prometheus",
            "uid": "${DS_PROMETHEUS}"
          },
          "editorMode": "code",
          "exemplar": false,
          "expr": "sum by(node, resource) (irate(emqx_authentication_deny_count{cluster=\"$cluster\", node=~\"$node\", resource=~\"$resource\"}[15m]))",
          "format": "table",
          "hide": false,
          "instant": true,
          "legendFormat": "Total",
          "range": false,
          "refId": "D"
        }
      ],
      "title": "Authenticate Count",
      "transformations": [
        {
          "id": "merge",
          "options": {}
        },
        {
          "id": "filterFieldsByName",
          "options": {
            "include": {
              "names": [
                "node",
                "resource",
                "Value #E",
                "Value #B",
                "Value #C",
                "Value #D"
              ]
            }
          }
        }
      ],
      "type": "table"
    },
    {
      "datasource": {
        "type": "prometheus",
        "uid": "${DS_PROMETHEUS}"
      },
      "fieldConfig": {
        "defaults": {
          "color": {
            "mode": "palette-classic"
          },
          "custom": {
            "axisLabel": "",
            "axisPlacement": "auto",
            "barAlignment": 0,
            "drawStyle": "line",
            "fillOpacity": 0,
            "gradientMode": "none",
            "hideFrom": {
              "legend": false,
              "tooltip": false,
              "viz": false
            },
            "lineInterpolation": "linear",
            "lineWidth": 1,
            "pointSize": 5,
            "scaleDistribution": {
              "type": "linear"
            },
            "showPoints": "never",
            "spanNulls": false,
            "stacking": {
              "group": "A",
              "mode": "none"
            },
            "thresholdsStyle": {
              "mode": "off"
            }
          },
          "mappings": [],
          "thresholds": {
            "mode": "absolute",
            "steps": [
              {
                "color": "green",
                "value": null
              }
            ]
          }
        },
        "overrides": []
      },
      "gridPos": {
        "h": 6,
        "w": 7,
        "x": 0,
        "y": 5
      },
      "id": 4,
      "options": {
        "legend": {
          "calcs": [],
          "displayMode": "table",
          "placement": "bottom",
          "showLegend": true
        },
        "tooltip": {
          "mode": "multi",
          "sort": "none"
        }
      },
      "pluginVersion": "9.0.0",
      "targets": [
        {
          "datasource": {
            "type": "prometheus",
            "uid": "${DS_PROMETHEUS}"
          },
          "editorMode": "code",
          "expr": "sum by(node, resource) (emqx_authentication_exec_rate{cluster=\"$cluster\", node=~\"$node\", resource=~\"$resource\"})",
          "legendFormat": "{{node}} {{resource}}",
          "range": true,
          "refId": "A"
        }
      ],
      "title": "Authenticate Current Exec Rate",
      "type": "timeseries"
    },
    {
      "datasource": {
        "type": "prometheus",
        "uid": "${DS_PROMETHEUS}"
      },
      "fieldConfig": {
        "defaults": {
          "color": {
            "mode": "palette-classic"
          },
          "custom": {
            "axisLabel": "",
            "axisPlacement": "auto",
            "barAlignment": 0,
            "drawStyle": "line",
            "fillOpacity": 0,
            "gradientMode": "none",
            "hideFrom": {
              "legend": false,
              "tooltip": false,
              "viz": false
            },
            "lineInterpolation": "linear",
            "lineWidth": 1,
            "pointSize": 5,
            "scaleDistribution": {
              "type": "linear"
            },
            "showPoints": "never",
            "spanNulls": false,
            "stacking": {
              "group": "A",
              "mode": "none"
            },
            "thresholdsStyle": {
              "mode": "off"
            }
          },
          "mappings": [],
          "thresholds": {
            "mode": "absolute",
            "steps": [
              {
                "color": "green",
                "value": null
              }
            ]
          }
        },
        "overrides": []
      },
      "gridPos": {
        "h": 6,
        "w": 7,
        "x": 7,
        "y": 5
      },
      "id": 6,
      "options": {
        "legend": {
          "calcs": [],
          "displayMode": "table",
          "placement": "bottom",
          "showLegend": true
        },
        "tooltip": {
          "mode": "multi",
          "sort": "none"
        }
      },
      "targets": [
        {
          "datasource": {
            "type": "prometheus",
            "uid": "${DS_PROMETHEUS}"
          },
          "editorMode": "code",
          "expr": "sum by(node, resource) (emqx_authentication_exec_last5m_rate{cluster=\"$cluster\", node=~\"$node\", resource=~\"$resource\"})",
          "hide": false,
          "legendFormat": "{{node}} {{resource}}",
          "range": true,
          "refId": "A"
        }
      ],
      "title": "Authenticate Last 5m Exec Rate",
      "type": "timeseries"
    }
  ],
  "refresh": "5s",
  "schemaVersion": 36,
  "style": "dark",
  "tags": [],
  "templating": {
    "list": [
      {
        "current": {
          "selected": false,
          "text": "Prometheus",
          "value": "Prometheus"
        },
        "hide": 0,
        "includeAll": false,
        "label": "datasource",
        "multi": false,
        "name": "DS_PROMETHEUS",
        "options": [],
        "query": "prometheus",
        "refresh": 1,
        "regex": "",
        "skipUrlSync": false,
        "type": "datasource"
      },
      {
        "current": {},
        "datasource": {
          "type": "prometheus",
          "uid": "${DS_PROMETHEUS}"
        },
        "definition": "label_values(up, cluster)",
        "description": "A custom label of the scrape_config in prometheus to tag the cluster",
        "hide": 0,
        "includeAll": false,
        "multi": false,
        "name": "cluster",
        "options": [],
        "query": {
          "query": "label_values(up, cluster)",
          "refId": "StandardVariableQuery"
        },
        "refresh": 1,
        "regex": "",
        "skipUrlSync": false,
        "sort": 2,
        "type": "query"
      },
      {
        "current": {},
        "datasource": {
          "type": "prometheus",
          "uid": "${DS_PROMETHEUS}"
        },
        "definition": "label_values({cluster=\"$cluster\", from=\"exporter\"}, node)",
        "hide": 0,
        "includeAll": true,
        "multi": true,
        "name": "node",
        "options": [],
        "query": {
          "query": "label_values({cluster=\"$cluster\", from=\"exporter\"}, node)",
          "refId": "StandardVariableQuery"
        },
        "refresh": 2,
        "regex": "",
        "skipUrlSync": false,
        "sort": 1,
        "type": "query"
      },
      {
        "current": {},
        "datasource": {
          "type": "prometheus",
          "uid": "${DS_PROMETHEUS}"
        },
        "definition": "label_values(emqx_authentication_resource_status{cluster=\"$cluster\"},resource)",
        "description": "The third party resource of authentication",
        "hide": 0,
        "includeAll": true,
        "multi": true,
        "name": "resource",
        "options": [],
        "query": {
          "query": "label_values(emqx_authentication_resource_status{cluster=\"$cluster\"},resource)",
          "refId": "StandardVariableQuery"
        },
        "refresh": 1,
        "regex": "",
        "skipUrlSync": false,
        "sort": 1,
        "type": "query"
      }
    ]
  },
  "time": {
    "from": "now-5m",
    "to": "now"
  },
  "timepicker": {},
  "timezone": "",
  "title": "Authentication",
  "uid": "EMQX5-ee-authn",
  "version": 1,
  "weekStart": ""
}