<?xml version="1.0" encoding="UTF-8"?>
<svg width="1200pt" height="1200pt" version="1.1" viewBox="0 0 1200 1200" xmlns="http://www.w3.org/2000/svg">
 <g>
  <path d="m466.68 299.98c0 92.039-74.613 166.66-166.66 166.66-92.039 0-166.66-74.617-166.66-166.66 0-92.043 74.617-166.66 166.66-166.66 92.043 0 166.66 74.613 166.66 166.66"/>
  <path d="m100.04 299.98c0-5.6289 0.38281-11.172 0.83984-16.668h-100.84v33.324h100.84c-0.45312-5.4961-0.83984-11.027-0.83984-16.656z"/>
  <path d="m170.96 147.35-75.805-75.805-23.566 23.57 75.805 75.805c7.1719-8.4961 15.07-16.395 23.566-23.57z"/>
  <path d="m300.02 99.996c5.6289 0 11.172 0.39453 16.668 0.85156v-100.85h-33.324v100.84c5.4961-0.45703 11.027-0.83984 16.656-0.83984z"/>
  <path d="m452.65 170.9 66.742-66.742-23.566-23.566-66.742 66.742c8.4922 7.1875 16.367 15.07 23.566 23.566z"/>
  <path d="m429.09 452.61 66.742 66.742 23.566-23.555-66.742-66.742c-7.1758 8.4805-15.074 16.379-23.566 23.555z"/>
  <path d="m499.16 283.31c0.45703 5.4961 0.85156 11.027 0.85156 16.668 0 5.6406-0.39453 11.16-0.85156 16.668h100.84v-33.324h-100.84z"/>
  <path d="m300.02 499.96c-5.6289 0-11.16-0.38281-16.668-0.83984v100.84h33.324v-100.84c-5.4844 0.45312-11.027 0.83984-16.656 0.83984z"/>
  <path d="m147.39 429.04-75.801 75.805 23.566 23.566 75.805-75.805c-8.4961-7.1719-16.395-15.07-23.57-23.566z"/>
  <path d="m633.32 1033.3h99.996v166.66h-99.996z"/>
  <path d="m716.66 966.59v33.32h199.98l133.32-133.3v-33.348h-199.98z"/>
  <path d="m999.97 683.27-116.66 116.66h199.99v33.324l116.65-116.64v-33.348z"/>
  <path d="m833.3 799.93 116.66-116.66h-199.98l-116.66 116.66z"/>
  <path d="m600 833.26-133.32 133.33v33.32h199.98v-33.32l133.32-133.33z"/>
  <path d="m700 683.27h-199.98l-116.66 116.66h199.98z"/>
  <path d="m350.03 833.26-133.33 133.33v33.32h199.99v-33.32l133.32-133.33z"/>
 </g>
</svg>
