{
    "dados_gerais": {
      "data_hora": "2023-11-14T12:34:56Z",
      "localizacao": {
        "latitude": -23.5478,
        "longitude": -46.6359
      },
      "condicoes_climaticas": {
        "temperatura": 25.0,
        "irradiancia_solar": 800.0,
        "precipitacao": 0.0,
        "velocidade_vento": 10.0
      }
    },
    "dados_do_sistema": {
      "potencia_nominal": 5000.0,
      "tipo_painel_solar": "monocristalino",
      "numero_paineis": 1,
      "inversor": {
        "modelo": "ABC-123",
        "potencia_nominal": 5000.0
      },
      "inclinacao": 45
    },
    "dados_de_geracao": {
      "energia_gerada": 1000.0,
      "tensao": 240.0,
      "corrente": 10.0,
      "fator_capacidade": 0.2
    },
    "dados_de_performance": {
      "eficiencia_sistema": 15.0,
      "perdas_sistema": 5.0,
      "tempo_retorno_investimento": 5.0
    },
    "dados_adicionais": {
      "consumo_energia": 2000.0,
      "custos_energia": 0.5,
      "emissoes_carbono": 1000.0
    }
  }
  