<svg width="24" height="24" viewBox="0 0 24 24" fill="none" xmlns="http://www.w3.org/2000/svg">
<path fill-rule="evenodd" clip-rule="evenodd" d="M12.0037 20.951C9.99225 20.951 9.98372 18.9494 9.98372 15.5631C9.98372 12.1768 3 9.80427 3 6.08661C3 2.94619 5.79029 2.99308 11.9995 2.99308C18.2097 2.99308 21 2.94619 21 6.08661C21 9.80427 14.0173 12.1768 14.0173 15.5631C14.0173 18.9494 14.0141 20.951 12.0037 20.951Z" stroke="white" stroke-width="1.5" stroke-linecap="round" stroke-linejoin="round"/>
</svg>
