<svg width="625" height="564" viewBox="0 0 625 564" fill="none" xmlns="http://www.w3.org/2000/svg">
<rect x="282" y="180" width="60" height="50" fill="#E30D0D"/>
<rect x="317" y="120" width="60" height="50" fill="#D9D9D9"/>
<rect x="247" y="120" width="60" height="50" fill="#D9D9D9"/>
<rect x="282" y="60" width="60" height="50" fill="#D9D9D9"/>
<rect x="352" y="60" width="60" height="50" fill="#D9D9D9"/>
<rect x="212" y="60" width="60" height="50" fill="#D9D9D9"/>
<rect x="177" width="60" height="50" fill="#D9D9D9"/>
<rect x="387" width="60" height="50" fill="#D9D9D9"/>
<rect x="317" width="60" height="50" fill="#D9D9D9"/>
<rect x="247" width="60" height="50" fill="#D9D9D9"/>
<path d="M208.385 256.894L238.385 204.933L281.686 229.933L251.686 281.894L208.385 256.894Z" fill="#E30D0D"/>
<rect x="173.923" y="196.583" width="60" height="50" transform="rotate(-60 173.923 196.583)" fill="#D9D9D9"/>
<rect x="138.923" y="257.205" width="60" height="50" transform="rotate(-60 138.923 257.205)" fill="#D9D9D9"/>
<rect x="104.461" y="196.894" width="60" height="50" transform="rotate(-60 104.461 196.894)" fill="#D9D9D9"/>
<rect x="139.461" y="136.272" width="60" height="50" transform="rotate(-60 139.461 136.272)" fill="#D9D9D9"/>
<rect x="69.4614" y="257.516" width="60" height="50" transform="rotate(-60 69.4614 257.516)" fill="#D9D9D9"/>
<rect y="257.827" width="60" height="50" transform="rotate(-60 0 257.827)" fill="#D9D9D9"/>
<rect x="105" y="75.9617" width="60" height="50" transform="rotate(-60 105 75.9617)" fill="#D9D9D9"/>
<rect x="70" y="136.583" width="60" height="50" transform="rotate(-60 70 136.583)" fill="#D9D9D9"/>
<rect x="35" y="197.205" width="60" height="50" transform="rotate(-60 35 197.205)" fill="#D9D9D9"/>
<rect x="385.801" y="204.933" width="60" height="50" transform="rotate(60 385.801 204.933)" fill="#E30D0D"/>
<rect x="455.263" y="205.244" width="60" height="50" transform="rotate(60 455.263 205.244)" fill="#D9D9D9"/>
<rect x="420.263" y="144.622" width="60" height="50" transform="rotate(60 420.263 144.622)" fill="#D9D9D9"/>
<rect x="489.724" y="144.933" width="60" height="50" transform="rotate(60 489.724 144.933)" fill="#D9D9D9"/>
<rect x="524.724" y="205.554" width="60" height="50" transform="rotate(60 524.724 205.554)" fill="#D9D9D9"/>
<rect x="454.724" y="84.3108" width="60" height="50" transform="rotate(60 454.724 84.3108)" fill="#D9D9D9"/>
<rect x="489.186" y="24" width="60" height="50" transform="rotate(60 489.186 24)" fill="#D9D9D9"/>
<rect x="594.186" y="205.865" width="60" height="50" transform="rotate(60 594.186 205.865)" fill="#D9D9D9"/>
<rect x="559.186" y="145.244" width="60" height="50" transform="rotate(60 559.186 145.244)" fill="#D9D9D9"/>
<rect x="524.186" y="84.6218" width="60" height="50" transform="rotate(60 524.186 84.6218)" fill="#D9D9D9"/>
<rect x="342" y="384" width="60" height="50" transform="rotate(-180 342 384)" fill="#E30D0D"/>
<rect x="307" y="444" width="60" height="50" transform="rotate(-180 307 444)" fill="#D9D9D9"/>
<rect x="377" y="444" width="60" height="50" transform="rotate(-180 377 444)" fill="#D9D9D9"/>
<rect x="342" y="504" width="60" height="50" transform="rotate(-180 342 504)" fill="#D9D9D9"/>
<rect x="272" y="504" width="60" height="50" transform="rotate(-180 272 504)" fill="#D9D9D9"/>
<rect x="412" y="504" width="60" height="50" transform="rotate(-180 412 504)" fill="#D9D9D9"/>
<rect x="447" y="564" width="60" height="50" transform="rotate(-180 447 564)" fill="#D9D9D9"/>
<rect x="237" y="564" width="60" height="50" transform="rotate(-180 237 564)" fill="#D9D9D9"/>
<rect x="307" y="564" width="60" height="50" transform="rotate(-180 307 564)" fill="#D9D9D9"/>
<rect x="377" y="564" width="60" height="50" transform="rotate(-180 377 564)" fill="#D9D9D9"/>
<rect x="238.385" y="358.894" width="60" height="50" transform="rotate(-120 238.385 358.894)" fill="#E30D0D"/>
<rect x="168.923" y="358.583" width="60" height="50" transform="rotate(-120 168.923 358.583)" fill="#D9D9D9"/>
<rect x="203.923" y="419.205" width="60" height="50" transform="rotate(-120 203.923 419.205)" fill="#D9D9D9"/>
<rect x="134.461" y="418.894" width="60" height="50" transform="rotate(-120 134.461 418.894)" fill="#D9D9D9"/>
<rect x="99.4614" y="358.272" width="60" height="50" transform="rotate(-120 99.4614 358.272)" fill="#D9D9D9"/>
<rect x="169.461" y="479.516" width="60" height="50" transform="rotate(-120 169.461 479.516)" fill="#D9D9D9"/>
<rect x="135" y="539.827" width="60" height="50" transform="rotate(-120 135 539.827)" fill="#D9D9D9"/>
<rect x="30" y="357.962" width="60" height="50" transform="rotate(-120 30 357.962)" fill="#D9D9D9"/>
<rect x="65" y="418.583" width="60" height="50" transform="rotate(-120 65 418.583)" fill="#D9D9D9"/>
<rect x="100" y="479.205" width="60" height="50" transform="rotate(-120 100 479.205)" fill="#D9D9D9"/>
<rect x="415.801" y="306.933" width="60" height="50" transform="rotate(120 415.801 306.933)" fill="#E30D0D"/>
<rect x="450.263" y="367.244" width="60" height="50" transform="rotate(120 450.263 367.244)" fill="#D9D9D9"/>
<rect x="485.263" y="306.622" width="60" height="50" transform="rotate(120 485.263 306.622)" fill="#D9D9D9"/>
<rect x="519.724" y="366.933" width="60" height="50" transform="rotate(120 519.724 366.933)" fill="#D9D9D9"/>
<rect x="484.724" y="427.554" width="60" height="50" transform="rotate(120 484.724 427.554)" fill="#D9D9D9"/>
<rect x="554.724" y="306.311" width="60" height="50" transform="rotate(120 554.724 306.311)" fill="#D9D9D9"/>
<rect x="624.186" y="306" width="60" height="50" transform="rotate(120 624.186 306)" fill="#D9D9D9"/>
<rect x="519.186" y="487.865" width="60" height="50" transform="rotate(120 519.186 487.865)" fill="#D9D9D9"/>
<rect x="554.186" y="427.244" width="60" height="50" transform="rotate(120 554.186 427.244)" fill="#D9D9D9"/>
<rect x="589.186" y="366.622" width="60" height="50" transform="rotate(120 589.186 366.622)" fill="#D9D9D9"/>
</svg>
