<svg width="24" height="25" viewBox="0 0 24 25" fill="none" xmlns="http://www.w3.org/2000/svg">
<path fill-rule="evenodd" clip-rule="evenodd" d="M20.1598 9.04924L14.4898 3.66186C13.7598 3.56209 12.9398 3.51221 12.0398 3.51221C5.74978 3.51221 3.64978 5.82679 3.64978 12.7406C3.64978 19.6644 5.74978 21.969 12.0398 21.969C18.3398 21.969 20.4398 19.6644 20.4398 12.7406C20.4398 11.3239 20.3498 10.0968 20.1598 9.04924Z" stroke="white" stroke-width="1.5" stroke-linecap="round" stroke-linejoin="round"/>
<path d="M13.9342 3.59473V6.24951C13.9342 8.10317 15.4402 9.60465 17.2982 9.60465H20.2492" stroke="white" stroke-width="1.5" stroke-linecap="round" stroke-linejoin="round"/>
<path d="M11.6603 16.7486V10.7217" stroke="white" stroke-width="1.5" stroke-linecap="round" stroke-linejoin="round"/>
<path d="M9.31458 14.399L11.6596 16.7485L14.0046 14.399" stroke="white" stroke-width="1.5" stroke-linecap="round" stroke-linejoin="round"/>
</svg>
