<svg width="24" height="24" viewBox="0 0 24 24" fill="none" xmlns="http://www.w3.org/2000/svg">
<g clip-path="url(#clip0_20_3992)">
<path fill-rule="evenodd" clip-rule="evenodd" d="M5.25 7.48254C4.65326 7.48254 4.08097 7.71904 3.65901 8.14001C3.23705 8.56099 3 9.13194 3 9.72729L3 14.965C3 15.5604 3.23705 16.1313 3.65901 16.5523C4.08097 16.9733 4.65326 17.2098 5.25 17.2098H18.75C19.3467 17.2098 19.919 16.9733 20.341 16.5523C20.7629 16.1313 21 15.5604 21 14.965V9.72729C21 9.13194 20.7629 8.56099 20.341 8.14001C19.919 7.71904 19.3467 7.48254 18.75 7.48254H5.25ZM9.75 8.97904H8.25V12.7203C8.25 12.9187 8.17098 13.109 8.03033 13.2494C7.88968 13.3897 7.69891 13.4685 7.5 13.4685C7.30109 13.4685 7.11032 13.3897 6.96967 13.2494C6.82902 13.109 6.75 12.9187 6.75 12.7203V8.97904H5.25C5.05109 8.97904 4.86032 9.05787 4.71967 9.1982C4.57902 9.33852 4.5 9.52884 4.5 9.72729V14.965C4.5 15.1635 4.57902 15.3538 4.71967 15.4941C4.86032 15.6344 5.05109 15.7133 5.25 15.7133H18.75C18.9489 15.7133 19.1397 15.6344 19.2803 15.4941C19.421 15.3538 19.5 15.1635 19.5 14.965V9.72729C19.5 9.52884 19.421 9.33852 19.2803 9.1982C19.1397 9.05787 18.9489 8.97904 18.75 8.97904H17.25V11.2238C17.25 11.4222 17.171 11.6125 17.0303 11.7529C16.8897 11.8932 16.6989 11.972 16.5 11.972C16.3011 11.972 16.1103 11.8932 15.9697 11.7529C15.829 11.6125 15.75 11.4222 15.75 11.2238V8.97904H14.25V12.7203C14.25 12.9187 14.171 13.109 14.0303 13.2494C13.8897 13.3897 13.6989 13.4685 13.5 13.4685C13.3011 13.4685 13.1103 13.3897 12.9697 13.2494C12.829 13.109 12.75 12.9187 12.75 12.7203V8.97904H11.25V11.2238C11.25 11.4222 11.171 11.6125 11.0303 11.7529C10.8897 11.8932 10.6989 11.972 10.5 11.972C10.3011 11.972 10.1103 11.8932 9.96967 11.7529C9.82902 11.6125 9.75 11.4222 9.75 11.2238V8.97904Z" fill="white"/>
</g>
<defs>
<clipPath id="clip0_20_3992">
<rect width="18" height="17.9579" fill="white" transform="translate(3 2.99304)"/>
</clipPath>
</defs>
</svg>
