<svg width="24" height="25" viewBox="0 0 24 25" fill="none" xmlns="http://www.w3.org/2000/svg">
<path d="M16.1514 10.3043C17.9895 8.85061 20.4562 7.44438 20.9229 7.94796C21.6943 8.77459 21.6276 16.6419 20.9229 17.3925C20.4943 17.8581 18.0086 16.4519 16.1514 15.0076" stroke="white" stroke-width="1.5" stroke-linecap="round" stroke-linejoin="round"/>
<path fill-rule="evenodd" clip-rule="evenodd" d="M2.5144 12.663C2.5144 7.48278 4.23917 5.75635 9.41536 5.75635C14.5906 5.75635 16.3154 7.48278 16.3154 12.663C16.3154 17.8423 14.5906 19.5697 9.41536 19.5697C4.23917 19.5697 2.5144 17.8423 2.5144 12.663Z" stroke="white" stroke-width="1.5" stroke-linecap="round" stroke-linejoin="round"/>
</svg>
