<svg width="24" height="25" viewBox="0 0 24 25" fill="none" xmlns="http://www.w3.org/2000/svg">
<path fill-rule="evenodd" clip-rule="evenodd" d="M11.2754 3.47656C16.003 3.47656 19.8364 7.29999 19.8364 12.0175C19.8364 16.735 16.003 20.5585 11.2754 20.5585C6.54686 20.5585 2.71448 16.735 2.71448 12.0175C2.71448 7.29999 6.54686 3.47656 11.2754 3.47656Z" stroke="white" stroke-width="1.5" stroke-linecap="round" stroke-linejoin="round"/>
<path fill-rule="evenodd" clip-rule="evenodd" d="M19.899 19.213C20.678 19.213 21.3095 19.8439 21.3095 20.6202C21.3095 21.3984 20.678 22.0283 19.899 22.0283C19.1199 22.0283 18.4875 21.3984 18.4875 20.6202C18.4875 19.8439 19.1199 19.213 19.899 19.213Z" stroke="white" stroke-width="1.5" stroke-linecap="round" stroke-linejoin="round"/>
</svg>
