<svg width="26" height="24" viewBox="0 0 26 24" fill="none" xmlns="http://www.w3.org/2000/svg">
<path d="M15.9393 12.3818H15.9483" stroke="white" stroke-width="2" stroke-linecap="round" stroke-linejoin="round"/>
<path d="M11.9304 12.3818H11.9394" stroke="white" stroke-width="2" stroke-linecap="round" stroke-linejoin="round"/>
<path d="M7.9214 12.3818H7.9304" stroke="white" stroke-width="2" stroke-linecap="round" stroke-linejoin="round"/>
<path fill-rule="evenodd" clip-rule="evenodd" d="M19.071 19.023C16.0159 22.0724 11.4896 22.7312 7.78631 21.0225C7.23961 20.8029 3.70113 21.7806 2.93334 21.0155C2.16555 20.2494 3.14639 16.7187 2.92631 16.1732C1.21285 12.4791 1.87411 7.96166 4.9302 4.9133C8.83147 1.01962 15.1698 1.01962 19.071 4.9133C22.9803 8.813 22.9723 15.1303 19.071 19.023Z" stroke="white" stroke-width="1.5" stroke-linecap="round" stroke-linejoin="round"/>
<circle cx="20" cy="5.99768" r="5" fill="#006633" stroke="white" stroke-width="2"/>
</svg>
