<svg width="24" height="25" viewBox="0 0 24 25" fill="none" xmlns="http://www.w3.org/2000/svg">
<path fill-rule="evenodd" clip-rule="evenodd" d="M2.74979 12.8529C2.74979 5.93211 5.06279 3.62451 11.9998 3.62451C18.9368 3.62451 21.2498 5.93211 21.2498 12.8529C21.2498 19.7737 18.9368 22.0813 11.9998 22.0813C5.06279 22.0813 2.74979 19.7737 2.74979 12.8529Z" stroke="white" stroke-width="1.5" stroke-linecap="round" stroke-linejoin="round"/>
<path d="M11.9998 8.96692V12.8528" stroke="white" stroke-width="1.5" stroke-linecap="round" stroke-linejoin="round"/>
<path d="M11.9955 16.3447H12.0045" stroke="white" stroke-width="1.5" stroke-linecap="round" stroke-linejoin="round"/>
</svg>
