<svg width="24" height="25" viewBox="0 0 24 25" fill="none" xmlns="http://www.w3.org/2000/svg">
<g clip-path="url(#clip0_20_3953)">
<path d="M23.6964 12.0538C20.3183 9.48376 16.2737 8.12488 11.9994 8.12488C7.72498 8.12488 3.68044 9.48376 0.302279 12.0538C0.140312 12.1769 0.0323347 12.36 0.00611147 12.5632C-0.0201117 12.7663 0.0338772 12.971 0.15728 13.1326L2.98013 16.8245C3.10508 16.9876 3.28709 17.0938 3.49071 17.12C3.69433 17.1492 3.89948 17.0923 4.06145 16.9691C5.25229 16.0596 6.58196 15.3656 8.01035 14.9054C8.4145 14.7746 8.63662 14.3422 8.50705 13.9374L7.55993 10.9996C10.4306 10.2702 13.5666 10.2686 16.4388 10.9996L15.4917 13.9374C15.3606 14.3422 15.5842 14.7746 15.9884 14.9054C17.4152 15.3656 18.7433 16.0596 19.9373 16.9691C20.073 17.0707 20.2365 17.1277 20.4062 17.1277C20.4401 17.1277 20.4741 17.1246 20.508 17.12C20.7116 17.0923 20.8952 16.9876 21.0186 16.826L23.8414 13.1326C23.9648 12.971 24.0204 12.7648 23.9926 12.5632C23.9664 12.36 23.8584 12.1769 23.6964 12.0538Z" fill="white"/>
</g>
<defs>
<clipPath id="clip0_20_3953">
<rect width="24" height="23.9439" fill="white" transform="translate(0 0.654175)"/>
</clipPath>
</defs>
</svg>
