<svg width="24" height="25" viewBox="0 0 24 25" fill="none" xmlns="http://www.w3.org/2000/svg">
<path d="M20.3484 12.2872H20.0693C19.0264 12.2872 18.0105 11.9206 17.2089 11.255L11.6865 6.66936C11.2695 6.32311 10.741 6.13245 10.1985 6.13245C8.91595 6.13245 7.87252 7.17345 7.87252 8.453V8.99482C7.87252 10.0504 7.0117 10.9093 5.95359 10.9093C5.21091 10.9093 4.52827 10.4753 4.21444 9.80377L4.06158 9.47665C3.71311 8.73102 2.95514 8.24924 2.13056 8.24924C0.955781 8.24924 0 9.20274 0 10.3748V15.9302C0 17.939 1.63809 19.5732 3.65156 19.5732H20.3484C22.3619 19.5732 24 17.939 24 15.9302C24 13.9214 22.3619 12.2872 20.3484 12.2872ZM20.3484 18.1703H3.65156C2.81583 18.1703 2.0858 17.712 1.69922 17.0345H22.3008C21.9142 17.712 21.1842 18.1703 20.3484 18.1703ZM1.40625 15.6316V10.3748C1.40625 9.97634 1.73119 9.6522 2.13056 9.6522C2.41087 9.6522 2.66859 9.81602 2.78705 10.0695L2.93991 10.3966C3.4837 11.5603 4.66664 12.3122 5.95364 12.3122C7.78716 12.3122 9.27881 10.8241 9.27881 8.99482V8.453C9.27881 7.94704 9.69141 7.53541 10.1985 7.53541C10.413 7.53541 10.622 7.6108 10.7869 7.74773L12.1417 8.87267L10.5981 10.4127L11.5924 11.4047L13.227 9.77393L13.8379 10.2812L12.3639 11.7516L13.3583 12.7437L14.9233 11.1824L15.5341 11.6896L14.1298 13.0906L15.1242 14.0827L16.6296 12.5808C17.6273 13.2986 18.8338 13.6902 20.0694 13.6902H20.3485C21.4851 13.6902 22.4264 14.5372 22.5733 15.6316H1.40625V15.6316Z" fill="white"/>
</svg>
