<svg width="24" height="24" viewBox="0 0 24 24" fill="none" xmlns="http://www.w3.org/2000/svg">
<path d="M11.9611 16.4759V13.854" stroke="white" stroke-width="1.5" stroke-linecap="round" stroke-linejoin="round"/>
<path d="M21.0895 11.4486L21.0605 11.4696C18.6385 12.9581 15.4405 13.857 11.9565 13.857C8.47246 13.857 5.28346 12.9581 2.86246 11.4696L2.83246 11.4486" stroke="white" stroke-width="1.5" stroke-linecap="round" stroke-linejoin="round"/>
<path fill-rule="evenodd" clip-rule="evenodd" d="M2.75018 13.3171C2.75018 7.17951 5.05318 5.1333 11.9612 5.1333C18.8702 5.1333 21.1722 7.17951 21.1722 13.3171C21.1722 19.4548 18.8702 21.501 11.9612 21.501C5.05318 21.501 2.75018 19.4548 2.75018 13.3171Z" stroke="white" stroke-width="1.5" stroke-linecap="round" stroke-linejoin="round"/>
<path d="M15.2238 5.35444V4.72591C15.2238 3.46487 14.3008 2.44226 13.1638 2.44226H10.7588C9.62179 2.44226 8.69879 3.46487 8.69879 4.72591V5.35444" stroke="white" stroke-width="1.5" stroke-linecap="round" stroke-linejoin="round"/>
</svg>
