-37.86589  0
-36.53702  0.21
-34.94009  2.07
-28.82848  6.96
-28.45831  7.25
-26.64342  8.48
-22.54396  9.97
-19.79167 10.35
-5.90165  10.35
-4.50352  30.14
-3.66203  30.79
3.91416   31.08
15.88373  28.56
17.43553  14.10
25.61315   3.32
27.02844   2.15
27.8       0.65
27.87587   0
