<?xml version="1.0" encoding="UTF-8" standalone="no"?>
<svg
   xmlns:dc="http://purl.org/dc/elements/1.1/"
   xmlns:cc="http://creativecommons.org/ns#"
   xmlns:rdf="http://www.w3.org/1999/02/22-rdf-syntax-ns#"
   xmlns:svg="http://www.w3.org/2000/svg"
   xmlns="http://www.w3.org/2000/svg"
   xmlns:xlink="http://www.w3.org/1999/xlink"
   xmlns:sodipodi="http://sodipodi.sourceforge.net/DTD/sodipodi-0.dtd"
   xmlns:inkscape="http://www.inkscape.org/namespaces/inkscape"
   width="128"
   height="128"
   viewBox="0 0 128 128"
   version="1.1"
   id="svg8652"
   inkscape:version="1.0.1 (3bc2e813f5, 2020-09-07)"
   sodipodi:docname="UI-1.svg"
   inkscape:export-filename="UI-1-15.png"
   inkscape:export-xdpi="96"
   inkscape:export-ydpi="96">
  <defs
     id="defs8646" />
  <sodipodi:namedview
     id="base"
     pagecolor="#ffffff"
     bordercolor="#666666"
     borderopacity="1.0"
     inkscape:pageopacity="0.0"
     inkscape:pageshadow="2"
     inkscape:zoom="4.404762"
     inkscape:cx="38.547368"
     inkscape:cy="63.787026"
     inkscape:document-units="px"
     inkscape:current-layer="layer8"
     showgrid="true"
     units="px"
     inkscape:window-width="1366"
     inkscape:window-height="734"
     inkscape:window-x="0"
     inkscape:window-y="34"
     inkscape:window-maximized="1"
     inkscape:snap-grids="true"
     showguides="true"
     inkscape:guide-bbox="true"
     inkscape:pagecheckerboard="false"
     inkscape:snap-bbox="true"
     inkscape:bbox-paths="true"
     inkscape:bbox-nodes="true"
     inkscape:snap-bbox-edge-midpoints="true"
     inkscape:snap-bbox-midpoints="true"
     inkscape:object-paths="true"
     inkscape:snap-intersection-paths="true"
     inkscape:snap-smooth-nodes="true"
     inkscape:snap-midpoints="true"
     inkscape:snap-object-midpoints="true"
     inkscape:snap-center="true"
     inkscape:snap-text-baseline="true"
     inkscape:snap-page="true"
     inkscape:snap-global="false"
     inkscape:snap-nodes="true"
     inkscape:snap-others="true"
     inkscape:measure-start="0,0"
     inkscape:measure-end="0,0"
     inkscape:document-rotation="0">
    <inkscape:grid
       type="xygrid"
       id="grid8654" />
  </sodipodi:namedview>
  <metadata
     id="metadata8649">
    <rdf:RDF>
      <cc:Work
         rdf:about="">
        <dc:format>image/svg+xml</dc:format>
        <dc:type
           rdf:resource="http://purl.org/dc/dcmitype/StillImage" />
        <dc:title></dc:title>
      </cc:Work>
    </rdf:RDF>
  </metadata>
  <g
     inkscape:groupmode="layer"
     id="layer8"
     inkscape:label="bg"
     style="display:inline"
     transform="translate(0,-33.866667)"
     sodipodi:insensitive="true">
    <circle
       style="fill:#181818;fill-opacity:1;stroke:none;stroke-width:0.903591;stroke-linecap:round;stroke-miterlimit:4;stroke-dasharray:none;stroke-opacity:1"
       id="path11933"
       cx="64"
       cy="97.866669"
       r="64" />
  </g>
  <g
     inkscape:label="text x10 kg/cm2"
     inkscape:groupmode="layer"
     id="layer1"
     transform="translate(0,-263.13332)"
     style="display:inline"
     sodipodi:insensitive="true">
    <text
       id="text4513"
       y="369.32828"
       x="32.604481"
       style="font-style:normal;font-variant:normal;font-weight:normal;font-stretch:normal;font-size:16px;line-height:19.9999px;font-family:LENYA69;-inkscape-font-specification:LENYA69;letter-spacing:0px;word-spacing:0px;fill:#e7e7e7;fill-opacity:1;stroke:none;stroke-width:0.999999;stroke-opacity:0.498039"
       xml:space="preserve"><tspan
         style="font-size:21.3334px;letter-spacing:0px;fill:#e7e7e7;fill-opacity:1;stroke:none;stroke-width:0.999999;stroke-opacity:0.498039"
         y="369.32828"
         x="32.604481"
         id="tspan4511"
         sodipodi:role="line">*10</tspan></text>
    <text
       xml:space="preserve"
       style="font-style:normal;font-variant:normal;font-weight:normal;font-stretch:normal;font-size:16px;line-height:19.9999px;font-family:LENYA69;-inkscape-font-specification:LENYA69;letter-spacing:0px;word-spacing:0px;fill:#e7e7e7;fill-opacity:1;stroke:none;stroke-width:0.999999;stroke-opacity:0.498039"
       x="64.637779"
       y="359.82928"
       id="text4519"><tspan
         sodipodi:role="line"
         id="tspan4517"
         x="64.637779"
         y="359.82928"
         style="font-size:21.3334px;fill:#e7e7e7;fill-opacity:1;stroke:none;stroke-width:0.999999;stroke-opacity:0.498039">кГ</tspan></text>
    <text
       id="text4523"
       y="375.52414"
       x="64.08802"
       style="font-style:normal;font-variant:normal;font-weight:normal;font-stretch:normal;font-size:16px;line-height:19.9999px;font-family:LENYA69;-inkscape-font-specification:LENYA69;letter-spacing:0px;word-spacing:0px;fill:#e7e7e7;fill-opacity:1;stroke:none;stroke-width:0.999999;stroke-opacity:0.498039"
       xml:space="preserve"><tspan
         style="font-size:21.3334px;letter-spacing:1.14px;fill:#e7e7e7;fill-opacity:1;stroke:none;stroke-width:0.999999;stroke-opacity:0.498039"
         y="375.52414"
         x="64.08802"
         id="tspan4521"
         sodipodi:role="line">см</tspan></text>
    <text
       xml:space="preserve"
       style="font-style:normal;font-variant:normal;font-weight:normal;font-stretch:normal;font-size:16px;line-height:19.9999px;font-family:LENYA69;-inkscape-font-specification:LENYA69;letter-spacing:0px;word-spacing:0px;fill:#e7e7e7;fill-opacity:1;stroke:none;stroke-width:0.999999;stroke-miterlimit:4;stroke-dasharray:none;stroke-opacity:0.498039"
       x="85.326973"
       y="371.1817"
       id="text4537"><tspan
         sodipodi:role="line"
         id="tspan4535"
         x="85.326973"
         y="371.1817"
         style="font-size:8.00001px;fill:#e7e7e7;fill-opacity:1;stroke:none;stroke-width:0.999999;stroke-miterlimit:4;stroke-dasharray:none;stroke-opacity:0.498039">2</tspan></text>
    <path
       style="fill:none;fill-opacity:1;stroke:#e7e7e7;stroke-width:1.99999;stroke-linecap:round;stroke-linejoin:miter;stroke-miterlimit:4;stroke-dasharray:none;stroke-opacity:1"
       d="m 64.93937,362.7009 17.979625,-1.2e-4"
       id="path4539"
       inkscape:connector-curvature="0"
       sodipodi:nodetypes="cc" />
  </g>
  <g
     inkscape:groupmode="layer"
     id="layer15"
     inkscape:label="text kg/cm2"
     sodipodi:insensitive="true"
     style="display:none">
    <text
       xml:space="preserve"
       style="font-style:normal;font-variant:normal;font-weight:normal;font-stretch:normal;font-size:16px;line-height:19.9999px;font-family:LENYA69;-inkscape-font-specification:LENYA69;letter-spacing:0px;word-spacing:0px;display:inline;fill:#e7e7e7;fill-opacity:1;stroke:none;stroke-width:0.999999;stroke-opacity:0.498039"
       x="53.626968"
       y="96.695999"
       id="text4519-8"><tspan
         sodipodi:role="line"
         id="tspan4517-5"
         x="53.626968"
         y="96.695999"
         style="font-size:21.3334px;fill:#e7e7e7;fill-opacity:1;stroke:none;stroke-width:0.999999;stroke-opacity:0.498039">кГ</tspan></text>
    <text
       id="text4523-2"
       y="112.39082"
       x="53.077206"
       style="font-style:normal;font-variant:normal;font-weight:normal;font-stretch:normal;font-size:16px;line-height:19.9999px;font-family:LENYA69;-inkscape-font-specification:LENYA69;letter-spacing:0px;word-spacing:0px;display:inline;fill:#e7e7e7;fill-opacity:1;stroke:none;stroke-width:0.999999;stroke-opacity:0.498039"
       xml:space="preserve"><tspan
         style="font-size:21.3334px;letter-spacing:1.14px;fill:#e7e7e7;fill-opacity:1;stroke:none;stroke-width:0.999999;stroke-opacity:0.498039"
         y="112.39082"
         x="53.077206"
         id="tspan4521-3"
         sodipodi:role="line">см</tspan></text>
    <text
       xml:space="preserve"
       style="font-style:normal;font-variant:normal;font-weight:normal;font-stretch:normal;font-size:16px;line-height:19.9999px;font-family:LENYA69;-inkscape-font-specification:LENYA69;letter-spacing:0px;word-spacing:0px;display:inline;fill:#e7e7e7;fill-opacity:1;stroke:none;stroke-width:0.999999;stroke-miterlimit:4;stroke-dasharray:none;stroke-opacity:0.498039"
       x="74.316162"
       y="108.04842"
       id="text4537-7"><tspan
         sodipodi:role="line"
         id="tspan4535-8"
         x="74.316162"
         y="108.04842"
         style="font-size:8.00001px;fill:#e7e7e7;fill-opacity:1;stroke:none;stroke-width:0.999999;stroke-miterlimit:4;stroke-dasharray:none;stroke-opacity:0.498039">2</tspan></text>
    <path
       style="display:inline;fill:none;fill-opacity:1;stroke:#e7e7e7;stroke-width:1.99999;stroke-linecap:round;stroke-linejoin:miter;stroke-miterlimit:4;stroke-dasharray:none;stroke-opacity:1"
       d="m 53.928558,99.567577 17.97963,-1.13e-4"
       id="path4539-8"
       inkscape:connector-curvature="0"
       sodipodi:nodetypes="cc" />
  </g>
  <g
     inkscape:groupmode="layer"
     id="layer2"
     inkscape:label="needles"
     transform="translate(0,-33.866667)"
     sodipodi:insensitive="true">
    <rect
       style="fill:#e7e7e7;fill-opacity:1;stroke-width:1.13389"
       id="rect2782"
       width="12"
       height="12"
       x="4"
       y="37.866665" />
  </g>
  <g
     inkscape:groupmode="layer"
     id="layer3"
     inkscape:label="circle"
     style="display:inline"
     sodipodi:insensitive="true">
    <path
       style="display:inline;opacity:1;fill:none;fill-opacity:1;stroke:#e7e7e7;stroke-width:3;stroke-linecap:round;stroke-linejoin:miter;stroke-miterlimit:4;stroke-dasharray:none;stroke-opacity:1"
       id="path4454-7"
       sodipodi:type="arc"
       sodipodi:cx="64.000008"
       sodipodi:cy="86.000008"
       sodipodi:rx="62.469814"
       sodipodi:ry="62.469814"
       sodipodi:start="3.6651914"
       sodipodi:end="5.7595865"
       d="M 9.8995606,54.765102 A 62.469814,62.469814 0 0 1 64.000008,23.530193 62.469814,62.469814 0 0 1 118.10045,54.765099"
       sodipodi:arc-type="arc"
       sodipodi:open="true" />
  </g>
  <g
     inkscape:groupmode="layer"
     id="layer5"
     inkscape:label="8 5"
     style="display:none"
     sodipodi:insensitive="true">
    <path
       inkscape:tile-y0="12.501054"
       inkscape:tile-x0="3.6514546"
       inkscape:transform-center-y="-35.308166"
       sodipodi:nodetypes="cc"
       inkscape:connector-curvature="0"
       id="use4893-8"
       d="m 14.812094,48.256792 6.346827,4.870091"
       style="fill:none;stroke:#e7e7e7;stroke-width:1.99999;stroke-linecap:round;stroke-linejoin:miter;stroke-miterlimit:4;stroke-dasharray:none;stroke-opacity:1"
       inkscape:transform-center-x="46.014496"
       inkscape:tile-cx="16.933333"
       inkscape:tile-cy="22.754166"
       inkscape:tile-w="2.2144213"
       inkscape:tile-h="1.8223203" />
    <use
       x="0"
       y="0"
       inkscape:tiled-clone-of="#use4893-8"
       xlink:href="#use4893-8"
       transform="rotate(15,64.000003,86.000004)"
       id="use4965"
       inkscape:transform-center-x="-8.6310339"
       inkscape:transform-center-y="-22.20137"
       width="100%"
       height="100%" />
    <use
       x="0"
       y="0"
       inkscape:tiled-clone-of="#use4893-8"
       xlink:href="#use4893-8"
       transform="rotate(30,64.000002,86)"
       id="use4967"
       inkscape:transform-center-x="-32.056059"
       inkscape:transform-center-y="-29.237702"
       width="100%"
       height="100%" />
    <use
       x="0"
       y="0"
       inkscape:tiled-clone-of="#use4893-8"
       xlink:href="#use4893-8"
       transform="rotate(45,64.000002,86.000002)"
       id="use4969"
       inkscape:transform-center-x="-56.504036"
       inkscape:transform-center-y="-29.971433"
       width="100%"
       height="100%" />
    <use
       x="0"
       y="0"
       inkscape:tiled-clone-of="#use4893-8"
       xlink:href="#use4893-8"
       transform="rotate(60,64.000002,86.000004)"
       id="use4971"
       inkscape:transform-center-x="-80.30887"
       inkscape:transform-center-y="-24.352561"
       width="100%"
       height="100%" />
    <use
       x="0"
       y="0"
       inkscape:tiled-clone-of="#use4893-8"
       xlink:href="#use4893-8"
       transform="rotate(75,64.000004,86.000005)"
       id="use4973"
       inkscape:transform-center-x="-101.84831"
       inkscape:transform-center-y="-12.764004"
       width="100%"
       height="100%" />
    <use
       x="0"
       y="0"
       inkscape:tiled-clone-of="#use4893-8"
       xlink:href="#use4893-8"
       transform="rotate(90,64,86)"
       id="use4975"
       inkscape:transform-center-x="-119.65445"
       inkscape:transform-center-y="4.004498"
       width="100%"
       height="100%" />
    <use
       x="0"
       y="0"
       inkscape:tiled-clone-of="#use4893-8"
       xlink:href="#use4893-8"
       transform="rotate(105,63.999999,86)"
       id="use4977"
       inkscape:transform-center-x="-132.51387"
       inkscape:transform-center-y="24.8102"
       width="100%"
       height="100%" />
  </g>
  <g
     inkscape:groupmode="layer"
     id="layer4"
     inkscape:label="8 10"
     style="display:none"
     sodipodi:insensitive="true">
    <path
       inkscape:tile-y0="14.152362"
       inkscape:tile-x0="2.3251326"
       inkscape:transform-center-x="49.363452"
       inkscape:transform-center-y="-28.500001"
       sodipodi:nodetypes="cc"
       inkscape:connector-curvature="0"
       id="use4893"
       d="m 10.306425,55.000002 8.660254,5.000002"
       style="fill:none;stroke:#e7e7e7;stroke-width:3;stroke-linecap:round;stroke-linejoin:miter;stroke-miterlimit:4;stroke-dasharray:none;stroke-opacity:1" />
    <path
       inkscape:tile-y0="14.152362"
       inkscape:tile-x0="2.3251326"
       inkscape:transform-center-x="49.363452"
       inkscape:transform-center-y="-28.500001"
       sodipodi:nodetypes="cc"
       inkscape:connector-curvature="0"
       id="use4895"
       d="m 20.15938,42.159382 7.071068,7.071069"
       style="fill:none;stroke:#e7e7e7;stroke-width:3;stroke-linecap:round;stroke-linejoin:miter;stroke-miterlimit:4;stroke-dasharray:none;stroke-opacity:1" />
    <path
       inkscape:tile-y0="14.152362"
       inkscape:tile-x0="2.3251326"
       inkscape:transform-center-x="49.363452"
       inkscape:transform-center-y="-28.500001"
       sodipodi:nodetypes="cc"
       inkscape:connector-curvature="0"
       id="use4897"
       d="m 33,32.306426 4.999999,8.660254"
       style="fill:none;stroke:#e7e7e7;stroke-width:3;stroke-linecap:round;stroke-linejoin:miter;stroke-miterlimit:4;stroke-dasharray:none;stroke-opacity:1" />
    <path
       inkscape:tile-y0="14.152362"
       inkscape:tile-x0="2.3251326"
       inkscape:transform-center-x="49.363452"
       inkscape:transform-center-y="-28.500002"
       sodipodi:nodetypes="cc"
       inkscape:connector-curvature="0"
       id="use4899"
       d="m 47.95322,26.112599 2.58819,9.65926"
       style="fill:none;stroke:#e7e7e7;stroke-width:3;stroke-linecap:round;stroke-linejoin:miter;stroke-miterlimit:4;stroke-dasharray:none;stroke-opacity:1" />
    <path
       inkscape:tile-y0="14.152362"
       inkscape:tile-x0="2.3251326"
       inkscape:transform-center-x="49.363452"
       inkscape:transform-center-y="-28.500002"
       sodipodi:nodetypes="cc"
       inkscape:connector-curvature="0"
       id="use4901"
       d="M 64.000002,24 V 34.000002"
       style="fill:none;stroke:#e7e7e7;stroke-width:3;stroke-linecap:round;stroke-linejoin:miter;stroke-miterlimit:4;stroke-dasharray:none;stroke-opacity:1" />
    <path
       inkscape:tile-y0="14.152362"
       inkscape:tile-x0="2.3251326"
       inkscape:transform-center-x="49.363452"
       inkscape:transform-center-y="-28.500002"
       sodipodi:nodetypes="cc"
       inkscape:connector-curvature="0"
       id="use4903"
       d="m 80.046781,26.112599 -2.58819,9.659259"
       style="fill:none;stroke:#e7e7e7;stroke-width:3;stroke-linecap:round;stroke-linejoin:miter;stroke-miterlimit:4;stroke-dasharray:none;stroke-opacity:1" />
    <path
       inkscape:tile-y0="14.152362"
       inkscape:tile-x0="2.3251326"
       inkscape:transform-center-x="49.363452"
       inkscape:transform-center-y="-28.500002"
       sodipodi:nodetypes="cc"
       inkscape:connector-curvature="0"
       id="use4905"
       d="M 95.000002,32.306425 90.000001,40.96668"
       style="fill:none;stroke:#e7e7e7;stroke-width:3;stroke-linecap:round;stroke-linejoin:miter;stroke-miterlimit:4;stroke-dasharray:none;stroke-opacity:1" />
    <path
       inkscape:tile-y0="14.152362"
       inkscape:tile-x0="2.3251326"
       inkscape:transform-center-x="49.363455"
       inkscape:transform-center-y="-28.500001"
       sodipodi:nodetypes="cc"
       inkscape:connector-curvature="0"
       id="use4907"
       d="m 107.84062,42.159382 -7.07107,7.071065"
       style="fill:none;stroke:#e7e7e7;stroke-width:3;stroke-linecap:round;stroke-linejoin:miter;stroke-miterlimit:4;stroke-dasharray:none;stroke-opacity:1" />
    <path
       inkscape:tile-y0="14.152362"
       inkscape:tile-x0="2.3251326"
       inkscape:transform-center-x="49.363454"
       inkscape:transform-center-y="-28.500002"
       sodipodi:nodetypes="cc"
       inkscape:connector-curvature="0"
       id="use4909"
       d="M 117.69358,55.000002 109.03332,60"
       style="fill:none;stroke:#e7e7e7;stroke-width:3;stroke-linecap:round;stroke-linejoin:miter;stroke-miterlimit:4;stroke-dasharray:none;stroke-opacity:1" />
  </g>
  <g
     inkscape:groupmode="layer"
     id="layer7"
     inkscape:label="8 text"
     style="display:none"
     sodipodi:insensitive="true">
    <text
       xml:space="preserve"
       style="font-style:normal;font-variant:normal;font-weight:normal;font-stretch:normal;font-size:16px;line-height:19.9999px;font-family:LENYA69;-inkscape-font-specification:LENYA69;letter-spacing:0px;word-spacing:0px;display:inline;fill:#e7e7e7;fill-opacity:1;stroke:none;stroke-width:0.999999;stroke-opacity:0.498039"
       x="16.961344"
       y="82.87722"
       id="text4489"><tspan
         sodipodi:role="line"
         id="tspan4487"
         x="16.961344"
         y="82.87722"
         style="font-size:32.0001px;fill:#e7e7e7;fill-opacity:1;stroke:none;stroke-width:0.999999;stroke-opacity:0.498039">0</tspan></text>
    <text
       id="text4493"
       y="81.826683"
       x="96.283806"
       style="font-style:normal;font-variant:normal;font-weight:normal;font-stretch:normal;font-size:16px;line-height:19.9999px;font-family:LENYA69;-inkscape-font-specification:LENYA69;letter-spacing:0px;word-spacing:0px;display:inline;fill:#e7e7e7;fill-opacity:1;stroke:none;stroke-width:0.999999;stroke-opacity:0.498039"
       xml:space="preserve"><tspan
         style="font-size:32.0001px;fill:#e7e7e7;fill-opacity:1;stroke:none;stroke-width:0.999999;stroke-opacity:0.498039"
         y="81.826683"
         x="96.283806"
         id="tspan4491"
         sodipodi:role="line">8</tspan></text>
    <text
       xml:space="preserve"
       style="font-style:normal;font-variant:normal;font-weight:normal;font-stretch:normal;font-size:16px;line-height:19.9999px;font-family:LENYA69;-inkscape-font-specification:LENYA69;letter-spacing:0px;word-spacing:0px;display:inline;fill:#e7e7e7;fill-opacity:1;stroke:none;stroke-width:0.999999;stroke-opacity:0.498039"
       x="33.129761"
       y="59.895199"
       id="text4497"><tspan
         sodipodi:role="line"
         id="tspan4495"
         x="33.129761"
         y="59.895199"
         style="font-size:21.3334px;fill:#e7e7e7;fill-opacity:1;stroke:none;stroke-width:0.999999;stroke-opacity:0.498039">2</tspan></text>
    <text
       id="text4501"
       y="50.130344"
       x="56.413345"
       style="font-style:normal;font-variant:normal;font-weight:normal;font-stretch:normal;font-size:16px;line-height:19.9999px;font-family:LENYA69;-inkscape-font-specification:LENYA69;letter-spacing:0px;word-spacing:0px;display:inline;fill:#e7e7e7;fill-opacity:1;stroke:none;stroke-width:0.999999;stroke-opacity:0.498039"
       xml:space="preserve"><tspan
         style="font-size:21.3334px;fill:#e7e7e7;fill-opacity:1;stroke:none;stroke-width:0.999999;stroke-opacity:0.498039"
         y="50.130344"
         x="56.413345"
         id="tspan4499"
         sodipodi:role="line">4</tspan></text>
    <text
       xml:space="preserve"
       style="font-style:normal;font-variant:normal;font-weight:normal;font-stretch:normal;font-size:16px;line-height:19.9999px;font-family:LENYA69;-inkscape-font-specification:LENYA69;letter-spacing:0px;word-spacing:0px;display:inline;fill:#e7e7e7;fill-opacity:1;stroke:none;stroke-width:0.999999;stroke-opacity:0.498039"
       x="84.500114"
       y="59.246746"
       id="text4505"><tspan
         sodipodi:role="line"
         id="tspan4503"
         x="84.500114"
         y="59.246746"
         style="font-size:21.3334px;fill:#e7e7e7;fill-opacity:1;stroke:none;stroke-width:0.999999;stroke-opacity:0.498039">6</tspan></text>
  </g>
  <g
     inkscape:groupmode="layer"
     id="layer13"
     inkscape:label="15 10"
     style="display:none"
     sodipodi:insensitive="true">
    <path
       inkscape:tile-y0="14.285601"
       inkscape:tile-x0="2.4590565"
       inkscape:transform-center-y="-35.708372"
       sodipodi:nodetypes="cc"
       inkscape:connector-curvature="0"
       id="use4893-8-7-7"
       d="m 15.14333,47.828987 6.30409,4.925295"
       style="display:inline;fill:none;stroke:#e7e7e7;stroke-width:1.99999;stroke-linecap:round;stroke-linejoin:miter;stroke-miterlimit:4;stroke-dasharray:none;stroke-opacity:1"
       inkscape:tile-cx="16.933332"
       inkscape:tile-cy="22.754167"
       inkscape:tile-w="2.3687889"
       inkscape:tile-h="1.5912954"
       inkscape:transform-center-x="45.704623" />
    <use
       x="0"
       y="0"
       inkscape:tiled-clone-of="#use4893-8-7-7"
       xlink:href="#use4893-8-7-7"
       id="use1094"
       inkscape:transform-center-x="16.617532"
       inkscape:transform-center-y="-2.7394752"
       width="100%"
       height="100%" />
    <use
       x="0"
       y="0"
       inkscape:tiled-clone-of="#use4893-8-7-7"
       xlink:href="#use4893-8-7-7"
       transform="rotate(7.9999998,63.999998,86.000006)"
       id="use1096"
       inkscape:transform-center-x="6.8143814"
       inkscape:transform-center-y="-10.960437"
       width="100%"
       height="100%" />
    <use
       x="0"
       y="0"
       inkscape:tiled-clone-of="#use4893-8-7-7"
       xlink:href="#use4893-8-7-7"
       transform="rotate(16.000001,63.999995,86.000012)"
       id="use1098"
       inkscape:transform-center-x="-4.0375065"
       inkscape:transform-center-y="-17.737059"
       width="100%"
       height="100%" />
    <use
       x="0"
       y="0"
       inkscape:tiled-clone-of="#use4893-8-7-7"
       xlink:href="#use4893-8-7-7"
       transform="rotate(24,63.999999,86.000008)"
       id="use1100"
       inkscape:transform-center-x="-15.726902"
       inkscape:transform-center-y="-22.937442"
       width="100%"
       height="100%" />
    <use
       x="0"
       y="0"
       inkscape:tiled-clone-of="#use4893-8-7-7"
       xlink:href="#use4893-8-7-7"
       transform="rotate(40,63.999998,86.000006)"
       id="use1102"
       inkscape:transform-center-x="-40.696282"
       inkscape:transform-center-y="-28.237258"
       width="100%"
       height="100%" />
    <use
       x="0"
       y="0"
       inkscape:tiled-clone-of="#use4893-8-7-7"
       xlink:href="#use4893-8-7-7"
       transform="rotate(47.999999,63.999999,86.000006)"
       id="use1104"
       inkscape:transform-center-x="-53.490263"
       inkscape:transform-center-y="-28.233538"
       width="100%"
       height="100%" />
    <use
       x="0"
       y="0"
       inkscape:tiled-clone-of="#use4893-8-7-7"
       xlink:href="#use4893-8-7-7"
       transform="rotate(56,63.999999,86.000006)"
       id="use1106"
       inkscape:transform-center-x="-66.15922"
       inkscape:transform-center-y="-26.449274"
       width="100%"
       height="100%" />
    <use
       x="0"
       y="0"
       inkscape:tiled-clone-of="#use4893-8-7-7"
       xlink:href="#use4893-8-7-7"
       transform="rotate(64,64,86.000008)"
       id="use1108"
       inkscape:transform-center-x="-78.456564"
       inkscape:transform-center-y="-22.919198"
       width="100%"
       height="100%" />
    <use
       x="0"
       y="0"
       inkscape:tiled-clone-of="#use4893-8-7-7"
       xlink:href="#use4893-8-7-7"
       transform="rotate(80,64.000001,86.000008)"
       id="use1110"
       inkscape:transform-center-x="-100.99087"
       inkscape:transform-center-y="-10.929084"
       width="100%"
       height="100%" />
    <use
       x="0"
       y="0"
       inkscape:tiled-clone-of="#use4893-8-7-7"
       xlink:href="#use4893-8-7-7"
       transform="rotate(88,63.999999,86.000007)"
       id="use1112"
       inkscape:transform-center-x="-110.78924"
       inkscape:transform-center-y="-2.7024188"
       width="100%"
       height="100%" />
    <use
       x="0"
       y="0"
       inkscape:tiled-clone-of="#use4893-8-7-7"
       xlink:href="#use4893-8-7-7"
       transform="rotate(96,64,86.000007)"
       id="use1114"
       inkscape:transform-center-x="-119.34732"
       inkscape:transform-center-y="6.8078521"
       width="100%"
       height="100%" />
    <use
       x="0"
       y="0"
       inkscape:tiled-clone-of="#use4893-8-7-7"
       xlink:href="#use4893-8-7-7"
       transform="rotate(104,64,86.000008)"
       id="use1116"
       inkscape:transform-center-x="-126.49854"
       inkscape:transform-center-y="17.416627"
       width="100%"
       height="100%" />
  </g>
  <g
     inkscape:groupmode="layer"
     id="layer12"
     inkscape:label="15 50"
     style="display:none"
     sodipodi:insensitive="true">
    <path
       inkscape:tile-y0="14.152362"
       inkscape:tile-x0="2.3251326"
       inkscape:transform-center-x="49.363452"
       inkscape:transform-center-y="-28.500001"
       sodipodi:nodetypes="cc"
       inkscape:connector-curvature="0"
       id="use4893-3-3"
       d="m 10.306425,55.000002 8.660255,5.000002"
       style="display:inline;fill:none;stroke:#e7e7e7;stroke-width:3;stroke-linecap:round;stroke-linejoin:miter;stroke-miterlimit:4;stroke-dasharray:none;stroke-opacity:1"
       inkscape:tile-cx="16.933333"
       inkscape:tile-cy="22.754166"
       inkscape:tile-w="3.09491"
       inkscape:tile-h="2.1223591" />
    <use
       x="0"
       y="0"
       inkscape:tiled-clone-of="#use4893-3-3"
       xlink:href="#use4893-3-3"
       transform="rotate(40,64.000003,86.000003)"
       id="use1032"
       inkscape:transform-center-x="-46.507058"
       inkscape:transform-center-y="-29.628898"
       width="100%"
       height="100%" />
    <use
       x="0"
       y="0"
       inkscape:tiled-clone-of="#use4893-3-3"
       xlink:href="#use4893-3-3"
       transform="rotate(80,64.000005,86.000004)"
       id="use1034"
       inkscape:transform-center-x="-106.33671"
       inkscape:transform-center-y="-8.2600506"
       width="100%"
       height="100%" />
    <use
       x="0"
       y="0"
       inkscape:tiled-clone-of="#use4893-3-3"
       xlink:href="#use4893-3-3"
       transform="rotate(120,64.000002,86.000002)"
       id="use1036"
       inkscape:transform-center-x="-138.43325"
       inkscape:transform-center-y="46.567197"
       width="100%"
       height="100%" />
  </g>
  <g
     inkscape:groupmode="layer"
     id="layer14"
     inkscape:label="15 text"
     style="display:none"
     sodipodi:insensitive="true">
    <text
       xml:space="preserve"
       style="font-style:normal;font-variant:normal;font-weight:normal;font-stretch:normal;font-size:16px;line-height:19.9999px;font-family:LENYA69;-inkscape-font-specification:LENYA69;letter-spacing:0px;word-spacing:0px;fill:#e7e7e7;fill-opacity:1;stroke:none;stroke-width:0.999999"
       x="21.714329"
       y="72.098633"
       id="text2258"><tspan
         sodipodi:role="line"
         id="tspan2256"
         x="21.714329"
         y="72.098633"
         style="font-size:26.6666px;fill:#e7e7e7;fill-opacity:1;stroke-width:0.999999">0</tspan></text>
    <text
       id="text2262"
       y="72.131874"
       x="85.969864"
       style="font-style:normal;font-variant:normal;font-weight:normal;font-stretch:normal;font-size:16px;line-height:19.9999px;font-family:LENYA69;-inkscape-font-specification:LENYA69;letter-spacing:0px;word-spacing:0px;fill:#e7e7e7;fill-opacity:1;stroke:none;stroke-width:0.999999"
       xml:space="preserve"><tspan
         style="font-size:26.6666px;fill:#e7e7e7;fill-opacity:1;stroke-width:0.999999"
         y="72.131874"
         x="85.969864"
         id="tspan2260"
         sodipodi:role="line">15</tspan></text>
    <text
       xml:space="preserve"
       style="font-style:normal;font-variant:normal;font-weight:normal;font-stretch:normal;font-size:16px;line-height:19.9999px;font-family:LENYA69;-inkscape-font-specification:LENYA69;letter-spacing:0px;word-spacing:0px;fill:#e7e7e7;fill-opacity:1;stroke:none;stroke-width:0.999999"
       x="47.595417"
       y="50.94381"
       id="text2266"><tspan
         sodipodi:role="line"
         id="tspan2264"
         x="47.595417"
         y="50.94381"
         style="font-size:18.6667px;fill:#e7e7e7;fill-opacity:1;stroke-width:0.999999">5</tspan></text>
    <text
       id="text2270"
       y="51.024075"
       x="71.567421"
       style="font-style:normal;font-variant:normal;font-weight:normal;font-stretch:normal;font-size:16px;line-height:19.9999px;font-family:LENYA69;-inkscape-font-specification:LENYA69;letter-spacing:0px;word-spacing:0px;fill:#e7e7e7;fill-opacity:1;stroke:none;stroke-width:0.999999"
       xml:space="preserve"><tspan
         style="font-size:18.6667px;fill:#e7e7e7;fill-opacity:1;stroke-width:0.999999"
         y="51.024075"
         x="71.567421"
         id="tspan2268"
         sodipodi:role="line">10</tspan></text>
  </g>
  <g
     inkscape:groupmode="layer"
     id="layer10"
     inkscape:label="24 20"
     style="display:inline"
     sodipodi:insensitive="true">
    <path
       inkscape:tile-y0="11.942756"
       inkscape:tile-x0="4.0995364"
       inkscape:transform-center-y="-37.281684"
       sodipodi:nodetypes="cc"
       inkscape:connector-curvature="0"
       id="use4893-8-7"
       d="m 16.505246,46.147169 6.128356,5.142301"
       style="display:inline;fill:none;stroke:#e7e7e7;stroke-width:1.99999;stroke-linecap:round;stroke-linejoin:miter;stroke-miterlimit:4;stroke-dasharray:none;stroke-opacity:1"
       inkscape:transform-center-x="44.430579"
       inkscape:tile-cx="16.933333"
       inkscape:tile-cy="22.754166"
       inkscape:tile-w="2.1564133"
       inkscape:tile-h="1.894597" />
    <use
       x="0"
       y="0"
       inkscape:tiled-clone-of="#use4893-8-7"
       xlink:href="#use4893-8-7"
       transform="rotate(9.9999998,64.000005,85.999998)"
       id="use1427"
       inkscape:transform-center-x="-1.8334603"
       inkscape:transform-center-y="-18.967786"
       width="100%"
       height="100%" />
    <use
       x="0"
       y="0"
       inkscape:tiled-clone-of="#use4893-8-7"
       xlink:href="#use4893-8-7"
       transform="rotate(30,64.000002,86)"
       id="use1429"
       inkscape:transform-center-x="-32.680071"
       inkscape:transform-center-y="-29.480367"
       width="100%"
       height="100%" />
    <use
       x="0"
       y="0"
       inkscape:tiled-clone-of="#use4893-8-7"
       xlink:href="#use4893-8-7"
       transform="rotate(40,64.000003,86.000003)"
       id="use1431"
       inkscape:transform-center-x="-49.000374"
       inkscape:transform-center-y="-30.569854"
       width="100%"
       height="100%" />
    <use
       x="0"
       y="0"
       inkscape:tiled-clone-of="#use4893-8-7"
       xlink:href="#use4893-8-7"
       transform="rotate(60,64.000002,86.000004)"
       id="use1433"
       inkscape:transform-center-x="-80.970614"
       inkscape:transform-center-y="-24.250709"
       width="100%"
       height="100%" />
    <use
       x="0"
       y="0"
       inkscape:tiled-clone-of="#use4893-8-7"
       xlink:href="#use4893-8-7"
       transform="rotate(70,64.000003,86.000003)"
       id="use1435"
       inkscape:transform-center-x="-95.649152"
       inkscape:transform-center-y="-17.034083"
       width="100%"
       height="100%" />
    <use
       x="0"
       y="0"
       inkscape:tiled-clone-of="#use4893-8-7"
       xlink:href="#use4893-8-7"
       transform="rotate(90,64,86)"
       id="use1437"
       inkscape:transform-center-x="-120.17661"
       inkscape:transform-center-y="4.4235758"
       width="100%"
       height="100%" />
    <use
       x="0"
       y="0"
       inkscape:tiled-clone-of="#use4893-8-7"
       xlink:href="#use4893-8-7"
       transform="rotate(100,64,86.000001)"
       id="use1439"
       inkscape:transform-center-x="-129.28029"
       inkscape:transform-center-y="18.012629"
       width="100%"
       height="100%" />
  </g>
  <g
     inkscape:groupmode="layer"
     id="layer9"
     inkscape:label="24 60"
     style="display:inline"
     sodipodi:insensitive="true">
    <path
       inkscape:tile-y0="14.152362"
       inkscape:tile-x0="2.3251326"
       inkscape:transform-center-x="49.363452"
       inkscape:transform-center-y="-28.500001"
       sodipodi:nodetypes="cc"
       inkscape:connector-curvature="0"
       id="use4893-3"
       d="m 10.306425,55.000002 8.660255,5.000002"
       style="display:inline;fill:none;stroke:#e7e7e7;stroke-width:3;stroke-linecap:round;stroke-linejoin:miter;stroke-miterlimit:4;stroke-dasharray:none;stroke-opacity:1"
       inkscape:tile-cx="16.933333"
       inkscape:tile-cy="22.754166"
       inkscape:tile-w="3.09491"
       inkscape:tile-h="2.1223591" />
    <use
       x="0"
       y="0"
       inkscape:tiled-clone-of="#use4893-3"
       xlink:href="#use4893-3"
       transform="rotate(30,64.000002,86)"
       id="use1293"
       inkscape:transform-center-x="-30.388029"
       inkscape:transform-center-y="-28.120746"
       width="100%"
       height="100%" />
    <use
       x="0"
       y="0"
       inkscape:tiled-clone-of="#use4893-3"
       xlink:href="#use4893-3"
       transform="rotate(60,64.000002,86.000004)"
       id="use1295"
       inkscape:transform-center-x="-78.305835"
       inkscape:transform-center-y="-24.219263"
       width="100%"
       height="100%" />
    <use
       x="0"
       y="0"
       inkscape:tiled-clone-of="#use4893-3"
       xlink:href="#use4893-3"
       transform="rotate(90,64,86)"
       id="use1297"
       inkscape:transform-center-x="-117.85313"
       inkscape:transform-center-y="3.1184201"
       width="100%"
       height="100%" />
    <use
       x="0"
       y="0"
       inkscape:tiled-clone-of="#use4893-3"
       xlink:href="#use4893-3"
       transform="rotate(120,64.000002,86.000002)"
       id="use1299"
       inkscape:transform-center-x="-138.43325"
       inkscape:transform-center-y="46.567197"
       width="100%"
       height="100%" />
  </g>
  <g
     inkscape:groupmode="layer"
     id="layer11"
     inkscape:label="24 text"
     style="display:inline"
     sodipodi:insensitive="true">
    <text
       xml:space="preserve"
       style="font-style:normal;font-variant:normal;font-weight:normal;font-stretch:normal;font-size:16px;line-height:19.9999px;font-family:LENYA69;-inkscape-font-specification:LENYA69;letter-spacing:0px;word-spacing:0px;display:inline;fill:#e7e7e7;fill-opacity:1;stroke:none;stroke-width:0.999999;stroke-opacity:0.498039"
       x="19.245386"
       y="74.11602"
       id="text4489-8"><tspan
         sodipodi:role="line"
         id="tspan4487-8"
         x="19.245386"
         y="74.11602"
         style="font-size:26.6666px;fill:#e7e7e7;fill-opacity:1;stroke:none;stroke-width:0.999999;stroke-opacity:0.498039">0</tspan></text>
    <text
       id="text1538"
       y="74.142387"
       x="84.104584"
       style="font-style:normal;font-variant:normal;font-weight:normal;font-stretch:normal;font-size:16px;line-height:19.9999px;font-family:LENYA69;-inkscape-font-specification:LENYA69;letter-spacing:0px;word-spacing:0px;display:inline;fill:#e7e7e7;fill-opacity:1;stroke:none;stroke-width:0.999999;stroke-opacity:0.498039"
       xml:space="preserve"><tspan
         style="font-size:26.6666px;letter-spacing:-0.06px;fill:#e7e7e7;fill-opacity:1;stroke:none;stroke-width:0.999999;stroke-opacity:0.498039"
         y="74.142387"
         x="84.104584"
         id="tspan1536"
         sodipodi:role="line">24</tspan></text>
    <text
       xml:space="preserve"
       style="font-style:normal;font-variant:normal;font-weight:normal;font-stretch:normal;font-size:16px;line-height:19.9999px;font-family:LENYA69;-inkscape-font-specification:LENYA69;letter-spacing:0px;word-spacing:0px;display:inline;fill:#e7e7e7;fill-opacity:1;stroke:none;stroke-width:0.999999;stroke-opacity:0.498039"
       x="56.718613"
       y="49.037605"
       id="text1542"><tspan
         sodipodi:role="line"
         id="tspan1540"
         x="56.718613"
         y="49.037605"
         style="font-size:18.6667px;letter-spacing:-0.55px;fill:#e7e7e7;fill-opacity:1;stroke:none;stroke-width:0.999999;stroke-opacity:0.498039">12</tspan></text>
  </g>
</svg>
