# Aeromatic++ augmented thrust, sans ceiling.
# JSBSim utils/aeromatic++/Systems/Propulsion.cpp 18 Nov 2018
0	-10000	0	10000	20000	30000	40000	50000
0.0	1.1816	1.0000	0.8184	0.6627	0.5280	0.3756	0.2327
0.2	1.1308	0.9599	0.7890	0.6406	0.5116	0.3645	0.2258
0.4	1.1150	0.9474	0.7798	0.6340	0.5070	0.3615	0.2240
0.6	1.1284	0.9589	0.7894	0.6420	0.5134	0.3661	0.2268
0.8	1.1707	0.9942	0.8177	0.6647	0.5309	0.3784	0.2345
1.0	1.2411	1.0529	0.8648	0.7017	0.5596	0.3983	0.2467
1.2	1.3287	1.1254	0.9221	0.7462	0.5936	0.4219	0.2614
1.4	1.4365	1.2149	0.9933	0.8021	0.6360	0.4509	0.2794
1.6	1.5711	1.3260	1.0809	0.8700	0.6874	0.4860	0.3011
1.8	1.7301	1.4579	1.1857	0.9512	0.7495	0.5289	0.3277
2.0	1.8314	1.5700	1.3086	1.0474	0.8216	0.5786	0.3585
2.2	1.9700	1.6900	1.4100	1.2400	0.9100	0.6359	0.3940
2.4	2.0700	1.8000	1.5300	1.3400	1.0000	0.7200	0.4600
2.6	2.2000	1.9200	1.6400	1.4400	1.1000	0.8000	0.5200
