<?xml version="1.0" encoding="UTF-8" standalone="no"?>
<!-- Created with Inkscape (http://www.inkscape.org/) -->

<svg
   xmlns:dc="http://purl.org/dc/elements/1.1/"
   xmlns:cc="http://creativecommons.org/ns#"
   xmlns:rdf="http://www.w3.org/1999/02/22-rdf-syntax-ns#"
   xmlns:svg="http://www.w3.org/2000/svg"
   xmlns="http://www.w3.org/2000/svg"
   xmlns:xlink="http://www.w3.org/1999/xlink"
   xmlns:sodipodi="http://sodipodi.sourceforge.net/DTD/sodipodi-0.dtd"
   xmlns:inkscape="http://www.inkscape.org/namespaces/inkscape"
   width="8192"
   height="8192"
   viewBox="0 0 8192 8192"
   version="1.1"
   id="svg1940"
   inkscape:version="0.92.4 5da689c313, 2019-01-14"
   sodipodi:docname="Tu-144D_n.svg">
  <defs
     id="defs1934" />
  <sodipodi:namedview
     id="base"
     pagecolor="#ffffff"
     bordercolor="#666666"
     borderopacity="1.0"
     inkscape:pageopacity="0.0"
     inkscape:pageshadow="2"
     inkscape:zoom="0.061871843"
     inkscape:cx="4622.0651"
     inkscape:cy="4071.516"
     inkscape:document-units="px"
     inkscape:current-layer="layer2"
     showgrid="true"
     units="px"
     inkscape:window-width="1366"
     inkscape:window-height="734"
     inkscape:window-x="0"
     inkscape:window-y="34"
     inkscape:window-maximized="0">
    <inkscape:grid
       type="xygrid"
       id="grid1942"
       empspacing="8" />
  </sodipodi:namedview>
  <metadata
     id="metadata1937">
    <rdf:RDF>
      <cc:Work
         rdf:about="">
        <dc:format>image/svg+xml</dc:format>
        <dc:type
           rdf:resource="http://purl.org/dc/dcmitype/StillImage" />
        <dc:title />
      </cc:Work>
    </rdf:RDF>
  </metadata>
  <g
     inkscape:label="Original"
     inkscape:groupmode="layer"
     id="layer1"
     transform="translate(0,1870.4667)"
     sodipodi:insensitive="true">
    <image
       xlink:href="0_Original.png"
       style="image-rendering:optimizeSpeed"
       y="-1870.4668"
       x="0"
       id="image229"
       preserveAspectRatio="none"
       height="8192"
       width="8192" />
  </g>
  <g
     inkscape:groupmode="layer"
     id="layer2"
     inkscape:label="Fix"
     style="display:inline"
     sodipodi:insensitive="true">
    <image
       xlink:href="1_Fix.png"
       style="image-rendering:optimizeSpeed"
       y="0"
       x="0"
       id="image291"
       preserveAspectRatio="none"
       height="8192"
       width="8192" />
  </g>
</svg>
