# Cy with canard in [Bliznyuk, p. 65] delta_e = 10
# row: alpha, deg
#
-0.012817843098382428 0.031050552598200082
5.091924685315402     0.21645389790122171
7.074988552331444     0.29951919791023696
11.373798493413384    0.4990619099097189
17.053885900123788    0.7981104583267764
20.528450610453174    0.9934925939170234
23.14132133861233     1.0982795763427695
23.577236288289882    1.0980627994858325
23.902706255136646    1.0824236960962912
24.432231751277076    1.0505610896957858
25.018289223785978    1.0206044521220412
25.649342613874808    1.0094467292359357
26.385366332394447    1.0110211192608138
27.02526378239713     1.0276032661131955
