-37.86589  0
-36.53702  0.0035
-34.94009  0.3403
-28.82848  3.7669
-28.45831  4.0834
-26.64342  5.6339
-22.54396  7.7695
-19.79167  8.4981
-5.90165   8.4981
-4.50352  19.0250
-3.66203  20.1293
3.91416   20.6123
15.88373  16.9780
17.43553   4.2200
25.61315   0.8737
27.02844   0.3680
27.8       0.0333
27.87587   0
