# Wind tunnel (CL - CL_OGE)/CL_OGE, where CL_OGE is out of ground effect lift.
# [Curry, Fig. 12]
# row: h/b
# col: elevator, deg
#
#                   0.0                  5.0                  10.0
0.20150391141099203 0.43337014849008154  0.3980162966144092   0.34841795853620194
0.22915939372391134 0.36163114089657017  0.3293247620799085   0.29397091020423677
0.2571812812982699  0.30600648700185196  0.2790497785439891   0.24455401091714943
0.2789830908780379  0.26967783826878994  0.24908340533693005  0.21870668868041807
0.3117128438110255  0.22607314469589435  0.20794015602092142  0.18408496184751127
0.3555919844204166  0.18453414100650192  0.1696327354209405   0.1517841309893551
0.40585462604810923 0.15043762091210444  0.13945389595111984  0.12658242673869421
0.4448626293285869  0.1315162056895337   0.12224864922621331  0.10954875576756516
0.49386031599571184 0.1121482825472522   0.10391059156648605  0.09412830784183383
0.6072028349438536  0.08222136148956474  0.07672949900907237  0.07037955227974858
0.7194766676835357  0.06259083497802859  0.059844800997810026 0.05555437975365006
0.8582696581600535  0.0477578542140336   0.04604168571636928  0.04415394146492814
1.0020036565670778  0.03686351302896911  0.035892620290527505 0.03469117905419633
1.4991413955403117  0.019415183529549077 0.01941518352954897  0.019415183529549525
1.9956695835866551  0.010594134985939556 0.010594134985939445 0.010594134985940001
2.4997628964716063  0.007709813002975897 0.007709813002975787 0.007709813002976344
