<?xml version="1.0" encoding="UTF-8" standalone="no"?>
<svg
   xmlns:dc="http://purl.org/dc/elements/1.1/"
   xmlns:cc="http://creativecommons.org/ns#"
   xmlns:rdf="http://www.w3.org/1999/02/22-rdf-syntax-ns#"
   xmlns:svg="http://www.w3.org/2000/svg"
   xmlns="http://www.w3.org/2000/svg"
   xmlns:xlink="http://www.w3.org/1999/xlink"
   xmlns:sodipodi="http://sodipodi.sourceforge.net/DTD/sodipodi-0.dtd"
   xmlns:inkscape="http://www.inkscape.org/namespaces/inkscape"
   width="192"
   height="192"
   viewBox="0 0 192 192"
   version="1.1"
   id="svg8652"
   inkscape:version="1.0.1 (3bc2e813f5, 2020-09-07)"
   sodipodi:docname="hydraulic_fluid.svg"
   inkscape:export-filename="hydraulic_fluid.png"
   inkscape:export-xdpi="96"
   inkscape:export-ydpi="96">
  <defs
     id="defs8646" />
  <sodipodi:namedview
     id="base"
     pagecolor="#000000"
     bordercolor="#666666"
     borderopacity="1.0"
     inkscape:pageopacity="1"
     inkscape:pageshadow="2"
     inkscape:zoom="2.0000001"
     inkscape:cx="120.84204"
     inkscape:cy="96.883542"
     inkscape:document-units="px"
     inkscape:current-layer="layer4"
     showgrid="true"
     units="px"
     inkscape:window-width="1366"
     inkscape:window-height="734"
     inkscape:window-x="0"
     inkscape:window-y="34"
     inkscape:window-maximized="0"
     inkscape:snap-grids="true"
     showguides="true"
     inkscape:guide-bbox="true"
     inkscape:pagecheckerboard="false"
     inkscape:snap-bbox="true"
     inkscape:bbox-paths="true"
     inkscape:bbox-nodes="true"
     inkscape:snap-bbox-edge-midpoints="true"
     inkscape:snap-bbox-midpoints="true"
     inkscape:object-paths="true"
     inkscape:snap-intersection-paths="true"
     inkscape:snap-smooth-nodes="true"
     inkscape:snap-midpoints="true"
     inkscape:snap-object-midpoints="true"
     inkscape:snap-center="true"
     inkscape:snap-text-baseline="true"
     inkscape:snap-page="true"
     inkscape:snap-global="false"
     inkscape:snap-nodes="true"
     inkscape:snap-others="true"
     inkscape:document-rotation="0">
    <inkscape:grid
       type="xygrid"
       id="grid8654"
       originy="0"
       originx="0"
       empspacing="8" />
  </sodipodi:namedview>
  <metadata
     id="metadata8649">
    <rdf:RDF>
      <cc:Work
         rdf:about="">
        <dc:format>image/svg+xml</dc:format>
        <dc:type
           rdf:resource="http://purl.org/dc/dcmitype/StillImage" />
        <dc:title></dc:title>
      </cc:Work>
    </rdf:RDF>
  </metadata>
  <g
     inkscape:groupmode="layer"
     id="layer8"
     inkscape:label="bg"
     style="display:inline"
     transform="translate(0,-16.933333)">
    <ellipse
       style="fill:#181818;fill-opacity:1;stroke:none;stroke-width:1.24244;stroke-linecap:round;stroke-miterlimit:4;stroke-dasharray:none;stroke-opacity:1"
       id="path11933"
       cx="96"
       cy="112.93333"
       r="88" />
  </g>
  <g
     inkscape:groupmode="layer"
     id="layer9"
     inkscape:label="ring"
     style="display:inline">
    <ellipse
       style="opacity:1;vector-effect:none;fill:none;fill-opacity:0.517766;stroke:#e7e7e7;stroke-width:5.00001;stroke-linecap:butt;stroke-linejoin:round;stroke-miterlimit:4;stroke-dasharray:none;stroke-dashoffset:0;stroke-opacity:1;paint-order:normal"
       id="path2573"
       cx="96"
       cy="96"
       r="80" />
  </g>
  <g
     inkscape:groupmode="layer"
     id="layer4"
     inkscape:label="0">
    <path
       id="circle2604"
       style="display:inline;opacity:1;vector-effect:none;fill:none;fill-opacity:0.517766;stroke:#e7e7e7;stroke-width:2;stroke-linecap:butt;stroke-linejoin:round;stroke-miterlimit:4;stroke-dasharray:none;stroke-dashoffset:0;stroke-opacity:1;paint-order:normal"
       sodipodi:type="arc"
       sodipodi:cx="-124.59849"
       sodipodi:cy="-53.918587"
       sodipodi:rx="73"
       sodipodi:ry="72.999992"
       sodipodi:start="4.6251225"
       sodipodi:end="4.7996554"
       d="m -130.96086,-126.64079 a 73,72.999992 0 0 1 12.72474,0"
       inkscape:transform-center-y="67.615393"
       transform="rotate(-158.4)"
       inkscape:transform-center-x="26.770832"
       sodipodi:arc-type="arc"
       sodipodi:open="true" />
  </g>
  <g
     inkscape:groupmode="layer"
     id="layer6"
     inkscape:label="10"
     style="display:inline">
    <path
       style="fill:none;stroke:#e7e7e7;stroke-width:3.99999;stroke-linecap:butt;stroke-linejoin:miter;stroke-miterlimit:4;stroke-dasharray:none;stroke-opacity:1"
       d="M 32.61683,144.81161 49.254913,131.99857"
       id="path1416"
       inkscape:connector-curvature="0"
       sodipodi:nodetypes="cc"
       inkscape:transform-center-y="42.405092"
       inkscape:tile-cx="25.399999"
       inkscape:tile-cy="25.399999"
       inkscape:tile-w="2.8063299"
       inkscape:tile-h="2.8063299"
       inkscape:tile-x0="11.648983"
       inkscape:tile-y0="36.344686"
       inkscape:transform-center-x="55.064131" />
    <use
       x="0"
       y="0"
       inkscape:tiled-clone-of="#path1416"
       xlink:href="#path1416"
       id="use2964"
       inkscape:transform-center-x="14.56905"
       inkscape:transform-center-y="11.219682"
       width="100%"
       height="100%" />
    <use
       x="0"
       y="0"
       inkscape:tiled-clone-of="#path1416"
       xlink:href="#path1416"
       transform="rotate(43.999999,95.999999,95.999996)"
       id="use2966"
       inkscape:transform-center-x="-50.583544"
       inkscape:transform-center-y="-31.278019"
       width="100%"
       height="100%" />
    <use
       x="0"
       y="0"
       inkscape:tiled-clone-of="#path1416"
       xlink:href="#path1416"
       transform="rotate(88,95.999997,95.999996)"
       id="use2968"
       inkscape:transform-center-x="-126.97178"
       inkscape:transform-center-y="-16.589511"
       width="100%"
       height="100%" />
    <use
       x="0"
       y="0"
       inkscape:tiled-clone-of="#path1416"
       xlink:href="#path1416"
       transform="rotate(132,96,95.999998)"
       id="use2970"
       inkscape:transform-center-x="-171.7174"
       inkscape:transform-center-y="47.040247"
       width="100%"
       height="100%" />
    <use
       x="0"
       y="0"
       inkscape:tiled-clone-of="#path1416"
       xlink:href="#path1416"
       transform="rotate(176,96,95.999999)"
       id="use2972"
       inkscape:transform-center-x="-159.70375"
       inkscape:transform-center-y="123.89458"
       width="100%"
       height="100%" />
    <use
       x="0"
       y="0"
       inkscape:tiled-clone-of="#path1416"
       xlink:href="#path1416"
       transform="rotate(-140,95.999996,95.999998)"
       id="use2974"
       inkscape:transform-center-x="-97.674339"
       inkscape:transform-center-y="170.83357"
       width="100%"
       height="100%" />
    <use
       x="0"
       y="0"
       inkscape:tiled-clone-of="#path1416"
       xlink:href="#path1416"
       transform="rotate(-96,95.999999,95.999998)"
       id="use2976"
       inkscape:transform-center-x="-20.447569"
       inkscape:transform-center-y="161.50942"
       width="100%"
       height="100%" />
  </g>
  <g
     inkscape:groupmode="layer"
     id="layer7"
     inkscape:label="2"
     style="display:inline">
    <path
       style="fill:none;stroke:#e7e7e7;stroke-width:1.99999;stroke-linecap:butt;stroke-linejoin:miter;stroke-miterlimit:4;stroke-dasharray:none;stroke-opacity:1"
       d="m 25.895464,134.5403 12.268297,-6.74455"
       id="path1416-3"
       inkscape:connector-curvature="0"
       sodipodi:nodetypes="cc"
       inkscape:transform-center-y="35.168025"
       inkscape:tile-cx="25.4"
       inkscape:tile-cy="25.399999"
       inkscape:tile-w="2.1269317"
       inkscape:tile-h="1.5429449"
       inkscape:tile-x0="9.4870064"
       inkscape:tile-y0="34.550664"
       inkscape:transform-center-x="63.970395" />
    <use
       x="0"
       y="0"
       xlink:href="#path1416-3"
       inkscape:transform-center-x="97.7582"
       inkscape:transform-center-y="-28.254467"
       id="use2610"
       transform="rotate(-17.599999,95.141939,94.885774)"
       width="100%"
       height="100%" />
    <use
       height="100%"
       width="100%"
       transform="rotate(-26.400001,95.36955,95.299822)"
       id="use2614"
       inkscape:transform-center-y="-12.966247"
       inkscape:transform-center-x="100.92996"
       xlink:href="#path1416-3"
       y="0"
       x="0" />
    <use
       x="0"
       y="0"
       inkscape:tiled-clone-of="#path1416-3"
       xlink:href="#path1416-3"
       id="use2904"
       inkscape:transform-center-x="16.925499"
       inkscape:transform-center-y="9.3048765"
       width="100%"
       height="100%" />
    <use
       x="0"
       y="0"
       inkscape:tiled-clone-of="#path1416-3"
       xlink:href="#path1416-3"
       transform="rotate(8.7999996,96.000006,95.999995)"
       id="use2906"
       inkscape:transform-center-x="6.5178977"
       inkscape:transform-center-y="-3.3637425"
       width="100%"
       height="100%" />
    <use
       x="0"
       y="0"
       inkscape:tiled-clone-of="#path1416-3"
       xlink:href="#path1416-3"
       transform="rotate(17.599999,96.000003,95.999995)"
       id="use2908"
       inkscape:transform-center-x="-5.7053088"
       inkscape:transform-center-y="-14.29102"
       width="100%"
       height="100%" />
    <use
       x="0"
       y="0"
       inkscape:tiled-clone-of="#path1416-3"
       xlink:href="#path1416-3"
       transform="rotate(26.400001,95.999999,96)"
       id="use2910"
       inkscape:transform-center-x="-19.456352"
       inkscape:transform-center-y="-23.219682"
       width="100%"
       height="100%" />
    <use
       x="0"
       y="0"
       inkscape:tiled-clone-of="#path1416-3"
       xlink:href="#path1416-3"
       transform="rotate(43.999999,96.000004,95.999997)"
       id="use2912"
       inkscape:transform-center-x="-50.218595"
       inkscape:transform-center-y="-34.292348"
       width="100%"
       height="100%" />
    <use
       x="0"
       y="0"
       inkscape:tiled-clone-of="#path1416-3"
       xlink:href="#path1416-3"
       transform="rotate(52.800001,96.000004,96.000002)"
       id="use2914"
       inkscape:transform-center-x="-66.505568"
       inkscape:transform-center-y="-36.17566"
       width="100%"
       height="100%" />
    <use
       x="0"
       y="0"
       inkscape:tiled-clone-of="#path1416-3"
       xlink:href="#path1416-3"
       transform="rotate(61.6,96.000002,96)"
       id="use2916"
       inkscape:transform-center-x="-82.888926"
       inkscape:transform-center-y="-35.545128"
       width="100%"
       height="100%" />
    <use
       x="0"
       y="0"
       inkscape:tiled-clone-of="#path1416-3"
       xlink:href="#path1416-3"
       transform="rotate(70.4,95.999998,95.999995)"
       id="use2918"
       inkscape:transform-center-x="-98.98296"
       inkscape:transform-center-y="-32.415596"
       width="100%"
       height="100%" />
    <use
       x="0"
       y="0"
       inkscape:tiled-clone-of="#path1416-3"
       xlink:href="#path1416-3"
       transform="rotate(88,96.000004,96)"
       id="use2920"
       inkscape:transform-center-x="-128.8032"
       inkscape:transform-center-y="-19.011353"
       width="100%"
       height="100%" />
    <use
       x="0"
       y="0"
       inkscape:tiled-clone-of="#path1416-3"
       xlink:href="#path1416-3"
       transform="rotate(96.8,96.000001,95.999998)"
       id="use2922"
       inkscape:transform-center-x="-141.82731"
       inkscape:transform-center-y="-9.0522178"
       width="100%"
       height="100%" />
    <use
       x="0"
       y="0"
       inkscape:tiled-clone-of="#path1416-3"
       xlink:href="#path1416-3"
       transform="rotate(105.6,96.000002,95.999999)"
       id="use2924"
       inkscape:transform-center-x="-153.17452"
       inkscape:transform-center-y="2.7821877"
       width="100%"
       height="100%" />
    <use
       x="0"
       y="0"
       inkscape:tiled-clone-of="#path1416-3"
       xlink:href="#path1416-3"
       transform="rotate(114.4,96.000004,95.999998)"
       id="use2926"
       inkscape:transform-center-x="-162.57765"
       inkscape:transform-center-y="16.213241"
       width="100%"
       height="100%" />
    <use
       x="0"
       y="0"
       inkscape:tiled-clone-of="#path1416-3"
       xlink:href="#path1416-3"
       transform="rotate(132,96,95.999996)"
       id="use2928"
       inkscape:transform-center-x="-174.71714"
       inkscape:transform-center-y="46.570318"
       width="100%"
       height="100%" />
    <use
       x="0"
       y="0"
       inkscape:tiled-clone-of="#path1416-3"
       xlink:href="#path1416-3"
       transform="rotate(140.8,96.000004,95.999999)"
       id="use2930"
       inkscape:transform-center-x="-177.16773"
       inkscape:transform-center-y="62.781637"
       width="100%"
       height="100%" />
    <use
       x="0"
       y="0"
       inkscape:tiled-clone-of="#path1416-3"
       xlink:href="#path1416-3"
       transform="rotate(149.6,96.000003,95.999999)"
       id="use2932"
       inkscape:transform-center-x="-177.10935"
       inkscape:transform-center-y="79.177025"
       width="100%"
       height="100%" />
    <use
       x="0"
       y="0"
       inkscape:tiled-clone-of="#path1416-3"
       xlink:href="#path1416-3"
       transform="rotate(158.4,96.000001,95.999997)"
       id="use2934"
       inkscape:transform-center-x="-174.54339"
       inkscape:transform-center-y="95.370478"
       width="100%"
       height="100%" />
    <use
       x="0"
       y="0"
       inkscape:tiled-clone-of="#path1416-3"
       xlink:href="#path1416-3"
       transform="rotate(176,96,95.999997)"
       id="use2936"
       inkscape:transform-center-x="-162.18803"
       inkscape:transform-center-y="125.64034"
       width="100%"
       height="100%" />
    <use
       x="0"
       y="0"
       inkscape:tiled-clone-of="#path1416-3"
       xlink:href="#path1416-3"
       transform="rotate(-175.2,95.999999,95.999998)"
       id="use2938"
       inkscape:transform-center-x="-152.68949"
       inkscape:transform-center-y="139.0041"
       width="100%"
       height="100%" />
    <use
       x="0"
       y="0"
       inkscape:tiled-clone-of="#path1416-3"
       xlink:href="#path1416-3"
       transform="rotate(-166.4,96.000003,95.999998)"
       id="use2940"
       inkscape:transform-center-x="-141.25831"
       inkscape:transform-center-y="150.7574"
       width="100%"
       height="100%" />
    <use
       x="0"
       y="0"
       inkscape:tiled-clone-of="#path1416-3"
       xlink:href="#path1416-3"
       transform="rotate(-157.6,96.000003,95.999998)"
       id="use2942"
       inkscape:transform-center-x="-128.1636"
       inkscape:transform-center-y="160.62354"
       width="100%"
       height="100%" />
    <use
       x="0"
       y="0"
       inkscape:tiled-clone-of="#path1416-3"
       xlink:href="#path1416-3"
       transform="rotate(-140,96.000001,95.999996)"
       id="use2944"
       inkscape:transform-center-x="-98.248682"
       inkscape:transform-center-y="173.81509"
       width="100%"
       height="100%" />
    <use
       x="0"
       y="0"
       inkscape:tiled-clone-of="#path1416-3"
       xlink:href="#path1416-3"
       transform="rotate(-131.2,96.000001,95.999998)"
       id="use2946"
       inkscape:transform-center-x="-82.132757"
       inkscape:transform-center-y="176.82995"
       width="100%"
       height="100%" />
    <use
       x="0"
       y="0"
       inkscape:tiled-clone-of="#path1416-3"
       xlink:href="#path1416-3"
       transform="rotate(-122.4,96.000002,95.999998)"
       id="use2948"
       inkscape:transform-center-x="-65.745328"
       inkscape:transform-center-y="177.3438"
       width="100%"
       height="100%" />
    <use
       x="0"
       y="0"
       inkscape:tiled-clone-of="#path1416-3"
       xlink:href="#path1416-3"
       transform="rotate(-113.6,96.000001,95.999998)"
       id="use2950"
       inkscape:transform-center-x="-49.472184"
       inkscape:transform-center-y="175.34455"
       width="100%"
       height="100%" />
  </g>
  <g
     inkscape:label="text"
     inkscape:groupmode="layer"
     id="layer1"
     transform="translate(0,-246.19998)"
     style="display:inline">
    <text
       xml:space="preserve"
       style="font-style:normal;font-variant:normal;font-weight:normal;font-stretch:normal;font-size:23.9999px;line-height:19.9999px;font-family:LENYA69;-inkscape-font-specification:LENYA69;text-align:center;letter-spacing:0px;word-spacing:0px;text-anchor:middle;fill:#e7e7e7;fill-opacity:1;stroke:none;stroke-width:0.999999"
       x="62.765625"
       y="373.93433"
       id="text1245"><tspan
         sodipodi:role="line"
         id="tspan1243"
         x="62.765625"
         y="373.93433"
         style="font-size:23.9999px;text-align:center;text-anchor:middle;fill:#e7e7e7;fill-opacity:1;stroke-width:0.999999">40</tspan></text>
    <text
       xml:space="preserve"
       style="font-style:normal;font-variant:normal;font-weight:normal;font-stretch:normal;font-size:13.3333px;line-height:19.9999px;font-family:LENYA69;-inkscape-font-specification:LENYA69;letter-spacing:0px;word-spacing:0px;fill:#e7e7e7;fill-opacity:1;stroke:none;stroke-width:0.999999"
       x="74.859383"
       y="383.35617"
       id="text1295"><tspan
         sodipodi:role="line"
         id="tspan1293"
         x="74.859383"
         y="383.35617"
         style="font-size:16px;fill:#e7e7e7;fill-opacity:1;stroke-width:0.999999">ЛИТРЫ</tspan></text>
    <text
       id="text2580"
       y="342.93433"
       x="54.765625"
       style="font-style:normal;font-variant:normal;font-weight:normal;font-stretch:normal;font-size:23.9999px;line-height:19.9999px;font-family:LENYA69;-inkscape-font-specification:LENYA69;letter-spacing:0px;word-spacing:0px;fill:#e7e7e7;fill-opacity:1;stroke:none;stroke-width:0.999999"
       xml:space="preserve"><tspan
         style="font-size:23.9999px;text-align:center;text-anchor:middle;fill:#e7e7e7;fill-opacity:1;stroke-width:0.999999"
         y="342.93433"
         x="54.765625"
         id="tspan2578"
         sodipodi:role="line">50</tspan></text>
    <text
       xml:space="preserve"
       style="font-style:normal;font-variant:normal;font-weight:normal;font-stretch:normal;font-size:23.9999px;line-height:19.9999px;font-family:LENYA69;-inkscape-font-specification:LENYA69;letter-spacing:0px;word-spacing:0px;fill:#e7e7e7;fill-opacity:1;stroke:none;stroke-width:0.999999"
       x="69.765633"
       y="312.93842"
       id="text2584"><tspan
         sodipodi:role="line"
         id="tspan2582"
         x="69.765633"
         y="312.93842"
         style="font-size:23.9999px;text-align:center;text-anchor:middle;fill:#e7e7e7;fill-opacity:1;stroke-width:0.999999">60</tspan></text>
    <text
       id="text2588"
       y="302.9343"
       x="104.76562"
       style="font-style:normal;font-variant:normal;font-weight:normal;font-stretch:normal;font-size:23.9999px;line-height:19.9999px;font-family:LENYA69;-inkscape-font-specification:LENYA69;letter-spacing:0px;word-spacing:0px;fill:#e7e7e7;fill-opacity:1;stroke:none;stroke-width:0.999999"
       xml:space="preserve"><tspan
         style="font-size:23.9999px;text-align:center;text-anchor:middle;fill:#e7e7e7;fill-opacity:1;stroke-width:0.999999"
         y="302.9343"
         x="104.76562"
         id="tspan2586"
         sodipodi:role="line">70</tspan></text>
    <text
       xml:space="preserve"
       style="font-style:normal;font-variant:normal;font-weight:normal;font-stretch:normal;font-size:23.9999px;line-height:19.9999px;font-family:LENYA69;-inkscape-font-specification:LENYA69;letter-spacing:0px;word-spacing:0px;fill:#e7e7e7;fill-opacity:1;stroke:none;stroke-width:0.999999"
       x="131.7668"
       y="319.93439"
       id="text2592"><tspan
         sodipodi:role="line"
         id="tspan2590"
         x="131.7668"
         y="319.93439"
         style="font-size:23.9999px;text-align:center;text-anchor:middle;fill:#e7e7e7;fill-opacity:1;stroke-width:0.999999">80</tspan></text>
    <text
       id="text2596"
       y="353.94012"
       x="142.76562"
       style="font-style:normal;font-variant:normal;font-weight:normal;font-stretch:normal;font-size:23.9999px;line-height:19.9999px;font-family:LENYA69;-inkscape-font-specification:LENYA69;letter-spacing:0px;word-spacing:0px;fill:#e7e7e7;fill-opacity:1;stroke:none;stroke-width:0.999999"
       xml:space="preserve"><tspan
         style="font-size:23.9999px;text-align:center;text-anchor:middle;fill:#e7e7e7;fill-opacity:1;stroke-width:0.999999"
         y="353.94012"
         x="142.76562"
         id="tspan2594"
         sodipodi:role="line">90</tspan></text>
    <text
       xml:space="preserve"
       style="font-style:normal;font-variant:normal;font-weight:normal;font-stretch:normal;font-size:23.9999px;line-height:19.9999px;font-family:LENYA69;-inkscape-font-specification:LENYA69;letter-spacing:0px;word-spacing:0px;fill:#e7e7e7;fill-opacity:1;stroke:none;stroke-width:0.999999"
       x="135.76564"
       y="380.93436"
       id="text2600"><tspan
         sodipodi:role="line"
         id="tspan2598"
         x="135.76564"
         y="380.93436"
         style="font-size:23.9999px;text-align:center;text-anchor:middle;fill:#e7e7e7;fill-opacity:1;stroke-width:0.999999">100</tspan></text>
  </g>
  <g
     inkscape:groupmode="layer"
     id="layer2"
     inkscape:label="needles"
     transform="translate(0,-16.933333)">
    <rect
       style="fill:#e7e7e7;fill-opacity:1;stroke-width:1.13389"
       id="rect2782"
       width="12"
       height="12"
       x="8.000001"
       y="24.933338" />
    <rect
       y="36.933334"
       x="8.000001"
       height="12"
       width="12"
       id="rect370"
       style="fill:#181818;fill-opacity:1;stroke-width:1.13389" />
    <rect
       y="24.933338"
       x="172.00002"
       height="12"
       width="12"
       id="rect1777"
       style="fill:#8f8f8f;fill-opacity:1;stroke-width:1.13389" />
  </g>
</svg>
