<?xml version="1.0" encoding="UTF-8" standalone="no"?>
<svg
   xmlns:dc="http://purl.org/dc/elements/1.1/"
   xmlns:cc="http://creativecommons.org/ns#"
   xmlns:rdf="http://www.w3.org/1999/02/22-rdf-syntax-ns#"
   xmlns:svg="http://www.w3.org/2000/svg"
   xmlns="http://www.w3.org/2000/svg"
   xmlns:xlink="http://www.w3.org/1999/xlink"
   xmlns:sodipodi="http://sodipodi.sourceforge.net/DTD/sodipodi-0.dtd"
   xmlns:inkscape="http://www.inkscape.org/namespaces/inkscape"
   width="256"
   height="256"
   viewBox="0 0 256 256"
   version="1.1"
   id="svg8652"
   inkscape:version="1.0.1 (3bc2e813f5, 2020-09-07)"
   sodipodi:docname="cg.svg"
   inkscape:export-filename="cg.png"
   inkscape:export-xdpi="96"
   inkscape:export-ydpi="96">
  <defs
     id="defs8646" />
  <sodipodi:namedview
     id="base"
     pagecolor="#000000"
     bordercolor="#666666"
     borderopacity="1.0"
     inkscape:pageopacity="1"
     inkscape:pageshadow="2"
     inkscape:zoom="1.4142136"
     inkscape:cx="187.37048"
     inkscape:cy="102.0917"
     inkscape:document-units="px"
     inkscape:current-layer="layer2"
     showgrid="true"
     units="px"
     inkscape:window-width="1366"
     inkscape:window-height="734"
     inkscape:window-x="0"
     inkscape:window-y="34"
     inkscape:window-maximized="0"
     inkscape:snap-grids="true"
     showguides="true"
     inkscape:guide-bbox="true"
     inkscape:pagecheckerboard="false"
     inkscape:snap-bbox="true"
     inkscape:bbox-paths="true"
     inkscape:bbox-nodes="true"
     inkscape:snap-bbox-edge-midpoints="true"
     inkscape:snap-bbox-midpoints="true"
     inkscape:object-paths="true"
     inkscape:snap-intersection-paths="true"
     inkscape:snap-smooth-nodes="true"
     inkscape:snap-midpoints="true"
     inkscape:snap-object-midpoints="true"
     inkscape:snap-center="true"
     inkscape:snap-text-baseline="true"
     inkscape:snap-page="true"
     inkscape:snap-global="false"
     inkscape:snap-nodes="true"
     inkscape:snap-others="true"
     inkscape:document-rotation="0">
    <inkscape:grid
       type="xygrid"
       id="grid8654"
       empspacing="8"
       dotted="false" />
  </sodipodi:namedview>
  <metadata
     id="metadata8649">
    <rdf:RDF>
      <cc:Work
         rdf:about="">
        <dc:format>image/svg+xml</dc:format>
        <dc:type
           rdf:resource="http://purl.org/dc/dcmitype/StillImage" />
        <dc:title></dc:title>
      </cc:Work>
    </rdf:RDF>
  </metadata>
  <g
     inkscape:groupmode="layer"
     id="layer8"
     inkscape:label="bg"
     style="display:inline">
    <circle
       style="fill:#181818;fill-opacity:1;stroke:none;stroke-width:1.80719;stroke-linecap:round;stroke-miterlimit:4;stroke-dasharray:none;stroke-opacity:1"
       id="path11933"
       cx="128"
       cy="128"
       r="128" />
  </g>
  <g
     inkscape:label="text"
     inkscape:groupmode="layer"
     id="layer1"
     transform="translate(0,-229.26665)">
    <text
       xml:space="preserve"
       style="font-style:normal;font-variant:normal;font-weight:normal;font-stretch:normal;font-size:34.6666px;line-height:19.9999px;font-family:LENYA69;-inkscape-font-specification:LENYA69;letter-spacing:0px;word-spacing:0px;fill:#e7e7e7;fill-opacity:1;stroke:none;stroke-width:0.999999"
       x="84.785583"
       y="433.46558"
       id="text1800"><tspan
         sodipodi:role="line"
         id="tspan1798"
         x="84.785583"
         y="433.46558"
         style="font-size:34.6666px;fill:#e7e7e7;fill-opacity:1;stroke-width:0.999999">38</tspan></text>
    <text
       id="text1804"
       y="395.40967"
       x="46.322636"
       style="font-style:normal;font-variant:normal;font-weight:normal;font-stretch:normal;font-size:34.6666px;line-height:19.9999px;font-family:LENYA69;-inkscape-font-specification:LENYA69;letter-spacing:0px;word-spacing:0px;fill:#e7e7e7;fill-opacity:1;stroke:none;stroke-width:0.999999"
       xml:space="preserve"><tspan
         style="font-size:34.6666px;fill:#e7e7e7;fill-opacity:1;stroke-width:0.999999"
         y="395.40967"
         x="46.322636"
         id="tspan1802"
         sodipodi:role="line">40</tspan></text>
    <text
       xml:space="preserve"
       style="font-style:normal;font-variant:normal;font-weight:normal;font-stretch:normal;font-size:34.6666px;line-height:19.9999px;font-family:LENYA69;-inkscape-font-specification:LENYA69;letter-spacing:0px;word-spacing:0px;fill:#e7e7e7;fill-opacity:1;stroke:none;stroke-width:0.999999"
       x="44.255192"
       y="341.50232"
       id="text1808"><tspan
         sodipodi:role="line"
         id="tspan1806"
         x="44.255192"
         y="341.50232"
         style="font-size:34.6666px;fill:#e7e7e7;fill-opacity:1;stroke-width:0.999999">42</tspan></text>
    <text
       id="text1812"
       y="300.45468"
       x="76.340996"
       style="font-style:normal;font-variant:normal;font-weight:normal;font-stretch:normal;font-size:34.6666px;line-height:19.9999px;font-family:LENYA69;-inkscape-font-specification:LENYA69;letter-spacing:0px;word-spacing:0px;fill:#e7e7e7;fill-opacity:1;stroke:none;stroke-width:0.999999"
       xml:space="preserve"><tspan
         style="font-size:34.6666px;fill:#e7e7e7;fill-opacity:1;stroke-width:0.999999"
         y="300.45468"
         x="76.340996"
         id="tspan1810"
         sodipodi:role="line">44</tspan></text>
    <text
       xml:space="preserve"
       style="font-style:normal;font-variant:normal;font-weight:normal;font-stretch:normal;font-size:34.6666px;line-height:19.9999px;font-family:LENYA69;-inkscape-font-specification:LENYA69;letter-spacing:0px;word-spacing:0px;fill:#e7e7e7;fill-opacity:1;stroke:none;stroke-width:0.999999"
       x="137.14194"
       y="300.38815"
       id="text1816"><tspan
         sodipodi:role="line"
         id="tspan1814"
         x="137.14194"
         y="300.38815"
         style="font-size:34.6666px;fill:#e7e7e7;fill-opacity:1;stroke-width:0.999999">46</tspan></text>
    <text
       id="text1820"
       y="341.40421"
       x="174.14751"
       style="font-style:normal;font-variant:normal;font-weight:normal;font-stretch:normal;font-size:34.6666px;line-height:19.9999px;font-family:LENYA69;-inkscape-font-specification:LENYA69;letter-spacing:0px;word-spacing:0px;fill:#e7e7e7;fill-opacity:1;stroke:none;stroke-width:0.999999"
       xml:space="preserve"><tspan
         style="font-size:34.6666px;fill:#e7e7e7;fill-opacity:1;stroke-width:0.999999"
         y="341.40421"
         x="174.14751"
         id="tspan1818"
         sodipodi:role="line">48</tspan></text>
    <text
       xml:space="preserve"
       style="font-style:normal;font-variant:normal;font-weight:normal;font-stretch:normal;font-size:34.6666px;line-height:19.9999px;font-family:LENYA69;-inkscape-font-specification:LENYA69;letter-spacing:0px;word-spacing:0px;fill:#e7e7e7;fill-opacity:1;stroke:none;stroke-width:0.999999"
       x="175.99362"
       y="395.26276"
       id="text1824"><tspan
         sodipodi:role="line"
         id="tspan1822"
         x="175.99362"
         y="395.26276"
         style="font-size:34.6666px;fill:#e7e7e7;fill-opacity:1;stroke-width:0.999999">50</tspan></text>
    <text
       id="text1828"
       y="433.38797"
       x="137.93452"
       style="font-style:normal;font-variant:normal;font-weight:normal;font-stretch:normal;font-size:34.6666px;line-height:19.9999px;font-family:LENYA69;-inkscape-font-specification:LENYA69;letter-spacing:0px;word-spacing:0px;fill:#e7e7e7;fill-opacity:1;stroke:none;stroke-width:0.999999"
       xml:space="preserve"><tspan
         style="font-size:34.6666px;fill:#e7e7e7;fill-opacity:1;stroke-width:0.999999"
         y="433.38797"
         x="137.93452"
         id="tspan1826"
         sodipodi:role="line">52</tspan></text>
    <text
       xml:space="preserve"
       style="font-style:normal;font-variant:normal;font-weight:normal;font-stretch:normal;font-size:29.3334px;line-height:19.9999px;font-family:LENYA69;-inkscape-font-specification:LENYA69;letter-spacing:0px;word-spacing:0px;fill:#e7e7e7;fill-opacity:1;stroke:none;stroke-width:0.999999"
       x="111.26395"
       y="327.91782"
       id="text1832"><tspan
         sodipodi:role="line"
         id="tspan1830"
         x="111.26395"
         y="327.91782"
         style="font-size:13.3333px;fill:#e7e7e7;fill-opacity:1;stroke-width:0.999999">%САХ</tspan></text>
  </g>
  <g
     inkscape:groupmode="layer"
     id="layer4"
     inkscape:label="1"
     style="display:inline">
    <path
       style="fill:none;stroke:#e7e7e7;stroke-width:3.99999;stroke-linecap:round;stroke-linejoin:miter;stroke-miterlimit:4;stroke-dasharray:none;stroke-opacity:1"
       d="m 87.435561,225.93123 6.122937,-14.78207"
       id="path1835"
       inkscape:connector-curvature="0"
       sodipodi:nodetypes="cc"
       inkscape:transform-center-y="90.540201"
       inkscape:transform-center-x="37.502979"
       inkscape:tile-cx="33.866666"
       inkscape:tile-cy="33.866666"
       inkscape:tile-w="2.684194"
       inkscape:tile-h="4.9833573"
       inkscape:tile-x0="22.601907"
       inkscape:tile-y0="55.330413" />
    <use
       x="0"
       y="0"
       inkscape:tiled-clone-of="#path1835"
       xlink:href="#path1835"
       transform="rotate(22.499999,128.00001,127.99999)"
       id="use991"
       inkscape:transform-center-x="-24.854046"
       inkscape:transform-center-y="-10.523093"
       width="100%"
       height="100%" />
    <use
       x="0"
       y="0"
       inkscape:tiled-clone-of="#path1835"
       xlink:href="#path1835"
       transform="rotate(45,128,127.99999)"
       id="use993"
       inkscape:transform-center-x="-70.177899"
       inkscape:transform-center-y="-29.068632"
       width="100%"
       height="100%" />
    <use
       x="0"
       y="0"
       inkscape:tiled-clone-of="#path1835"
       xlink:href="#path1835"
       transform="rotate(67.5,128.00001,127.99999)"
       id="use995"
       inkscape:transform-center-x="-119.14876"
       inkscape:transform-center-y="-28.857798"
       width="100%"
       height="100%" />
    <use
       x="0"
       y="0"
       inkscape:tiled-clone-of="#path1835"
       xlink:href="#path1835"
       transform="rotate(90,128,127.99999)"
       id="use997"
       inkscape:transform-center-x="-164.31123"
       inkscape:transform-center-y="-9.9226633"
       width="100%"
       height="100%" />
    <use
       x="0"
       y="0"
       inkscape:tiled-clone-of="#path1835"
       xlink:href="#path1835"
       transform="rotate(112.5,128.00001,127.99999)"
       id="use999"
       inkscape:transform-center-x="-198.78977"
       inkscape:transform-center-y="24.854039"
       width="100%"
       height="100%" />
    <use
       x="0"
       y="0"
       inkscape:tiled-clone-of="#path1835"
       xlink:href="#path1835"
       transform="rotate(135,128.00001,127.99999)"
       id="use1001"
       inkscape:transform-center-x="-217.33531"
       inkscape:transform-center-y="70.177891"
       width="100%"
       height="100%" />
    <use
       x="0"
       y="0"
       inkscape:tiled-clone-of="#path1835"
       xlink:href="#path1835"
       transform="rotate(157.5,128,127.99999)"
       id="use1003"
       inkscape:transform-center-x="-217.12446"
       inkscape:transform-center-y="119.14875"
       width="100%"
       height="100%" />
    <use
       x="0"
       y="0"
       inkscape:tiled-clone-of="#path1835"
       xlink:href="#path1835"
       transform="rotate(180,128,127.99999)"
       id="use1005"
       inkscape:transform-center-x="-198.18933"
       inkscape:transform-center-y="164.31123"
       width="100%"
       height="100%" />
    <use
       x="0"
       y="0"
       inkscape:tiled-clone-of="#path1835"
       xlink:href="#path1835"
       transform="rotate(-157.5,128.00001,127.99999)"
       id="use1007"
       inkscape:transform-center-x="-163.41264"
       inkscape:transform-center-y="198.78977"
       width="100%"
       height="100%" />
    <use
       x="0"
       y="0"
       inkscape:tiled-clone-of="#path1835"
       xlink:href="#path1835"
       transform="rotate(-135,128,127.99999)"
       id="use1009"
       inkscape:transform-center-x="-118.08877"
       inkscape:transform-center-y="217.3353"
       width="100%"
       height="100%" />
    <use
       x="0"
       y="0"
       inkscape:tiled-clone-of="#path1835"
       xlink:href="#path1835"
       transform="rotate(-112.5,128,128)"
       id="use1011"
       inkscape:transform-center-x="-69.117916"
       inkscape:transform-center-y="217.12447"
       width="100%"
       height="100%" />
    <use
       x="0"
       y="0"
       inkscape:tiled-clone-of="#path1835"
       xlink:href="#path1835"
       transform="rotate(-90,128,127.99999)"
       id="use1013"
       inkscape:transform-center-x="-23.955445"
       inkscape:transform-center-y="198.18933"
       width="100%"
       height="100%" />
    <use
       x="0"
       y="0"
       inkscape:tiled-clone-of="#path1835"
       xlink:href="#path1835"
       transform="rotate(-67.5,128.00001,128)"
       id="use1015"
       inkscape:transform-center-x="10.523095"
       inkscape:transform-center-y="163.41264"
       width="100%"
       height="100%" />
    <use
       x="0"
       y="0"
       inkscape:tiled-clone-of="#path1835"
       xlink:href="#path1835"
       transform="rotate(-45,128,127.99999)"
       id="use1017"
       inkscape:transform-center-x="29.068632"
       inkscape:transform-center-y="118.08877"
       width="100%"
       height="100%" />
  </g>
  <g
     inkscape:groupmode="layer"
     id="layer5"
     inkscape:label="0.2">
    <path
       style="fill:none;stroke:#e7e7e7;stroke-width:1.99999;stroke-linecap:round;stroke-linejoin:miter;stroke-miterlimit:4;stroke-dasharray:none;stroke-opacity:1"
       d="m 79.423023,223.3377 4.993894,-9.80107"
       id="path1835-7"
       inkscape:connector-curvature="0"
       sodipodi:nodetypes="cc"
       inkscape:transform-center-y="90.43717"
       inkscape:transform-center-x="46.08004"
       inkscape:tile-cx="33.866666"
       inkscape:tile-cy="33.866666"
       inkscape:tile-w="1.8539181"
       inkscape:tile-h="3.1290866"
       inkscape:tile-x0="20.747698"
       inkscape:tile-y0="56.230288" />
    <use
       x="0"
       y="0"
       inkscape:tiled-clone-of="#path1835-7"
       xlink:href="#path1835-7"
       transform="rotate(22.499999,128.00001,127.99999)"
       id="use1253"
       inkscape:transform-center-x="-22.767875"
       inkscape:transform-center-y="-11.416722"
       width="100%"
       height="100%" />
    <use
       x="0"
       y="0"
       inkscape:tiled-clone-of="#path1835-7"
       xlink:href="#path1835-7"
       transform="rotate(45,128,127.99999)"
       id="use1255"
       inkscape:transform-center-x="-68.592504"
       inkscape:transform-center-y="-30.692578"
       width="100%"
       height="100%" />
    <use
       x="0"
       y="0"
       inkscape:tiled-clone-of="#path1835-7"
       xlink:href="#path1835-7"
       transform="rotate(67.5,128.00001,127.99999)"
       id="use1257"
       inkscape:transform-center-x="-118.3055"
       inkscape:transform-center-y="-30.964832"
       width="100%"
       height="100%" />
    <use
       x="0"
       y="0"
       inkscape:tiled-clone-of="#path1835-7"
       xlink:href="#path1835-7"
       transform="rotate(90,128,127.99999)"
       id="use1259"
       inkscape:transform-center-x="-164.33849"
       inkscape:transform-center-y="-12.19201"
       width="100%"
       height="100%" />
    <use
       x="0"
       y="0"
       inkscape:tiled-clone-of="#path1835-7"
       xlink:href="#path1835-7"
       transform="rotate(112.5,128.00001,127.99999)"
       id="use1261"
       inkscape:transform-center-x="-199.6834"
       inkscape:transform-center-y="22.767869"
       width="100%"
       height="100%" />
    <use
       x="0"
       y="0"
       inkscape:tiled-clone-of="#path1835-7"
       xlink:href="#path1835-7"
       transform="rotate(135,128.00001,127.99999)"
       id="use1263"
       inkscape:transform-center-x="-218.95926"
       inkscape:transform-center-y="68.592497"
       width="100%"
       height="100%" />
    <use
       x="0"
       y="0"
       inkscape:tiled-clone-of="#path1835-7"
       xlink:href="#path1835-7"
       transform="rotate(157.5,128,127.99999)"
       id="use1265"
       inkscape:transform-center-x="-219.23149"
       inkscape:transform-center-y="118.30549"
       width="100%"
       height="100%" />
    <use
       x="0"
       y="0"
       inkscape:tiled-clone-of="#path1835-7"
       xlink:href="#path1835-7"
       transform="rotate(180,128,127.99999)"
       id="use1267"
       inkscape:transform-center-x="-200.45868"
       inkscape:transform-center-y="164.33849"
       width="100%"
       height="100%" />
    <use
       x="0"
       y="0"
       inkscape:tiled-clone-of="#path1835-7"
       xlink:href="#path1835-7"
       transform="rotate(-157.5,128.00001,127.99999)"
       id="use1269"
       inkscape:transform-center-x="-165.49881"
       inkscape:transform-center-y="199.68339"
       width="100%"
       height="100%" />
    <use
       x="0"
       y="0"
       inkscape:tiled-clone-of="#path1835-7"
       xlink:href="#path1835-7"
       transform="rotate(-135,128,127.99999)"
       id="use1271"
       inkscape:transform-center-x="-119.67416"
       inkscape:transform-center-y="218.95925"
       width="100%"
       height="100%" />
    <use
       x="0"
       y="0"
       inkscape:tiled-clone-of="#path1835-7"
       xlink:href="#path1835-7"
       transform="rotate(-112.5,128,128)"
       id="use1273"
       inkscape:transform-center-x="-69.961169"
       inkscape:transform-center-y="219.2315"
       width="100%"
       height="100%" />
    <use
       x="0"
       y="0"
       inkscape:tiled-clone-of="#path1835-7"
       xlink:href="#path1835-7"
       transform="rotate(-90,128,127.99999)"
       id="use1275"
       inkscape:transform-center-x="-23.928176"
       inkscape:transform-center-y="200.45868"
       width="100%"
       height="100%" />
    <use
       x="0"
       y="0"
       inkscape:tiled-clone-of="#path1835-7"
       xlink:href="#path1835-7"
       transform="rotate(-67.5,128.00001,128)"
       id="use1277"
       inkscape:transform-center-x="11.416721"
       inkscape:transform-center-y="165.49881"
       width="100%"
       height="100%" />
    <use
       x="0"
       y="0"
       inkscape:tiled-clone-of="#path1835-7"
       xlink:href="#path1835-7"
       transform="rotate(4.5000005,128,127.99999)"
       id="use1279"
       inkscape:transform-center-x="6.3560095"
       inkscape:transform-center-y="15.802408"
       width="100%"
       height="100%" />
    <use
       x="0"
       y="0"
       inkscape:tiled-clone-of="#path1835-7"
       xlink:href="#path1835-7"
       transform="rotate(26.999999,128.00001,127.99999)"
       id="use1281"
       inkscape:transform-center-x="-31.269232"
       inkscape:transform-center-y="-16.690617"
       width="100%"
       height="100%" />
    <use
       x="0"
       y="0"
       inkscape:tiled-clone-of="#path1835-7"
       xlink:href="#path1835-7"
       transform="rotate(49.499999,128.00001,127.99999)"
       id="use1283"
       inkscape:transform-center-x="-78.464968"
       inkscape:transform-center-y="-32.311702"
       width="100%"
       height="100%" />
    <use
       x="0"
       y="0"
       inkscape:tiled-clone-of="#path1835-7"
       xlink:href="#path1835-7"
       transform="rotate(72,128.00001,128)"
       id="use1285"
       inkscape:transform-center-x="-128.04608"
       inkscape:transform-center-y="-28.682665"
       width="100%"
       height="100%" />
    <use
       x="0"
       y="0"
       inkscape:tiled-clone-of="#path1835-7"
       xlink:href="#path1835-7"
       transform="rotate(94.5,128,127.99999)"
       id="use1287"
       inkscape:transform-center-x="-172.46426"
       inkscape:transform-center-y="-6.3560106"
       width="100%"
       height="100%" />
    <use
       x="0"
       y="0"
       inkscape:tiled-clone-of="#path1835-7"
       xlink:href="#path1835-7"
       transform="rotate(117,128.00001,127.99999)"
       id="use1289"
       inkscape:transform-center-x="-204.9573"
       inkscape:transform-center-y="31.269226"
       width="100%"
       height="100%" />
    <use
       x="0"
       y="0"
       inkscape:tiled-clone-of="#path1835-7"
       xlink:href="#path1835-7"
       transform="rotate(139.5,128,127.99999)"
       id="use1291"
       inkscape:transform-center-x="-220.57836"
       inkscape:transform-center-y="78.464967"
       width="100%"
       height="100%" />
    <use
       x="0"
       y="0"
       inkscape:tiled-clone-of="#path1835-7"
       xlink:href="#path1835-7"
       transform="rotate(162,128,127.99999)"
       id="use1293"
       inkscape:transform-center-x="-216.94933"
       inkscape:transform-center-y="128.04607"
       width="100%"
       height="100%" />
    <use
       x="0"
       y="0"
       inkscape:tiled-clone-of="#path1835-7"
       xlink:href="#path1835-7"
       transform="rotate(-175.5,128,127.99999)"
       id="use1295"
       inkscape:transform-center-x="-194.62268"
       inkscape:transform-center-y="172.46426"
       width="100%"
       height="100%" />
    <use
       x="0"
       y="0"
       inkscape:tiled-clone-of="#path1835-7"
       xlink:href="#path1835-7"
       transform="rotate(-153,128.00001,127.99999)"
       id="use1297"
       inkscape:transform-center-x="-156.99746"
       inkscape:transform-center-y="204.95729"
       width="100%"
       height="100%" />
    <use
       x="0"
       y="0"
       inkscape:tiled-clone-of="#path1835-7"
       xlink:href="#path1835-7"
       transform="rotate(-130.5,128.00001,127.99999)"
       id="use1299"
       inkscape:transform-center-x="-109.80171"
       inkscape:transform-center-y="220.57837"
       width="100%"
       height="100%" />
    <use
       x="0"
       y="0"
       inkscape:tiled-clone-of="#path1835-7"
       xlink:href="#path1835-7"
       transform="rotate(-108,128.00001,127.99999)"
       id="use1301"
       inkscape:transform-center-x="-60.220615"
       inkscape:transform-center-y="216.94934"
       width="100%"
       height="100%" />
    <use
       x="0"
       y="0"
       inkscape:tiled-clone-of="#path1835-7"
       xlink:href="#path1835-7"
       transform="rotate(-85.5,128,127.99999)"
       id="use1303"
       inkscape:transform-center-x="-15.802408"
       inkscape:transform-center-y="194.62268"
       width="100%"
       height="100%" />
    <use
       x="0"
       y="0"
       inkscape:tiled-clone-of="#path1835-7"
       xlink:href="#path1835-7"
       transform="rotate(-63,128.00001,128)"
       id="use1305"
       inkscape:transform-center-x="16.690617"
       inkscape:transform-center-y="156.99745"
       width="100%"
       height="100%" />
    <use
       x="0"
       y="0"
       inkscape:tiled-clone-of="#path1835-7"
       xlink:href="#path1835-7"
       transform="rotate(9,128,128)"
       id="use1307"
       inkscape:transform-center-x="-0.099539517"
       inkscape:transform-center-y="8.1595736"
       width="100%"
       height="100%" />
    <use
       x="0"
       y="0"
       inkscape:tiled-clone-of="#path1835-7"
       xlink:href="#path1835-7"
       transform="rotate(31.499999,128.00001,127.99999)"
       id="use1309"
       inkscape:transform-center-x="-40.158168"
       inkscape:transform-center-y="-21.281247"
       width="100%"
       height="100%" />
    <use
       x="0"
       y="0"
       inkscape:tiled-clone-of="#path1835-7"
       xlink:href="#path1835-7"
       transform="rotate(54,128.00001,127.99999)"
       id="use1311"
       inkscape:transform-center-x="-88.434033"
       inkscape:transform-center-y="-33.151241"
       width="100%"
       height="100%" />
    <use
       x="0"
       y="0"
       inkscape:tiled-clone-of="#path1835-7"
       xlink:href="#path1835-7"
       transform="rotate(76.5,128,127.99999)"
       id="use1313"
       inkscape:transform-center-x="-137.57756"
       inkscape:transform-center-y="-25.6433"
       width="100%"
       height="100%" />
    <use
       x="0"
       y="0"
       inkscape:tiled-clone-of="#path1835-7"
       xlink:href="#path1835-7"
       transform="rotate(99,128.00001,127.99999)"
       id="use1315"
       inkscape:transform-center-x="-180.10711"
       inkscape:transform-center-y="0.09952864"
       width="100%"
       height="100%" />
    <use
       x="0"
       y="0"
       inkscape:tiled-clone-of="#path1835-7"
       xlink:href="#path1835-7"
       transform="rotate(121.5,128.00001,127.99999)"
       id="use1317"
       inkscape:transform-center-x="-209.54792"
       inkscape:transform-center-y="40.158161"
       width="100%"
       height="100%" />
    <use
       x="0"
       y="0"
       inkscape:tiled-clone-of="#path1835-7"
       xlink:href="#path1835-7"
       transform="rotate(144,128.00001,127.99999)"
       id="use1319"
       inkscape:transform-center-x="-221.41792"
       inkscape:transform-center-y="88.434024"
       width="100%"
       height="100%" />
    <use
       x="0"
       y="0"
       inkscape:tiled-clone-of="#path1835-7"
       xlink:href="#path1835-7"
       transform="rotate(166.5,128.00001,127.99999)"
       id="use1321"
       inkscape:transform-center-x="-213.90998"
       inkscape:transform-center-y="137.57755"
       width="100%"
       height="100%" />
    <use
       x="0"
       y="0"
       inkscape:tiled-clone-of="#path1835-7"
       xlink:href="#path1835-7"
       transform="rotate(-171,128,127.99999)"
       id="use1323"
       inkscape:transform-center-x="-188.16713"
       inkscape:transform-center-y="180.1071"
       width="100%"
       height="100%" />
    <use
       x="0"
       y="0"
       inkscape:tiled-clone-of="#path1835-7"
       xlink:href="#path1835-7"
       transform="rotate(-148.5,128,128)"
       id="use1325"
       inkscape:transform-center-x="-148.10849"
       inkscape:transform-center-y="209.54793"
       width="100%"
       height="100%" />
    <use
       x="0"
       y="0"
       inkscape:tiled-clone-of="#path1835-7"
       xlink:href="#path1835-7"
       transform="rotate(-126,128,127.99999)"
       id="use1327"
       inkscape:transform-center-x="-99.83264"
       inkscape:transform-center-y="221.4179"
       width="100%"
       height="100%" />
    <use
       x="0"
       y="0"
       inkscape:tiled-clone-of="#path1835-7"
       xlink:href="#path1835-7"
       transform="rotate(-103.5,128,127.99999)"
       id="use1329"
       inkscape:transform-center-x="-50.689108"
       inkscape:transform-center-y="213.90997"
       width="100%"
       height="100%" />
    <use
       x="0"
       y="0"
       inkscape:tiled-clone-of="#path1835-7"
       xlink:href="#path1835-7"
       transform="rotate(-81,128,127.99999)"
       id="use1331"
       inkscape:transform-center-x="-8.1595729"
       inkscape:transform-center-y="188.16713"
       width="100%"
       height="100%" />
    <use
       x="0"
       y="0"
       inkscape:tiled-clone-of="#path1835-7"
       xlink:href="#path1835-7"
       transform="rotate(-58.5,128.00001,127.99999)"
       id="use1333"
       inkscape:transform-center-x="21.281239"
       inkscape:transform-center-y="148.1085"
       width="100%"
       height="100%" />
    <use
       x="0"
       y="0"
       inkscape:tiled-clone-of="#path1835-7"
       xlink:href="#path1835-7"
       transform="rotate(13.5,128,127.99999)"
       id="use1335"
       inkscape:transform-center-x="-7.1348361"
       inkscape:transform-center-y="1.0467938"
       width="100%"
       height="100%" />
    <use
       x="0"
       y="0"
       inkscape:tiled-clone-of="#path1835-7"
       xlink:href="#path1835-7"
       transform="rotate(36,128.00001,127.99999)"
       id="use1337"
       inkscape:transform-center-x="-49.379881"
       inkscape:transform-center-y="-25.160303"
       width="100%"
       height="100%" />
    <use
       x="0"
       y="0"
       inkscape:tiled-clone-of="#path1835-7"
       xlink:href="#path1835-7"
       transform="rotate(58.5,128.00001,127.99999)"
       id="use1339"
       inkscape:transform-center-x="-98.438234"
       inkscape:transform-center-y="-33.206022"
       width="100%"
       height="100%" />
    <use
       x="0"
       y="0"
       inkscape:tiled-clone-of="#path1835-7"
       xlink:href="#path1835-7"
       transform="rotate(81,128,127.99999)"
       id="use1341"
       inkscape:transform-center-x="-146.8412"
       inkscape:transform-center-y="-21.865474"
       width="100%"
       height="100%" />
    <use
       x="0"
       y="0"
       inkscape:tiled-clone-of="#path1835-7"
       xlink:href="#path1835-7"
       transform="rotate(103.5,128.00001,128)"
       id="use1343"
       inkscape:transform-center-x="-187.2199"
       inkscape:transform-center-y="7.1348396"
       width="100%"
       height="100%" />
    <use
       x="0"
       y="0"
       inkscape:tiled-clone-of="#path1835-7"
       xlink:href="#path1835-7"
       transform="rotate(126,128.00001,127.99999)"
       id="use1345"
       inkscape:transform-center-x="-213.42698"
       inkscape:transform-center-y="49.379872"
       width="100%"
       height="100%" />
    <use
       x="0"
       y="0"
       inkscape:tiled-clone-of="#path1835-7"
       xlink:href="#path1835-7"
       transform="rotate(148.5,128.00001,127.99999)"
       id="use1347"
       inkscape:transform-center-x="-221.4727"
       inkscape:transform-center-y="98.438225"
       width="100%"
       height="100%" />
    <use
       x="0"
       y="0"
       inkscape:tiled-clone-of="#path1835-7"
       xlink:href="#path1835-7"
       transform="rotate(171,128.00001,127.99999)"
       id="use1349"
       inkscape:transform-center-x="-210.13217"
       inkscape:transform-center-y="146.8412"
       width="100%"
       height="100%" />
    <use
       x="0"
       y="0"
       inkscape:tiled-clone-of="#path1835-7"
       xlink:href="#path1835-7"
       transform="rotate(-166.5,128,127.99999)"
       id="use1351"
       inkscape:transform-center-x="-181.13183"
       inkscape:transform-center-y="187.21987"
       width="100%"
       height="100%" />
    <use
       x="0"
       y="0"
       inkscape:tiled-clone-of="#path1835-7"
       xlink:href="#path1835-7"
       transform="rotate(-144,128.00001,127.99999)"
       id="use1353"
       inkscape:transform-center-x="-138.88681"
       inkscape:transform-center-y="213.42697"
       width="100%"
       height="100%" />
    <use
       x="0"
       y="0"
       inkscape:tiled-clone-of="#path1835-7"
       xlink:href="#path1835-7"
       transform="rotate(-121.5,128.00001,127.99999)"
       id="use1355"
       inkscape:transform-center-x="-89.828447"
       inkscape:transform-center-y="221.47269"
       width="100%"
       height="100%" />
    <use
       x="0"
       y="0"
       inkscape:tiled-clone-of="#path1835-7"
       xlink:href="#path1835-7"
       transform="rotate(-99,128,127.99999)"
       id="use1357"
       inkscape:transform-center-x="-41.425472"
       inkscape:transform-center-y="210.13214"
       width="100%"
       height="100%" />
    <use
       x="0"
       y="0"
       inkscape:tiled-clone-of="#path1835-7"
       xlink:href="#path1835-7"
       transform="rotate(-76.5,128,127.99999)"
       id="use1359"
       inkscape:transform-center-x="-1.0467904"
       inkscape:transform-center-y="181.13183"
       width="100%"
       height="100%" />
    <use
       x="0"
       y="0"
       inkscape:tiled-clone-of="#path1835-7"
       xlink:href="#path1835-7"
       transform="rotate(-54,128.00001,127.99999)"
       id="use1361"
       inkscape:transform-center-x="25.160291"
       inkscape:transform-center-y="138.8868"
       width="100%"
       height="100%" />
  </g>
  <g
     inkscape:groupmode="layer"
     id="layer2"
     inkscape:label="needles">
    <rect
       style="fill:#e7e7e7;fill-opacity:1;stroke-width:1.13389"
       id="rect2782"
       width="12"
       height="12"
       x="16"
       y="11.99999" />
    <rect
       y="11.999991"
       x="230.00002"
       height="24"
       width="12"
       id="rect3087"
       style="fill:#181818;fill-opacity:1;stroke-width:1.11988" />
    <rect
       style="fill:#ffd920;fill-opacity:1;stroke-width:0.791871"
       id="rect2788"
       width="12"
       height="12"
       x="230.00002"
       y="23.999992" />
  </g>
</svg>
