{
  "failEveryNth": 10000,
  "workload": 222,
  "replicaTextSpout": 1,
  "replicaSplitBolt": 1,
  "replicaCountBolt": 1,
  "replicaCommitBolt": 1,
  "topoConfig": {
    "topology.max.spout.pending": 2,
    "topology.max.task.parallelism": null,
    "topology.message.timeout.secs": 10,
    "topology.spout.max.batch.size": 10,
    "topology.trident.batch.emit.interval.millis": 1,
    "topology.workers": 4,
    "topology.component.cpu.pcore.percent": 20,
    "topology.component.resources.offheap.memory.mb": 0,
    "topology.component.resources.onheap.memory.mb": 128,
    "topology.producer.batch.size": 1,
    "topology.worker.max.heap.size.mb": 1024
  }
}
