[
  {
    "null": "",
    "Fehlerrate": "500",
    "Arbeitslast": "0",
    "Skalierung": "8",
    "Nebenl\u00e4ufigkeit": "2000",
    "Batch-Gr\u00f6sse": "10",
    "Batch-Dauer": "1"
  },
  {
    "null": "",
    "Fehlerrate": "500",
    "Arbeitslast": "0",
    "Skalierung": "2",
    "Nebenl\u00e4ufigkeit": "2000",
    "Batch-Gr\u00f6sse": "10",
    "Batch-Dauer": "1"
  },
  {
    "null": "",
    "Fehlerrate": "1000",
    "Arbeitslast": "0",
    "Skalierung": "1",
    "Nebenl\u00e4ufigkeit": "2000",
    "Batch-Gr\u00f6sse": "10",
    "Batch-Dauer": "1"
  },
  {
    "null": "",
    "Fehlerrate": "10000",
    "Arbeitslast": "0",
    "Skalierung": "4",
    "Nebenl\u00e4ufigkeit": "2000",
    "Batch-Gr\u00f6sse": "10",
    "Batch-Dauer": "10"
  },
  {
    "null": "",
    "Fehlerrate": "10000",
    "Arbeitslast": "0",
    "Skalierung": "10",
    "Nebenl\u00e4ufigkeit": "2000",
    "Batch-Gr\u00f6sse": "10",
    "Batch-Dauer": "1"
  },
  {
    "null": "",
    "Fehlerrate": "1000000",
    "Arbeitslast": "0",
    "Skalierung": "4",
    "Nebenl\u00e4ufigkeit": "2",
    "Batch-Gr\u00f6sse": "10",
    "Batch-Dauer": "10"
  },
  {
    "null": "",
    "Fehlerrate": "1000000",
    "Arbeitslast": "0",
    "Skalierung": "10",
    "Nebenl\u00e4ufigkeit": "2000",
    "Batch-Gr\u00f6sse": "10",
    "Batch-Dauer": "1"
  },
  {
    "null": "",
    "Fehlerrate": "1000000",
    "Arbeitslast": "0",
    "Skalierung": "4",
    "Nebenl\u00e4ufigkeit": "2000",
    "Batch-Gr\u00f6sse": "10",
    "Batch-Dauer": "10"
  },
  {
    "null": "",
    "Fehlerrate": "500",
    "Arbeitslast": "0",
    "Skalierung": "4",
    "Nebenl\u00e4ufigkeit": "2000",
    "Batch-Gr\u00f6sse": "10",
    "Batch-Dauer": "10"
  },
  {
    "null": "",
    "Fehlerrate": "500",
    "Arbeitslast": "0",
    "Skalierung": "1",
    "Nebenl\u00e4ufigkeit": "2000",
    "Batch-Gr\u00f6sse": "10",
    "Batch-Dauer": "1"
  },
  {
    "null": "",
    "Fehlerrate": "1000000",
    "Arbeitslast": "0",
    "Skalierung": "2",
    "Nebenl\u00e4ufigkeit": "2",
    "Batch-Gr\u00f6sse": "10",
    "Batch-Dauer": "10"
  },
  {
    "null": "",
    "Fehlerrate": "1000",
    "Arbeitslast": "0",
    "Skalierung": "5",
    "Nebenl\u00e4ufigkeit": "2000",
    "Batch-Gr\u00f6sse": "10",
    "Batch-Dauer": "1"
  },
  {
    "null": "",
    "Fehlerrate": "500",
    "Arbeitslast": "0",
    "Skalierung": "5",
    "Nebenl\u00e4ufigkeit": "2000",
    "Batch-Gr\u00f6sse": "10",
    "Batch-Dauer": "1"
  },
  {
    "null": "",
    "Fehlerrate": "10000",
    "Arbeitslast": "0",
    "Skalierung": "5",
    "Nebenl\u00e4ufigkeit": "2000",
    "Batch-Gr\u00f6sse": "10",
    "Batch-Dauer": "1"
  },
  {
    "null": "",
    "Fehlerrate": "10000",
    "Arbeitslast": "0",
    "Skalierung": "1",
    "Nebenl\u00e4ufigkeit": "2000",
    "Batch-Gr\u00f6sse": "10",
    "Batch-Dauer": "1"
  },
  {
    "null": "",
    "Fehlerrate": "1000000",
    "Arbeitslast": "0",
    "Skalierung": "5",
    "Nebenl\u00e4ufigkeit": "2",
    "Batch-Gr\u00f6sse": "10",
    "Batch-Dauer": "10"
  },
  {
    "null": "",
    "Fehlerrate": "1000",
    "Arbeitslast": "0",
    "Skalierung": "2",
    "Nebenl\u00e4ufigkeit": "2000",
    "Batch-Gr\u00f6sse": "10",
    "Batch-Dauer": "1"
  },
  {
    "null": "",
    "Fehlerrate": "1000000",
    "Arbeitslast": "0",
    "Skalierung": "5",
    "Nebenl\u00e4ufigkeit": "2000",
    "Batch-Gr\u00f6sse": "10",
    "Batch-Dauer": "1"
  },
  {
    "null": "",
    "Fehlerrate": "1000000",
    "Arbeitslast": "0",
    "Skalierung": "2",
    "Nebenl\u00e4ufigkeit": "2000",
    "Batch-Gr\u00f6sse": "10",
    "Batch-Dauer": "1"
  },
  {
    "null": "",
    "Fehlerrate": "1000",
    "Arbeitslast": "0",
    "Skalierung": "8",
    "Nebenl\u00e4ufigkeit": "2000",
    "Batch-Gr\u00f6sse": "10",
    "Batch-Dauer": "1"
  },
  {
    "null": "",
    "Fehlerrate": "1000000",
    "Arbeitslast": "0",
    "Skalierung": "1",
    "Nebenl\u00e4ufigkeit": "2",
    "Batch-Gr\u00f6sse": "10",
    "Batch-Dauer": "10"
  },
  {
    "null": "",
    "Fehlerrate": "10000",
    "Arbeitslast": "0",
    "Skalierung": "8",
    "Nebenl\u00e4ufigkeit": "2000",
    "Batch-Gr\u00f6sse": "10",
    "Batch-Dauer": "1"
  },
  {
    "null": "",
    "Fehlerrate": "1000",
    "Arbeitslast": "0",
    "Skalierung": "4",
    "Nebenl\u00e4ufigkeit": "2000",
    "Batch-Gr\u00f6sse": "10",
    "Batch-Dauer": "10"
  },
  {
    "null": "",
    "Fehlerrate": "1000000",
    "Arbeitslast": "0",
    "Skalierung": "8",
    "Nebenl\u00e4ufigkeit": "2",
    "Batch-Gr\u00f6sse": "10",
    "Batch-Dauer": "10"
  },
  {
    "null": "",
    "Fehlerrate": "10000",
    "Arbeitslast": "0",
    "Skalierung": "2",
    "Nebenl\u00e4ufigkeit": "2000",
    "Batch-Gr\u00f6sse": "10",
    "Batch-Dauer": "1"
  },
  {
    "null": "",
    "Fehlerrate": "1000000",
    "Arbeitslast": "0",
    "Skalierung": "8",
    "Nebenl\u00e4ufigkeit": "2000",
    "Batch-Gr\u00f6sse": "10",
    "Batch-Dauer": "1"
  },
  {
    "null": "",
    "Fehlerrate": "1000000",
    "Arbeitslast": "200",
    "Skalierung": "2",
    "Nebenl\u00e4ufigkeit": "2",
    "Batch-Gr\u00f6sse": "10",
    "Batch-Dauer": "10"
  },
  {
    "null": "",
    "Fehlerrate": "1000000",
    "Arbeitslast": "250",
    "Skalierung": "5",
    "Nebenl\u00e4ufigkeit": "2",
    "Batch-Gr\u00f6sse": "10",
    "Batch-Dauer": "10"
  },
  {
    "null": "",
    "Fehlerrate": "1000000",
    "Arbeitslast": "250",
    "Skalierung": "1",
    "Nebenl\u00e4ufigkeit": "2",
    "Batch-Gr\u00f6sse": "1",
    "Batch-Dauer": "10"
  },
  {
    "null": "",
    "Fehlerrate": "1000000",
    "Arbeitslast": "250",
    "Skalierung": "1",
    "Nebenl\u00e4ufigkeit": "2",
    "Batch-Gr\u00f6sse": "10",
    "Batch-Dauer": "10"
  },
  {
    "null": "",
    "Fehlerrate": "1000",
    "Arbeitslast": "250",
    "Skalierung": "4",
    "Nebenl\u00e4ufigkeit": "2",
    "Batch-Gr\u00f6sse": "10",
    "Batch-Dauer": "10"
  },
  {
    "null": "",
    "Fehlerrate": "50",
    "Arbeitslast": "250",
    "Skalierung": "1",
    "Nebenl\u00e4ufigkeit": "2",
    "Batch-Gr\u00f6sse": "10",
    "Batch-Dauer": "10"
  },
  {
    "null": "",
    "Fehlerrate": "1000000",
    "Arbeitslast": "250",
    "Skalierung": "4",
    "Nebenl\u00e4ufigkeit": "2",
    "Batch-Gr\u00f6sse": "10",
    "Batch-Dauer": "10"
  },
  {
    "null": "",
    "Fehlerrate": "500",
    "Arbeitslast": "250",
    "Skalierung": "1",
    "Nebenl\u00e4ufigkeit": "2",
    "Batch-Gr\u00f6sse": "10",
    "Batch-Dauer": "10"
  },
  {
    "null": "",
    "Fehlerrate": "1000000",
    "Arbeitslast": "250",
    "Skalierung": "10",
    "Nebenl\u00e4ufigkeit": "2",
    "Batch-Gr\u00f6sse": "1",
    "Batch-Dauer": "10"
  },
  {
    "null": "",
    "Fehlerrate": "1000000",
    "Arbeitslast": "250",
    "Skalierung": "10",
    "Nebenl\u00e4ufigkeit": "2",
    "Batch-Gr\u00f6sse": "10",
    "Batch-Dauer": "10"
  },
  {
    "null": "",
    "Fehlerrate": "20",
    "Arbeitslast": "250",
    "Skalierung": "6",
    "Nebenl\u00e4ufigkeit": "2",
    "Batch-Gr\u00f6sse": "10",
    "Batch-Dauer": "10"
  },
  {
    "null": "",
    "Fehlerrate": "500",
    "Arbeitslast": "250",
    "Skalierung": "4",
    "Nebenl\u00e4ufigkeit": "2",
    "Batch-Gr\u00f6sse": "10",
    "Batch-Dauer": "10"
  },
  {
    "null": "",
    "Fehlerrate": "500",
    "Arbeitslast": "250",
    "Skalierung": "6",
    "Nebenl\u00e4ufigkeit": "2",
    "Batch-Gr\u00f6sse": "10",
    "Batch-Dauer": "10"
  },
  {
    "null": "",
    "Fehlerrate": "50",
    "Arbeitslast": "250",
    "Skalierung": "6",
    "Nebenl\u00e4ufigkeit": "2",
    "Batch-Gr\u00f6sse": "10",
    "Batch-Dauer": "10"
  },
  {
    "null": "",
    "Fehlerrate": "1000000",
    "Arbeitslast": "250",
    "Skalierung": "2",
    "Nebenl\u00e4ufigkeit": "2",
    "Batch-Gr\u00f6sse": "50",
    "Batch-Dauer": "10"
  },
  {
    "null": "",
    "Fehlerrate": "100",
    "Arbeitslast": "250",
    "Skalierung": "6",
    "Nebenl\u00e4ufigkeit": "2",
    "Batch-Gr\u00f6sse": "10",
    "Batch-Dauer": "10"
  },
  {
    "null": "",
    "Fehlerrate": "1000000",
    "Arbeitslast": "250",
    "Skalierung": "8",
    "Nebenl\u00e4ufigkeit": "2",
    "Batch-Gr\u00f6sse": "1",
    "Batch-Dauer": "10"
  },
  {
    "null": "",
    "Fehlerrate": "1000",
    "Arbeitslast": "250",
    "Skalierung": "6",
    "Nebenl\u00e4ufigkeit": "2",
    "Batch-Gr\u00f6sse": "10",
    "Batch-Dauer": "10"
  },
  {
    "null": "",
    "Fehlerrate": "100",
    "Arbeitslast": "250",
    "Skalierung": "1",
    "Nebenl\u00e4ufigkeit": "2",
    "Batch-Gr\u00f6sse": "10",
    "Batch-Dauer": "10"
  },
  {
    "null": "",
    "Fehlerrate": "50",
    "Arbeitslast": "250",
    "Skalierung": "2",
    "Nebenl\u00e4ufigkeit": "2",
    "Batch-Gr\u00f6sse": "10",
    "Batch-Dauer": "10"
  },
  {
    "null": "",
    "Fehlerrate": "100",
    "Arbeitslast": "250",
    "Skalierung": "4",
    "Nebenl\u00e4ufigkeit": "2",
    "Batch-Gr\u00f6sse": "10",
    "Batch-Dauer": "10"
  },
  {
    "null": "",
    "Fehlerrate": "500",
    "Arbeitslast": "250",
    "Skalierung": "2",
    "Nebenl\u00e4ufigkeit": "2",
    "Batch-Gr\u00f6sse": "10",
    "Batch-Dauer": "10"
  },
  {
    "null": "",
    "Fehlerrate": "20",
    "Arbeitslast": "250",
    "Skalierung": "4",
    "Nebenl\u00e4ufigkeit": "2",
    "Batch-Gr\u00f6sse": "10",
    "Batch-Dauer": "10"
  },
  {
    "null": "",
    "Fehlerrate": "100",
    "Arbeitslast": "250",
    "Skalierung": "2",
    "Nebenl\u00e4ufigkeit": "2",
    "Batch-Gr\u00f6sse": "10",
    "Batch-Dauer": "10"
  },
  {
    "null": "",
    "Fehlerrate": "1000000",
    "Arbeitslast": "250",
    "Skalierung": "6",
    "Nebenl\u00e4ufigkeit": "2",
    "Batch-Gr\u00f6sse": "1",
    "Batch-Dauer": "10"
  },
  {
    "null": "",
    "Fehlerrate": "1000000",
    "Arbeitslast": "250",
    "Skalierung": "2",
    "Nebenl\u00e4ufigkeit": "2",
    "Batch-Gr\u00f6sse": "5",
    "Batch-Dauer": "10"
  },
  {
    "null": "",
    "Fehlerrate": "1000",
    "Arbeitslast": "250",
    "Skalierung": "2",
    "Nebenl\u00e4ufigkeit": "2",
    "Batch-Gr\u00f6sse": "10",
    "Batch-Dauer": "10"
  },
  {
    "null": "",
    "Fehlerrate": "1000",
    "Arbeitslast": "250",
    "Skalierung": "1",
    "Nebenl\u00e4ufigkeit": "2",
    "Batch-Gr\u00f6sse": "10",
    "Batch-Dauer": "10"
  },
  {
    "null": "",
    "Fehlerrate": "1000000",
    "Arbeitslast": "250",
    "Skalierung": "2",
    "Nebenl\u00e4ufigkeit": "2",
    "Batch-Gr\u00f6sse": "1",
    "Batch-Dauer": "10"
  },
  {
    "null": "",
    "Fehlerrate": "50",
    "Arbeitslast": "250",
    "Skalierung": "4",
    "Nebenl\u00e4ufigkeit": "2",
    "Batch-Gr\u00f6sse": "10",
    "Batch-Dauer": "10"
  },
  {
    "null": "",
    "Fehlerrate": "1000000",
    "Arbeitslast": "250",
    "Skalierung": "2",
    "Nebenl\u00e4ufigkeit": "2",
    "Batch-Gr\u00f6sse": "10",
    "Batch-Dauer": "10"
  },
  {
    "null": "",
    "Fehlerrate": "1000000",
    "Arbeitslast": "250",
    "Skalierung": "4",
    "Nebenl\u00e4ufigkeit": "2",
    "Batch-Gr\u00f6sse": "1",
    "Batch-Dauer": "10"
  },
  {
    "null": "",
    "Fehlerrate": "1000000",
    "Arbeitslast": "250",
    "Skalierung": "2",
    "Nebenl\u00e4ufigkeit": "2",
    "Batch-Gr\u00f6sse": "2",
    "Batch-Dauer": "10"
  },
  {
    "null": "",
    "Fehlerrate": "1000000",
    "Arbeitslast": "250",
    "Skalierung": "8",
    "Nebenl\u00e4ufigkeit": "2",
    "Batch-Gr\u00f6sse": "10",
    "Batch-Dauer": "10"
  },
  {
    "null": "",
    "Fehlerrate": "1000000",
    "Arbeitslast": "250",
    "Skalierung": "2",
    "Nebenl\u00e4ufigkeit": "2",
    "Batch-Gr\u00f6sse": "20",
    "Batch-Dauer": "10"
  },
  {
    "null": "",
    "Fehlerrate": "1000000",
    "Arbeitslast": "400",
    "Skalierung": "2",
    "Nebenl\u00e4ufigkeit": "2",
    "Batch-Gr\u00f6sse": "10",
    "Batch-Dauer": "10"
  },
  {
    "null": "",
    "Fehlerrate": "100",
    "Arbeitslast": "500",
    "Skalierung": "1",
    "Nebenl\u00e4ufigkeit": "2",
    "Batch-Gr\u00f6sse": "10",
    "Batch-Dauer": "10"
  },
  {
    "null": "",
    "Fehlerrate": "50",
    "Arbeitslast": "500",
    "Skalierung": "1",
    "Nebenl\u00e4ufigkeit": "2",
    "Batch-Gr\u00f6sse": "10",
    "Batch-Dauer": "10"
  },
  {
    "null": "",
    "Fehlerrate": "1000",
    "Arbeitslast": "500",
    "Skalierung": "1",
    "Nebenl\u00e4ufigkeit": "2",
    "Batch-Gr\u00f6sse": "10",
    "Batch-Dauer": "10"
  },
  {
    "null": "",
    "Fehlerrate": "500",
    "Arbeitslast": "500",
    "Skalierung": "1",
    "Nebenl\u00e4ufigkeit": "2",
    "Batch-Gr\u00f6sse": "10",
    "Batch-Dauer": "10"
  },
  {
    "null": "",
    "Fehlerrate": "1000000",
    "Arbeitslast": "600",
    "Skalierung": "2",
    "Nebenl\u00e4ufigkeit": "2",
    "Batch-Gr\u00f6sse": "10",
    "Batch-Dauer": "10"
  },
  {
    "null": "",
    "Fehlerrate": "1000000",
    "Arbeitslast": "800",
    "Skalierung": "2",
    "Nebenl\u00e4ufigkeit": "2",
    "Batch-Gr\u00f6sse": "10",
    "Batch-Dauer": "10"
  },
  {
    "null": "",
    "Fehlerrate": "1000000",
    "Arbeitslast": "1000",
    "Skalierung": "2",
    "Nebenl\u00e4ufigkeit": "2",
    "Batch-Gr\u00f6sse": "10",
    "Batch-Dauer": "10"
  },
  {
    "null": "",
    "Fehlerrate": "1000000",
    "Arbeitslast": "1200",
    "Skalierung": "2",
    "Nebenl\u00e4ufigkeit": "2",
    "Batch-Gr\u00f6sse": "10",
    "Batch-Dauer": "10"
  }
]