<?xml version="1.0" standalone="no"?>
<!DOCTYPE svg PUBLIC "-//W3C//DTD SVG 20010904//EN"
 "http://www.w3.org/TR/2001/REC-SVG-20010904/DTD/svg10.dtd">
<svg version="1.0" xmlns="http://www.w3.org/2000/svg"
 width="256.000000pt" height="256.000000pt" viewBox="0 0 256.000000 256.000000"
 preserveAspectRatio="xMidYMid meet">

<g transform="translate(0.000000,256.000000) scale(0.100000,-0.100000)"
fill="#000000" stroke="none">
<path d="M675 2533 c-174 -24 -370 -138 -485 -282 -272 -339 -205 -848 144
-1095 147 -105 277 -147 451 -147 358 0 657 231 746 576 27 108 28 271 0 376
-76 294 -323 520 -621 568 -63 11 -174 12 -235 4z m-11 -292 c98 -52 151 -167
127 -275 -31 -139 -168 -228 -303 -197 -196 44 -268 281 -130 424 86 89 197
107 306 48z"/>
<path d="M1621 1387 c-6 -15 -27 -52 -46 -82 -19 -31 -35 -61 -35 -68 0 -6
178 -190 396 -409 391 -391 397 -397 390 -430 -8 -43 -48 -78 -89 -78 -28 0
-73 41 -424 392 l-393 392 -27 -22 c-72 -57 -153 -108 -230 -144 l-85 -40 4
-80 c3 -73 6 -82 31 -104 26 -22 36 -24 148 -24 l119 0 0 -119 c0 -104 2 -121
20 -144 20 -26 25 -26 148 -29 l127 -3 3 -127 c3 -123 3 -128 29 -148 23 -18
40 -20 146 -20 l120 0 37 -34 c30 -27 50 -36 95 -41 73 -10 259 0 309 15 50
15 91 56 106 106 15 50 25 236 15 311 l-7 58 -448 450 c-443 443 -449 449
-459 422z"/>
</g>
</svg>
