<?xml version="1.0" standalone="no"?>
<!DOCTYPE svg PUBLIC "-//W3C//DTD SVG 20010904//EN"
 "http://www.w3.org/TR/2001/REC-SVG-20010904/DTD/svg10.dtd">
<svg version="1.0" xmlns="http://www.w3.org/2000/svg"
 width="256.000000pt" height="256.000000pt" viewBox="0 0 256.000000 256.000000"
 preserveAspectRatio="xMidYMid meet">

<g transform="translate(0.000000,256.000000) scale(0.100000,-0.100000)"
fill="#000000" stroke="none">
<path d="M1192 2149 c-34 -10 -41 -22 -61 -96 -7 -24 -22 -54 -34 -68 -25 -28
-178 -95 -217 -95 -14 0 -47 14 -75 30 -73 43 -91 40 -156 -27 -31 -32 -59
-66 -62 -75 -3 -10 9 -45 28 -83 19 -37 35 -76 35 -89 0 -31 -67 -187 -92
-213 -12 -13 -37 -26 -57 -29 -48 -9 -88 -30 -101 -53 -5 -11 -10 -52 -10 -91
0 -61 3 -74 23 -94 13 -12 41 -26 63 -29 73 -12 102 -42 146 -147 43 -105 44
-126 3 -185 -15 -23 -25 -52 -25 -73 0 -30 9 -43 57 -88 67 -62 82 -67 120
-46 70 38 104 52 123 52 29 0 191 -68 213 -89 10 -10 24 -42 32 -72 21 -78 48
-99 133 -99 93 0 112 12 132 85 9 33 23 70 30 82 15 23 192 103 227 103 10 0
41 -14 68 -30 77 -45 101 -41 168 29 32 34 57 69 57 80 0 12 -14 46 -31 77
-39 67 -37 106 11 211 29 65 36 73 78 91 26 11 62 23 80 27 18 4 37 15 42 25
15 27 13 193 -2 212 -7 9 -36 21 -64 27 -87 21 -105 37 -146 140 -45 109 -46
134 -12 184 14 21 28 54 31 73 5 32 1 39 -54 94 -69 69 -92 74 -152 34 -64
-42 -102 -41 -210 1 -97 40 -131 71 -131 123 0 35 -28 82 -56 92 -31 12 -108
11 -152 -1z m208 -585 c68 -31 124 -84 158 -149 23 -43 27 -62 27 -140 0 -106
-20 -158 -88 -225 -68 -69 -128 -92 -235 -91 -119 1 -219 66 -274 179 -27 55
-32 77 -32 137 0 131 79 248 201 295 73 29 174 26 243 -6z"/>
</g>
</svg>
