<?xml version="1.0" encoding="utf-8"?>
<!-- Generator: Adobe Illustrator 21.1.0, SVG Export Plug-In . SVG Version: 6.00 Build 0)  -->
<svg version="1.1" id="Layer_1" xmlns="http://www.w3.org/2000/svg" xmlns:xlink="http://www.w3.org/1999/xlink" x="0px" y="0px"
	 viewBox="0 0 62.5 77.4" style="enable-background:new 0 0 62.5 77.4;" xml:space="preserve">
<polygon points="7.4,2.4 55,2.4 55,44.9 57.4,44.9 57.4,0 5,0 5,44.9 7.4,44.9 "/>
<rect x="18.7" y="12.5" width="25" height="2.3"/>
<rect x="18.7" y="25" width="25" height="2.3"/>
<rect x="18.7" y="37.5" width="25" height="2.3"/>
<path d="M47.3,75c-0.1-1.1-0.5-2.7-1.3-4.3c-1.3-2.6-4-5.6-9.8-5.6h-10c-5.8,0-8.5,3.1-9.8,5.6c-0.8,1.6-1.2,3.3-1.3,4.3H2.4
	c0-5,0.3-10.5,3.5-14.8c4.1-5.3,12.4-7.9,25.3-7.9s21.2,2.6,25.3,7.9C59.7,64.4,60,69.9,60,75H47.3z M31.2,50C0,50,0,65.1,0,76.2
	v1.2h17.4v-1.2c0,0,0-2.2,1.1-4.5c1.4-2.9,4.1-4.3,7.7-4.3h10c8.7,0,8.9,8.4,8.9,8.8v1.2h17.4v-1.2C62.5,65.2,62.4,50,31.2,50
	L31.2,50z"/>
</svg>
