<?xml version="1.0" encoding="UTF-8" standalone="no"?> <svg xmlns="http://www.w3.org/2000/svg" xmlns:xlink="http://www.w3.org/1999/xlink" width="7448pt" height="1012pt" viewBox="0.00 0.00 7448 1012">
<g id="graph0" class="graph" transform="translate(4, 1008)">
<title>%0</title>
<polygon fill="#ffffff" stroke="transparent" points="-4,4 -4,-1008 7444,-1008 7444,4 -4,4"></polygon>
<g id="clust1" class="cluster">
<title>cluster</title>
<polygon fill="#234178" fill-opacity="0.184314" stroke="#000000" points="8,-8 8,-996 7432,-996 7432,-8 8,-8"></polygon>
<text text-anchor="middle" x="3720" y="-979.4" font-family="Times,serif" font-size="14.00" fill="#000000">Global</text>
</g>
<g id="clust2" class="cluster">
<title>cluster_1</title>
<polygon fill="#234178" fill-opacity="0.184314" stroke="#000000" points="5034,-828.4 5034,-919.2 5104,-919.2 5104,-828.4 5034,-828.4"></polygon>
<text text-anchor="middle" x="5069" y="-902.6" font-family="Times,serif" font-size="14.00" fill="#000000">System</text>
</g>
<g id="clust3" class="cluster">
<title>cluster_2</title>
<polygon fill="#234178" fill-opacity="0.184314" stroke="#000000" points="2521,-828.4 2521,-919.2 2591,-919.2 2591,-828.4 2521,-828.4"></polygon>
<text text-anchor="middle" x="2556" y="-902.6" font-family="Times,serif" font-size="14.00" fill="#000000">System</text>
</g>
<g id="clust4" class="cluster">
<title>cluster_3</title>
<polygon fill="#234178" fill-opacity="0.184314" stroke="#000000" points="3587,-665.6 3587,-756.4 3657,-756.4 3657,-665.6 3587,-665.6"></polygon>
<text text-anchor="middle" x="3622" y="-739.8" font-family="Times,serif" font-size="14.00" fill="#000000">System</text>
</g>
<g id="clust5" class="cluster">
<title>cluster_4</title>
<polygon fill="#234178" fill-opacity="0.184314" stroke="#000000" points="3669,-16 3669,-749.4 4178,-749.4 4178,-16 3669,-16"></polygon>
<text text-anchor="middle" x="3923.5" y="-732.8" font-family="Times,serif" font-size="14.00" fill="#000000">CellType[ct1]</text>
</g>
<g id="clust6" class="cluster">
<title>cluster_cpm4</title>
<polygon fill="#234178" fill-opacity="0.184314" stroke="#000000" points="3677,-88 3677,-164.8 4170,-164.8 4170,-88 3677,-88"></polygon>
<text text-anchor="middle" x="3923.5" y="-148.2" font-family="Times,serif" font-size="14.00" fill="#000000">CPM plugins</text>
</g>
<g id="clust8" class="cluster">
<title>cluster_8</title>
<polygon fill="#234178" fill-opacity="0.184314" stroke="#000000" points="4072,-236.8 4072,-327.6 4142,-327.6 4142,-236.8 4072,-236.8"></polygon>
<text text-anchor="middle" x="4107" y="-311" font-family="Times,serif" font-size="14.00" fill="#000000">System</text>
</g>
<g id="clust9" class="cluster">
<title>cluster_5</title>
<polygon fill="#234178" fill-opacity="0.184314" stroke="#000000" points="2700,-16 2700,-749.4 3209,-749.4 3209,-16 2700,-16"></polygon>
<text text-anchor="middle" x="2954.5" y="-732.8" font-family="Times,serif" font-size="14.00" fill="#000000">CellType[ct2]</text>
</g>
<g id="clust10" class="cluster">
<title>cluster_cpm5</title>
<polygon fill="#234178" fill-opacity="0.184314" stroke="#000000" points="2708,-88 2708,-164.8 3201,-164.8 3201,-88 2708,-88"></polygon>
<text text-anchor="middle" x="2954.5" y="-148.2" font-family="Times,serif" font-size="14.00" fill="#000000">CPM plugins</text>
</g>
<g id="clust13" class="cluster">
<title>cluster_6</title>
<polygon fill="#234178" fill-opacity="0.184314" stroke="#000000" points="3217,-672.6 3217,-749.4 3340,-749.4 3340,-672.6 3217,-672.6"></polygon>
<text text-anchor="middle" x="3278.5" y="-732.8" font-family="Times,serif" font-size="14.00" fill="#000000">CellType[medium]</text>
</g><g id="clust12" class="cluster">
<title style="">cluster_10</title>
<polygon fill="#234178" fill-opacity="0.184314" stroke="#000000" points="2744,-236.8 2744,-327.6 2814,-327.6 2814,-236.8 2744,-236.8" style=""></polygon>
<text text-anchor="middle" x="2779" y="-311" font-family="Times,serif" font-size="14.00" fill="#000000" style="">System</text>
</g>
<!-- CPM_0_0_03 -->
<g id="node1" class="node">
<title>CPM_0_0_03</title>
<g id="a_node1">">
<polygon fill="#fffea3" stroke="transparent" points="3466.5,-551.6 3411.5,-551.6 3411.5,-493.6 3466.5,-493.6 3466.5,-551.6"></polygon>
<text text-anchor="start" x="3423.6623" y="-530.1" font-family="times" font-size="15.00" fill="#000000">CPM</text>
<text text-anchor="start" x="3426.375" y="-506.1" font-family="times" font-size="15.00" fill="#000000">0.03</text>
<polygon fill="#000000" stroke="#000000" points="3420,-522.6 3420,-522.6 3459,-522.6 3459,-522.6 3420,-522.6"></polygon>
<polygon fill="none" stroke="#000000" points="3419.5,-497.6 3419.5,-547.6 3458.5,-547.6 3458.5,-497.6 3419.5,-497.6"></polygon>
</g>
</g>
<!-- cell_center_0 -->

<!-- CPM_0_0_03&#45;&gt;cell_center_0 -->

<!-- cell_type_0 -->

<!-- CPM_0_0_03&#45;&gt;cell_type_0 -->

<!-- VolumeConstraint_4 --><g id="edge3" class="edge">
<title style="">CPM_0_0_03-&gt;cell_center_4</title>
<path fill="none" stroke="#8f100d" stroke-width="3" d="M3460.4642,-551.725C3467.4084,-558.9343 3475.7382,-565.7052 3485,-569.6 3542.357,-593.7201 3705.5382,-587.9276 3765,-569.6 3780.5306,-564.8131 3795.6933,-555.2032 3807.8311,-545.9135"></path>
<polygon fill="#8f100d" stroke="#8f100d" stroke-width="3" points="3810.101,-548.5797 3815.7182,-539.5965 3805.725,-543.116 3810.101,-548.5797"></polygon>
</g>
<g id="node62" class="node">
<title>VolumeConstraint_4</title>
<g id="a_node62">">
<polygon fill="#fffea3" stroke="transparent" points="4028,-132 3910,-132 3910,-96 4028,-96 4028,-132"></polygon>
<text text-anchor="start" x="3913.5908" y="-109.5" font-family="times" font-size="15.00" fill="#000000">VolumeConstraint</text>
<polygon fill="none" stroke="#000000" points="3910,-101 3910,-127 4028,-127 4028,-101 3910,-101"></polygon>
</g>
</g>
<!-- CPM_0_0_03&#45;&gt;VolumeConstraint_4 -->
<g id="edge1" class="edge">
<title>CPM_0_0_03-&gt;VolumeConstraint_4</title>
<path fill="none" stroke="#38568c" stroke-dasharray="5,2" d="M3466.6173,-498.2457C3513.5888,-456.2956 3604,-373.0263 3604,-353.6 3604,-353.6 3604,-353.6 3604,-269.8 3604,-218.8728 3620.8463,-198.1778 3665,-172.8 3687.7476,-159.7256 3876.2451,-173.4941 3901,-164.8"></path>
</g>
<!-- VolumeConstraint_5 --><g id="edge5" class="edge">
<title style="">CPM_0_0_03-&gt;cell_type_4</title>
<path fill="none" stroke="#8f100d" stroke-width="3" d="M3460.4642,-551.725C3467.4084,-558.9343 3475.7382,-565.7052 3485,-569.6 3521.6675,-585.0196 3626.563,-583.0441 3664,-569.6 3676.954,-564.948 3689.0637,-555.9374 3698.7606,-547.0397"></path>
<polygon fill="#8f100d" stroke="#8f100d" stroke-width="3" points="3701.2582,-549.493 3705.9901,-540.0135 3696.3796,-544.4731 3701.2582,-549.493"></polygon>
</g>
<g id="node80" class="node">
<title>VolumeConstraint_5</title>
<g id="a_node80">">
<polygon fill="#fffea3" stroke="transparent" points="2834,-132 2716,-132 2716,-96 2834,-96 2834,-132"></polygon>
<text text-anchor="start" x="2719.5908" y="-109.5" font-family="times" font-size="15.00" fill="#000000">VolumeConstraint</text>
<polygon fill="none" stroke="#000000" points="2716,-101 2716,-127 2834,-127 2834,-101 2716,-101"></polygon>
</g>
</g>
<!-- CPM_0_0_03&#45;&gt;VolumeConstraint_5 -->
<g id="edge2" class="edge">
<title>CPM_0_0_03-&gt;VolumeConstraint_5</title>
<path fill="none" stroke="#38568c" stroke-dasharray="5,2" d="M3411.1136,-514.6374C3353.9895,-496.4285 3229,-446.0262 3229,-353.6 3229,-353.6 3229,-353.6 3229,-269.8 3229,-226.1063 3246.008,-201.4288 3213,-172.8 3197.4679,-159.3285 2862.4402,-171.4939 2843,-164.8"></path>
</g>
<!-- Gnuplotter_0_1 -->

<!-- Logger_0_1 -->

<!-- U_0 --><g id="edge4" class="edge">
<title style="">CPM_0_0_03-&gt;cell_center_5</title>
<path fill="none" stroke="#8f100d" stroke-width="3" d="M3411.3215,-534.5754C3354.3008,-557.524 3220.1053,-602.6124 3113,-569.6 3097.4694,-564.8131 3082.3067,-555.2032 3070.1689,-545.9135"></path>
<polygon fill="#8f100d" stroke="#8f100d" stroke-width="3" points="3072.275,-543.116 3062.2818,-539.5965 3067.899,-548.5797 3072.275,-543.116"></polygon>
</g>
<g id="node2" class="node">
<title>U_0</title>
<g id="a_node2">
<ellipse fill="#d3d247" stroke="#000000" cx="3549" cy="-190.8" rx="27" ry="18"></ellipse>
<text text-anchor="middle" x="3549" y="-186.6" font-family="Times,serif" font-size="14.00" fill="#000000">U</text>
</g>
</g>
<!-- Chemotaxis_4 -->
<g id="node64" class="node">
<title>Chemotaxis_4</title>
<g id="a_node64">">
<polygon fill="#fffea3" stroke="transparent" points="3763.5,-132 3684.5,-132 3684.5,-96 3763.5,-96 3763.5,-132"></polygon>
<text text-anchor="start" x="3688.6703" y="-109.5" font-family="times" font-size="15.00" fill="#000000">Chemotaxis</text>
<polygon fill="none" stroke="#000000" points="3684.5,-101 3684.5,-127 3763.5,-127 3763.5,-101 3684.5,-101"></polygon>
</g>
</g>
<!-- U_0&#45;&gt;Chemotaxis_4 --><g id="edge6" class="edge">
<title style="">CPM_0_0_03-&gt;cell_type_5</title>
<path fill="none" stroke="#8f100d" stroke-width="3" d="M3411.1167,-522.6C3344.5175,-522.6 3277.9183,-522.6 3211.3191,-522.6"></path>
<polygon fill="#8f100d" stroke="#8f100d" stroke-width="3" points="3211.0625,-519.1001 3201.0625,-522.6 3211.0625,-526.1001 3211.0625,-519.1001"></polygon>
</g>
<g id="edge37" class="edge">
<title>U_0-&gt;Chemotaxis_4</title>
<path fill="none" stroke="#112c5f" stroke-width="2" d="M3571.8782,-180.7597C3597.9615,-169.3129 3641.3546,-150.2695 3675.135,-135.4448"></path>
<polygon fill="#112c5f" stroke="#112c5f" stroke-width="2" points="3676.635,-138.6087 3684.3855,-131.3851 3673.8219,-132.1988 3676.635,-138.6087"></polygon>
</g>
<!-- Chemotaxis_5 -->
<g id="node82" class="node">
<title>Chemotaxis_5</title>
<g id="a_node82">">
<polygon fill="#fffea3" stroke="transparent" points="3193.5,-132 3114.5,-132 3114.5,-96 3193.5,-96 3193.5,-132"></polygon>
<text text-anchor="start" x="3118.6703" y="-109.5" font-family="times" font-size="15.00" fill="#000000">Chemotaxis</text>
<polygon fill="none" stroke="#000000" points="3114.5,-101 3114.5,-127 3193.5,-127 3193.5,-101 3114.5,-101"></polygon>
</g>
</g>
<!-- U_0&#45;&gt;Chemotaxis_5 -->
<g id="edge38" class="edge">
<title>U_0-&gt;Chemotaxis_5</title>
<path fill="none" stroke="#112c5f" stroke-width="2" d="M3525.3044,-182.0404C3515.9558,-178.812 3505.0632,-175.3294 3495,-172.8 3392.8256,-147.1181 3270.6161,-129.029 3203.768,-120.1818"></path>
<polygon fill="#112c5f" stroke="#112c5f" stroke-width="2" points="3203.8958,-116.6688 3193.5262,-118.8415 3202.9874,-123.6096 3203.8958,-116.6688"></polygon>
</g>
<!-- adhesion_init_ct1_0 -->
<g id="node3" class="node">
<title>adhesion_init_ct1_0</title>
<g id="a_node3">
<ellipse fill="#d3d247" stroke="#000000" cx="5830" cy="-945.2" rx="79.8972" ry="18"></ellipse>
<text text-anchor="middle" x="5830" y="-941" font-family="Times,serif" font-size="14.00" fill="#000000">adhesion_init_ct1</text>
</g>
</g>
<!-- System_11616943532684386609 -->

<!-- adhesion_init_ct1_0&#45;&gt;System_11616943532684386609 -->

<!-- adhesion_init_ct2_0 -->
<g id="node4" class="node">
<title>adhesion_init_ct2_0</title>
<g id="a_node4">
<ellipse fill="#d3d247" stroke="#000000" cx="3128" cy="-945.2" rx="79.8972" ry="18"></ellipse>
<text text-anchor="middle" x="3128" y="-941" font-family="Times,serif" font-size="14.00" fill="#000000">adhesion_init_ct2</text>
</g>
</g>
<!-- System_18076252045494180204 --><g id="node56" class="node">
<title style="">System_1_0_1</title>
<g id="a_node56">" style="">
<polygon fill="#fffea3" stroke="transparent" points="5096,-886.4 5042,-886.4 5042,-836.4 5096,-836.4 5096,-886.4" style=""></polygon>
<text text-anchor="start" x="5046.9163" y="-868.9" font-family="times" font-size="15.00" fill="#000000" style="">System</text>
<text text-anchor="start" x="5059.625" y="-844.9" font-family="times" font-size="15.00" fill="#000000" style="">0.1</text>
<polygon fill="#000000" stroke="#000000" points="5043,-861.4 5043,-861.4 5095,-861.4 5095,-861.4 5043,-861.4" style=""></polygon>
<polygon fill="none" stroke="#000000" points="5043,-836.4 5043,-886.4 5095,-886.4 5095,-836.4 5043,-836.4" style=""></polygon>
</g>
</g>

<!-- adhesion_init_ct2_0&#45;&gt;System_18076252045494180204 --><g id="edge39" class="edge">
<title style="">adhesion_init_ct1_0-&gt;System_1_0_1</title>
<path fill="none" stroke="#112c5f" stroke-width="2" d="M5772.2226,-932.6251C5761.8593,-930.6239 5751.1339,-928.7169 5741,-927.2 5500.2634,-891.1657 5207.929,-870.2962 5106.0941,-863.6986"></path>
<polygon fill="#112c5f" stroke="#112c5f" stroke-width="2" points="5106.2126,-860.1991 5096.009,-863.0517 5105.7644,-867.1847 5106.2126,-860.1991"></polygon>
</g>

<!-- burn_in_time_0 -->
<g id="node5" class="node">
<title>burn_in_time_0</title>
<g id="a_node5">
<ellipse fill="#d3d247" stroke="#000000" cx="3895" cy="-945.2" rx="63.1441" ry="18"></ellipse>
<text text-anchor="middle" x="3895" y="-941" font-family="Times,serif" font-size="14.00" fill="#000000">burn_in_time</text>
</g>
</g>
<!-- burn_in_time_0&#45;&gt;System_11616943532684386609 --><g id="node57" class="node">
<title style="">System_2_0_1</title>
<g id="a_node57">" style="">
<polygon fill="#fffea3" stroke="transparent" points="2583,-886.4 2529,-886.4 2529,-836.4 2583,-836.4 2583,-886.4" style=""></polygon>
<text text-anchor="start" x="2533.9163" y="-868.9" font-family="times" font-size="15.00" fill="#000000" style="">System</text>
<text text-anchor="start" x="2546.625" y="-844.9" font-family="times" font-size="15.00" fill="#000000" style="">0.1</text>
<polygon fill="#000000" stroke="#000000" points="2530,-861.4 2530,-861.4 2582,-861.4 2582,-861.4 2530,-861.4" style=""></polygon>
<polygon fill="none" stroke="#000000" points="2530,-836.4 2530,-886.4 2582,-886.4 2582,-836.4 2530,-836.4" style=""></polygon>
</g>
</g>

<!-- burn_in_time_0&#45;&gt;System_18076252045494180204 --><g id="edge40" class="edge">
<title style="">adhesion_init_ct2_0-&gt;System_2_0_1</title>
<path fill="none" stroke="#112c5f" stroke-width="2" d="M3069.6934,-932.8505C3059.4844,-930.8477 3048.9479,-928.8818 3039,-927.2 2873.492,-899.2191 2674.5097,-875.0974 2593.2766,-865.6515"></path>
<polygon fill="#112c5f" stroke="#112c5f" stroke-width="2" points="2593.397,-862.1421 2583.0608,-864.4689 2592.592,-869.0957 2593.397,-862.1421"></polygon>
</g>

<!-- c_0 -->

<!-- c_0&#45;&gt;Gnuplotter_0_1 --><g id="edge41" class="edge">
<title style="">burn_in_time_0-&gt;System_1_0_1</title>
<path fill="none" stroke="#112c5f" stroke-width="2" d="M3940.0612,-932.5772C3948.9314,-930.4783 3958.2125,-928.5489 3967,-927.2 4179.1243,-894.6394 4863.4393,-868.6921 5031.4752,-862.7049"></path>
<polygon fill="#112c5f" stroke="#112c5f" stroke-width="2" points="5031.6946,-866.1995 5041.5644,-862.3474 5031.4467,-859.2039 5031.6946,-866.1995"></polygon>
</g>

<!-- cadherin_0 --><g id="edge42" class="edge">
<title style="">burn_in_time_0-&gt;System_2_0_1</title>
<path fill="none" stroke="#112c5f" stroke-width="2" d="M3849.9471,-932.5227C3841.0762,-930.4285 3831.7927,-928.5148 3823,-927.2 3576.5763,-890.3516 2776.1401,-867.2415 2593.3879,-862.3668"></path>
<polygon fill="#112c5f" stroke="#112c5f" stroke-width="2" points="2593.3003,-858.8634 2583.2111,-862.0973 2593.1149,-865.8609 2593.3003,-858.8634"></polygon>
</g>
<g id="node6" class="node">
<title>cadherin_0</title>
<ellipse fill="#d3d247" stroke="#000000" cx="3265" cy="-612.6" rx="44.0802" ry="18"></ellipse>
<ellipse fill="none" stroke="#000000" cx="3265" cy="-612.6" rx="48.0621" ry="22"></ellipse>
<text text-anchor="middle" x="3265" y="-608.4" font-family="Times,serif" font-size="14.00" fill="#000000">cadherin</text>
</g>
<!-- cadherin_0&#45;&gt;CPM_0_0_03 -->
<g id="edge43" class="edge">
<title>cadherin_0-&gt;CPM_0_0_03</title>
<path fill="none" stroke="#112c5f" stroke-width="2" d="M3297.3203,-595.8826C3327.0685,-580.4956 3371.1605,-557.6894 3402.2395,-541.614"></path>
<polygon fill="#112c5f" stroke="#112c5f" stroke-width="2" points="3404.1625,-544.5599 3411.4367,-536.8569 3400.9465,-538.3424 3404.1625,-544.5599"></polygon>
</g>
<!-- NeighborhoodReporter_4_1 -->
<g id="node61" class="node">
<title>NeighborhoodReporter_4_1</title>
<g id="a_node61">">
<polygon fill="#fffea3" stroke="transparent" points="3824.5,-457.6 3677.5,-457.6 3677.5,-407.6 3824.5,-407.6 3824.5,-457.6"></polygon>
<text text-anchor="start" x="3681.9375" y="-440.1" font-family="times" font-size="15.00" fill="#000000">NeighborhoodReporter</text>
<text text-anchor="start" x="3747.75" y="-416.1" font-family="times" font-size="15.00" fill="#000000">1</text>
<polygon fill="#000000" stroke="#000000" points="3678,-432.6 3678,-432.6 3825,-432.6 3825,-432.6 3678,-432.6"></polygon>
<polygon fill="none" stroke="#000000" points="3677.5,-407.6 3677.5,-457.6 3824.5,-457.6 3824.5,-407.6 3677.5,-407.6"></polygon>
</g>
</g>
<!-- cell_type_0&#45;&gt;NeighborhoodReporter_4_1 -->

<!-- NeighborhoodReporter_5_1 -->
<g id="node79" class="node">
<title>NeighborhoodReporter_5_1</title>
<g id="a_node79">">
<polygon fill="#fffea3" stroke="transparent" points="3200.5,-457.6 3053.5,-457.6 3053.5,-407.6 3200.5,-407.6 3200.5,-457.6"></polygon>
<text text-anchor="start" x="3057.9375" y="-440.1" font-family="times" font-size="15.00" fill="#000000">NeighborhoodReporter</text>
<text text-anchor="start" x="3123.75" y="-416.1" font-family="times" font-size="15.00" fill="#000000">1</text>
<polygon fill="#000000" stroke="#000000" points="3054,-432.6 3054,-432.6 3201,-432.6 3201,-432.6 3054,-432.6"></polygon>
<polygon fill="none" stroke="#000000" points="3053.5,-407.6 3053.5,-457.6 3200.5,-457.6 3200.5,-407.6 3053.5,-407.6"></polygon>
</g>
</g>
<!-- cell_type_0&#45;&gt;NeighborhoodReporter_5_1 -->

<!-- celltype_medium_id_0 -->
<g id="node7" class="node">
<title>celltype_medium_id_0</title>
<ellipse fill="#d3d247" stroke="#000000" cx="3571" cy="-522.6" rx="85.6937" ry="18"></ellipse>
<text text-anchor="middle" x="3571" y="-518.4" font-family="Times,serif" font-size="14.00" fill="#000000">celltype.medium.id</text>
</g>
<!-- celltype_medium_id_0&#45;&gt;NeighborhoodReporter_4_1 -->
<g id="edge55" class="edge">
<title>celltype_medium_id_0-&gt;NeighborhoodReporter_4_1</title>
<path fill="none" stroke="#112c5f" stroke-width="2" d="M3604.4348,-505.8826C3628.8378,-493.6811 3662.5713,-476.8144 3691.5241,-462.338"></path>
<polygon fill="#112c5f" stroke="#112c5f" stroke-width="2" points="3693.3594,-465.3335 3700.7385,-457.7308 3690.2289,-459.0725 3693.3594,-465.3335"></polygon>
</g>
<!-- celltype_medium_id_0&#45;&gt;NeighborhoodReporter_5_1 -->
<g id="edge56" class="edge">
<title>celltype_medium_id_0-&gt;NeighborhoodReporter_5_1</title>
<path fill="none" stroke="#112c5f" stroke-width="2" d="M3524.9269,-507.2865C3509.4855,-502.4895 3492.1009,-497.4491 3476,-493.6 3386.3378,-472.1652 3282.0374,-454.9201 3210.9725,-444.3061"></path>
<polygon fill="#112c5f" stroke="#112c5f" stroke-width="2" points="3211.1395,-440.7927 3200.7343,-442.7885 3210.113,-447.717 3211.1395,-440.7927"></polygon>
</g>
<!-- ct1_adhesion_0 --><g id="node58" class="node">
<title style="">System_3_0_1</title>
<g id="a_node58">" style="">
<polygon fill="#fffea3" stroke="transparent" points="3649,-723.6 3595,-723.6 3595,-673.6 3649,-673.6 3649,-723.6" style=""></polygon>
<text text-anchor="start" x="3599.9163" y="-706.1" font-family="times" font-size="15.00" fill="#000000" style="">System</text>
<text text-anchor="start" x="3612.625" y="-682.1" font-family="times" font-size="15.00" fill="#000000" style="">0.1</text>
<polygon fill="#000000" stroke="#000000" points="3596,-698.6 3596,-698.6 3648,-698.6 3648,-698.6 3596,-698.6" style=""></polygon>
<polygon fill="none" stroke="#000000" points="3596,-673.6 3596,-723.6 3648,-723.6 3648,-673.6 3596,-673.6" style=""></polygon>
</g>
</g>
<g id="node8" class="node">
<title>ct1_adhesion_0</title>
<g id="a_node8">
<ellipse fill="#d3d247" stroke="#000000" cx="3888" cy="-782.4" rx="61.9808" ry="18"></ellipse>
<text text-anchor="middle" x="3888" y="-778.2" font-family="Times,serif" font-size="14.00" fill="#000000">ct1_adhesion</text>
</g>
</g>
<!-- ct1_adhesion_0&#45;&gt;Logger_0_1 --><g id="edge57" class="edge">
<title style="">ct1_adhesion_0-&gt;System_3_0_1</title>
<path fill="none" stroke="#112c5f" stroke-width="2" d="M3826.1694,-780.6312C3769.8642,-778.0522 3691.5821,-771.7481 3665,-756.4 3655.0488,-750.6543 3646.7019,-741.5881 3640.0895,-732.3248"></path>
<polygon fill="#112c5f" stroke="#112c5f" stroke-width="2" points="3642.9321,-730.2776 3634.5083,-723.8519 3637.0864,-734.1283 3642.9321,-730.2776"></polygon>
</g>

<!-- System_6476179088226463468 -->

<!-- ct1_adhesion_0&#45;&gt;System_6476179088226463468 --><g id="edge58" class="edge">
<title style="">ct1_adhesion_weak_0-&gt;System_1_0_1</title>
<path fill="none" stroke="#112c5f" stroke-width="2" d="M5581.1572,-932.9123C5570.1159,-930.9134 5558.7372,-928.9327 5548,-927.2 5383.8328,-900.7072 5186.9012,-875.8134 5106.225,-865.9089"></path>
<polygon fill="#112c5f" stroke="#112c5f" stroke-width="2" points="5106.4261,-862.4074 5096.075,-864.6666 5105.5757,-869.3556 5106.4261,-862.4074"></polygon>
</g>

<!-- ct1_adhesion_weak_0 -->
<g id="node9" class="node">
<title>ct1_adhesion_weak_0</title>
<g id="a_node9">
<ellipse fill="#d3d247" stroke="#000000" cx="5645" cy="-945.2" rx="87.3847" ry="18"></ellipse>
<text text-anchor="middle" x="5645" y="-941" font-family="Times,serif" font-size="14.00" fill="#000000">ct1_adhesion_weak</text>
</g>
</g>
<!-- ct1_adhesion_weak_0&#45;&gt;System_11616943532684386609 -->

<!-- ct1_area_0 -->
<g id="node10" class="node">
<title>ct1_area_0</title>
<g id="a_node10">
<ellipse fill="#d3d247" stroke="#000000" cx="4301" cy="-782.4" rx="43.9789" ry="18"></ellipse>
<text text-anchor="middle" x="4301" y="-778.2" font-family="Times,serif" font-size="14.00" fill="#000000">ct1_area</text>
</g>
</g>
<!-- ct1_area_0&#45;&gt;Logger_0_1 --><g id="edge59" class="edge">
<title style="">ct1_area_edge_final_0-&gt;System_1_0_1</title>
<path fill="none" stroke="#112c5f" stroke-width="2" d="M5389.6294,-931.9216C5309.9605,-914.3987 5172.127,-884.0825 5106.2088,-869.584"></path>
<polygon fill="#112c5f" stroke="#112c5f" stroke-width="2" points="5106.7852,-866.1272 5096.2668,-867.3973 5105.2815,-872.9638 5106.7852,-866.1272"></polygon>
</g>

<!-- ct1_area_edge_0 -->
<g id="node11" class="node">
<title>ct1_area_edge_0</title>
<g id="a_node11">
<ellipse fill="#d3d247" stroke="#000000" cx="4430" cy="-782.4" rx="66.5959" ry="18"></ellipse>
<text text-anchor="middle" x="4430" y="-778.2" font-family="Times,serif" font-size="14.00" fill="#000000">ct1_area_edge</text>
</g>
</g>
<!-- ct1_area_edge_0&#45;&gt;Logger_0_1 --><g id="edge60" class="edge">
<title style="">ct1_area_edge_init_0-&gt;System_1_0_1</title>
<path fill="none" stroke="#112c5f" stroke-width="2" d="M5221.1102,-928.8436C5187.6712,-914.0172 5138.6695,-892.2905 5105.3875,-877.5337"></path>
<polygon fill="#112c5f" stroke="#112c5f" stroke-width="2" points="5106.5814,-874.2345 5096.021,-873.3807 5103.744,-880.6337 5106.5814,-874.2345"></polygon>
</g>

<!-- ct1_area_edge_final_0 -->
<g id="node12" class="node">
<title>ct1_area_edge_final_0</title>
<g id="a_node12">
<ellipse fill="#d3d247" stroke="#000000" cx="5450" cy="-945.2" rx="89.1472" ry="18"></ellipse>
<text text-anchor="middle" x="5450" y="-941" font-family="Times,serif" font-size="14.00" fill="#000000">ct1_area_edge_final</text>
</g>
</g>
<!-- ct1_area_edge_final_0&#45;&gt;System_11616943532684386609 --><g id="edge61" class="edge">
<title style="">ct1_area_final_0-&gt;System_1_0_1</title>
<path fill="none" stroke="#112c5f" stroke-width="2" d="M5084.6603,-927.0166C5082.5186,-918.0428 5079.8603,-906.9049 5077.3457,-896.3684"></path>
<polygon fill="#112c5f" stroke="#112c5f" stroke-width="2" points="5080.7261,-895.4553 5075.0002,-886.541 5073.9174,-897.0803 5080.7261,-895.4553"></polygon>
</g>

<!-- ct1_area_edge_init_0 -->
<g id="node13" class="node">
<title>ct1_area_edge_init_0</title>
<g id="a_node13">
<ellipse fill="#d3d247" stroke="#000000" cx="5258" cy="-945.2" rx="84.5112" ry="18"></ellipse>
<text text-anchor="middle" x="5258" y="-941" font-family="Times,serif" font-size="14.00" fill="#000000">ct1_area_edge_init</text>
</g>
</g>
<!-- ct1_area_edge_init_0&#45;&gt;System_11616943532684386609 --><g id="edge62" class="edge">
<title style="">ct1_area_init_0-&gt;System_1_0_1</title>
<path fill="none" stroke="#112c5f" stroke-width="2" d="M4967.8935,-928.6438C4986.6778,-916.1508 5012.7018,-898.8427 5033.6431,-884.9152"></path>
<polygon fill="#112c5f" stroke="#112c5f" stroke-width="2" points="5035.5887,-887.8246 5041.9771,-879.3724 5031.7122,-881.996 5035.5887,-887.8246"></polygon>
</g>

<!-- ct1_area_final_0 -->
<g id="node14" class="node">
<title>ct1_area_final_0</title>
<g id="a_node14">
<ellipse fill="#d3d247" stroke="#000000" cx="5089" cy="-945.2" rx="66.03" ry="18"></ellipse>
<text text-anchor="middle" x="5089" y="-941" font-family="Times,serif" font-size="14.00" fill="#000000">ct1_area_final</text>
</g>
</g>
<!-- ct1_area_final_0&#45;&gt;System_11616943532684386609 -->

<!-- ct1_area_init_0 -->
<g id="node15" class="node">
<title>ct1_area_init_0</title>
<g id="a_node15">
<ellipse fill="#d3d247" stroke="#000000" cx="4943" cy="-945.2" rx="61.3935" ry="18"></ellipse>
<text text-anchor="middle" x="4943" y="-941" font-family="Times,serif" font-size="14.00" fill="#000000">ct1_area_init</text>
</g>
</g>
<!-- ct1_area_init_0&#45;&gt;System_11616943532684386609 -->

<!-- ct1_ct2_0 --><g id="edge64" class="edge">
<title style="">ct1_generation_time_final_0-&gt;System_1_0_1</title>
<path fill="none" stroke="#112c5f" stroke-width="2" d="M4809.6967,-929.7321C4874.606,-912.6271 4977.2099,-885.5887 5031.8595,-871.1873"></path>
<polygon fill="#112c5f" stroke="#112c5f" stroke-width="2" points="5033.0274,-874.4991 5041.8054,-868.5664 5031.2436,-867.7302 5033.0274,-874.4991"></polygon>
</g>
<g id="node16" class="node">
<title>ct1_ct2_0</title>
<g id="a_node16">
<ellipse fill="#d3d247" stroke="#000000" cx="3622" cy="-612.6" rx="39.4254" ry="18"></ellipse>
<text text-anchor="middle" x="3622" y="-608.4" font-family="Times,serif" font-size="14.00" fill="#000000">ct1_ct2</text>
</g>
</g>
<!-- ct1_ct2_0&#45;&gt;CPM_0_0_03 -->
<g id="edge63" class="edge">
<title>ct1_ct2_0-&gt;CPM_0_0_03</title>
<path fill="none" stroke="#112c5f" stroke-width="2" d="M3596.3321,-598.7951C3588.8905,-594.9871 3580.6956,-590.9775 3573,-587.6 3530.8926,-569.1194 3516.131,-574.0516 3476,-551.6 3475.7062,-551.4356 3475.4122,-551.269 3475.1182,-551.1003"></path>
<polygon fill="#112c5f" stroke="#112c5f" stroke-width="2" points="3476.9659,-548.1276 3466.6489,-545.7172 3473.211,-554.0352 3476.9659,-548.1276"></polygon>
</g>
<!-- ct1_generation_time_0 --><g id="edge65" class="edge">
<title style="">ct1_generation_time_init_0-&gt;System_1_0_1</title>
<path fill="none" stroke="#112c5f" stroke-width="2" d="M4591.2925,-932.955C4603.9049,-931.0206 4616.8086,-929.0494 4629,-927.2 4778.3329,-904.5469 4956.265,-878.1074 5031.9671,-866.8844"></path>
<polygon fill="#112c5f" stroke="#112c5f" stroke-width="2" points="5032.5782,-870.3322 5041.9569,-865.4038 5031.5518,-863.4078 5032.5782,-870.3322"></polygon>
</g>
<g id="node17" class="node">
<title>ct1_generation_time_0</title>
<g id="a_node17">
<ellipse fill="#d3d247" stroke="#000000" cx="4605" cy="-782.4" rx="90.3294" ry="18"></ellipse>
<text text-anchor="middle" x="4605" y="-778.2" font-family="Times,serif" font-size="14.00" fill="#000000">ct1_generation_time</text>
</g>
</g>
<!-- ct1_generation_time_final_0 -->
<g id="node18" class="node">
<title>ct1_generation_time_final_0</title>
<g id="a_node18">
<ellipse fill="#d3d247" stroke="#000000" cx="4751" cy="-945.2" rx="112.8809" ry="18"></ellipse>
<text text-anchor="middle" x="4751" y="-941" font-family="Times,serif" font-size="14.00" fill="#000000">ct1_generation_time_final</text>
</g>
</g>
<!-- ct1_generation_time_final_0&#45;&gt;System_11616943532684386609 --><g id="edge66" class="edge">
<title style="">ct1_hill_n_0-&gt;System_1_0_1</title>
<path fill="none" stroke="#112c5f" stroke-width="2" d="M4372.5356,-932.8218C4379.9056,-930.6749 4387.6482,-928.6652 4395,-927.2 4634.4276,-879.4836 4928.8925,-865.8836 5031.5787,-862.4485"></path>
<polygon fill="#112c5f" stroke="#112c5f" stroke-width="2" points="5031.8671,-865.9412 5041.7492,-862.121 5031.6417,-858.9448 5031.8671,-865.9412"></polygon>
</g>

<!-- ct1_generation_time_init_0 -->
<g id="node19" class="node">
<title>ct1_generation_time_init_0</title>
<g id="a_node19">
<ellipse fill="#d3d247" stroke="#000000" cx="4512" cy="-945.2" rx="108.2453" ry="18"></ellipse>
<text text-anchor="middle" x="4512" y="-941" font-family="Times,serif" font-size="14.00" fill="#000000">ct1_generation_time_init</text>
</g>
</g>
<!-- ct1_generation_time_init_0&#45;&gt;System_11616943532684386609 --><g id="edge67" class="edge">
<title style="">ct1_k_half_hours_0-&gt;System_1_0_1</title>
<path fill="none" stroke="#112c5f" stroke-width="2" d="M3791.1257,-932.4218C3801.6698,-930.3909 3812.6364,-928.526 3823,-927.2 4065.8,-896.1331 4850.9731,-868.6374 5031.6753,-862.6193"></path>
<polygon fill="#112c5f" stroke="#112c5f" stroke-width="2" points="5031.8671,-866.115 5041.7455,-862.2854 5031.635,-859.1188 5031.8671,-866.115"></polygon>
</g>

<!-- ct1_hill_n_0 --><g id="edge68" class="edge">
<title style="">ct1_k_half_hours_0-&gt;System_2_0_1</title>
<path fill="none" stroke="#112c5f" stroke-width="2" d="M3679.0422,-932.3881C3668.7618,-930.3868 3658.0912,-928.5409 3648,-927.2 3236.9778,-872.5856 2732.836,-863.2673 2593.3078,-861.7074"></path>
<polygon fill="#112c5f" stroke="#112c5f" stroke-width="2" points="2593.1896,-858.206 2583.1533,-861.6006 2593.1159,-865.2057 2593.1896,-858.206"></polygon>
</g>
<g id="node20" class="node">
<title>ct1_hill_n_0</title>
<g id="a_node20">
<ellipse fill="#d3d247" stroke="#000000" cx="4336" cy="-945.2" rx="50.4013" ry="18"></ellipse>
<text text-anchor="middle" x="4336" y="-941" font-family="Times,serif" font-size="14.00" fill="#000000">ct1_hill_n</text>
</g>
</g>
<!-- ct1_hill_n_0&#45;&gt;System_11616943532684386609 -->

<!-- ct1_k_half_hours_0 --><g id="node76" class="node">
<title style="">System_8_1</title>
<g id="a_node76">" style="">
<polygon fill="#fffea3" stroke="transparent" points="4134,-294.8 4080,-294.8 4080,-244.8 4134,-244.8 4134,-294.8" style=""></polygon>
<text text-anchor="start" x="4084.9163" y="-277.3" font-family="times" font-size="15.00" fill="#000000" style="">System</text>
<text text-anchor="start" x="4103.25" y="-253.3" font-family="times" font-size="15.00" fill="#000000" style="">1</text>
<polygon fill="#000000" stroke="#000000" points="4081,-269.8 4081,-269.8 4133,-269.8 4133,-269.8 4081,-269.8" style=""></polygon>
<polygon fill="none" stroke="#000000" points="4081,-244.8 4081,-294.8 4133,-294.8 4133,-244.8 4081,-244.8" style=""></polygon>
</g>
</g>
<g id="node21" class="node">
<title>ct1_k_half_hours_0</title>
<g id="a_node21">
<ellipse fill="#d3d247" stroke="#000000" cx="3735" cy="-945.2" rx="78.7376" ry="18"></ellipse>
<text text-anchor="middle" x="3735" y="-941" font-family="Times,serif" font-size="14.00" fill="#000000">ct1_k_half_hours</text>
</g>
</g>
<!-- ct1_k_half_hours_0&#45;&gt;System_11616943532684386609 --><g id="edge69" class="edge">
<title style="">ct1_membraneElasticity_0-&gt;System_8_1</title>
<path fill="none" stroke="#112c5f" stroke-width="2" d="M4769.3346,-766.4292C4683.2248,-736.6837 4513,-670.5528 4513,-612.6 4513,-612.6 4513,-612.6 4513,-432.6 4513,-283.5619 4337.4372,-368.1634 4192,-335.6 4168.3242,-330.299 4157.8474,-341.5544 4138,-327.6 4129.773,-321.8157 4123.5328,-313.1429 4118.8878,-304.2631"></path>
<polygon fill="#112c5f" stroke="#112c5f" stroke-width="2" points="4121.9944,-302.6427 4114.6083,-295.047 4115.6455,-305.5909 4121.9944,-302.6427"></polygon>
</g>

<!-- ct1_k_half_hours_0&#45;&gt;System_18076252045494180204 -->

<!-- ct1_membraneElasticity_0 --><g id="edge70" class="edge">
<title style="">ct1_membraneElasticity_edge_0-&gt;System_8_1</title>
<path fill="none" stroke="#112c5f" stroke-width="2" d="M5046.0044,-764.5151C5012.4445,-736.2056 4954,-677.577 4954,-612.6 4954,-612.6 4954,-612.6 4954,-432.6 4954,-295.9997 4482.9401,-349.0144 4347,-335.6 4323.8731,-333.3179 4157.7095,-339.9125 4138,-327.6 4129.2359,-322.1251 4122.7899,-313.2684 4118.1197,-304.1155"></path>
<polygon fill="#112c5f" stroke="#112c5f" stroke-width="2" points="4121.3074,-302.6701 4114.0214,-294.9783 4114.9204,-305.5349 4121.3074,-302.6701"></polygon>
</g>
<g id="node22" class="node">
<title>ct1_membraneElasticity_0</title>
<g id="a_node22">
<ellipse fill="#d3d247" stroke="#000000" cx="4818" cy="-782.4" rx="104.7906" ry="18"></ellipse>
<text text-anchor="middle" x="4818" y="-778.2" font-family="Times,serif" font-size="14.00" fill="#000000">ct1_membraneElasticity</text>
</g>
</g>
<!-- ct1_membraneElasticity_0&#45;&gt;Logger_0_1 -->

<!-- System_7197099255427773 --><g id="edge71" class="edge">
<title style="">ct1_membraneElasticity_edge_init_0-&gt;System_1_0_1</title>
<path fill="none" stroke="#112c5f" stroke-width="2" d="M4226.5868,-932.5822C4243.4334,-930.6858 4260.6909,-928.824 4277,-927.2 4567.2818,-898.2943 4918.3059,-872.2523 5031.7354,-864.0605"></path>
<polygon fill="#112c5f" stroke="#112c5f" stroke-width="2" points="5032.2381,-867.5335 5041.9608,-863.324 5031.7351,-860.5515 5032.2381,-867.5335"></polygon>
</g>

<!-- ct1_membraneElasticity_0&#45;&gt;System_7197099255427773 -->

<!-- ct1_membraneElasticity_edge_0 --><g id="edge72" class="edge">
<title style="">ct1_membraneElasticity_final_0-&gt;System_1_0_1</title>
<path fill="none" stroke="#112c5f" stroke-width="2" d="M7208.3334,-932.2453C7192.277,-930.2716 7175.6613,-928.4721 7160,-927.2 6738.1958,-892.9385 5351.6427,-866.5288 5106.2768,-862.0664"></path>
<polygon fill="#112c5f" stroke="#112c5f" stroke-width="2" points="5106.1592,-858.5638 5096.0974,-861.8819 5106.0323,-865.5626 5106.1592,-858.5638"></polygon>
</g>
<g id="node23" class="node">
<title>ct1_membraneElasticity_edge_0</title>
<g id="a_node23">
<ellipse fill="#d3d247" stroke="#000000" cx="5069" cy="-782.4" rx="127.9082" ry="18"></ellipse>
<text text-anchor="middle" x="5069" y="-778.2" font-family="Times,serif" font-size="14.00" fill="#000000">ct1_membraneElasticity_edge</text>
</g>
</g>
<!-- ct1_membraneElasticity_edge_0&#45;&gt;Logger_0_1 -->

<!-- ct1_membraneElasticity_edge_0&#45;&gt;System_7197099255427773 --><g id="edge73" class="edge">
<title style="">ct1_membraneElasticity_final_edge_0-&gt;System_1_0_1</title>
<path fill="none" stroke="#112c5f" stroke-width="2" d="M6896.3352,-932.2126C6878.2383,-930.293 6859.5911,-928.5202 6842,-927.2 6145.9709,-874.9617 5292.9752,-863.6471 5106.2392,-861.7373"></path>
<polygon fill="#112c5f" stroke="#112c5f" stroke-width="2" points="5106.1578,-858.2364 5096.1233,-861.6364 5106.0879,-865.236 5106.1578,-858.2364"></polygon>
</g>

<!-- ct1_membraneElasticity_edge_init_0 -->
<g id="node24" class="node">
<title>ct1_membraneElasticity_edge_init_0</title>
<g id="a_node24">
<ellipse fill="#d3d247" stroke="#000000" cx="4122" cy="-945.2" rx="145.8243" ry="18"></ellipse>
<text text-anchor="middle" x="4122" y="-941" font-family="Times,serif" font-size="14.00" fill="#000000">ct1_membraneElasticity_edge_init</text>
</g>
</g>
<!-- ct1_membraneElasticity_edge_init_0&#45;&gt;System_11616943532684386609 --><g id="edge74" class="edge">
<title style="">ct1_membraneElasticity_init_0-&gt;System_1_0_1</title>
<path fill="none" stroke="#112c5f" stroke-width="2" d="M6624.2133,-932.3373C6608.853,-930.3667 6592.9734,-928.5445 6578,-927.2 5993.1008,-874.6803 5276.7507,-863.694 5106.5367,-861.7663"></path>
<polygon fill="#112c5f" stroke="#112c5f" stroke-width="2" points="5106.3833,-858.2645 5096.3455,-861.6544 5106.3064,-865.264 5106.3833,-858.2645"></polygon>
</g>

<!-- ct1_membraneElasticity_final_0 -->
<g id="node25" class="node">
<title>ct1_membraneElasticity_final_0</title>
<g id="a_node25">
<ellipse fill="#d3d247" stroke="#000000" cx="7297" cy="-945.2" rx="127.3421" ry="18"></ellipse>
<text text-anchor="middle" x="7297" y="-941" font-family="Times,serif" font-size="14.00" fill="#000000">ct1_membraneElasticity_final</text>
</g>
</g>
<!-- ct1_membraneElasticity_final_0&#45;&gt;System_11616943532684386609 -->

<!-- ct1_membraneElasticity_final_edge_0 -->
<g id="node26" class="node">
<title>ct1_membraneElasticity_final_edge_0</title>
<g id="a_node26">
<ellipse fill="#d3d247" stroke="#000000" cx="7001" cy="-945.2" rx="150.4598" ry="18"></ellipse>
<text text-anchor="middle" x="7001" y="-941" font-family="Times,serif" font-size="14.00" fill="#000000">ct1_membraneElasticity_final_edge</text>
</g>
</g>
<!-- ct1_membraneElasticity_final_edge_0&#45;&gt;System_11616943532684386609 -->

<!-- ct1_membraneElasticity_init_0 --><g id="edge76" class="edge">
<title style="">ct1_membrane_str_final_0-&gt;System_1_0_1</title>
<path fill="none" stroke="#112c5f" stroke-width="2" d="M6389.9482,-932.3491C6376.6787,-930.3772 6362.9536,-928.5516 6350,-927.2 5860.0904,-876.084 5260.4475,-864.1767 5106.4369,-861.8836"></path>
<polygon fill="#112c5f" stroke="#112c5f" stroke-width="2" points="5106.1754,-858.3796 5096.1258,-861.7347 5106.0742,-865.3788 5106.1754,-858.3796"></polygon>
</g>
<g id="node27" class="node">
<title>ct1_membraneElasticity_init_0</title>
<g id="a_node27">
<ellipse fill="#d3d247" stroke="#000000" cx="6710" cy="-945.2" rx="122.7065" ry="18"></ellipse>
<text text-anchor="middle" x="6710" y="-941" font-family="Times,serif" font-size="14.00" fill="#000000">ct1_membraneElasticity_init</text>
</g>
</g>
<!-- ct1_membraneElasticity_init_0&#45;&gt;System_11616943532684386609 -->

<!-- ct1_membrane_str_0 --><g id="edge77" class="edge">
<title style="">ct1_membrane_str_init_0-&gt;System_1_0_1</title>
<path fill="none" stroke="#112c5f" stroke-width="2" d="M6168.907,-932.3891C6156.31,-930.4254 6143.2925,-928.5921 6131,-927.2 5731.5712,-881.9645 5243.8491,-866.0883 5106.5428,-862.3437"></path>
<polygon fill="#112c5f" stroke="#112c5f" stroke-width="2" points="5106.2574,-858.8349 5096.1672,-862.0658 5106.0699,-865.8324 5106.2574,-858.8349"></polygon>
</g>
<g id="node28" class="node">
<title>ct1_membrane_str_0</title>
<g id="a_node28">
<ellipse fill="#d3d247" stroke="#000000" cx="4743" cy="-190.8" rx="82.8052" ry="18"></ellipse>
<text text-anchor="middle" x="4743" y="-186.60000000000002" font-family="Times,serif" font-size="14.00" fill="#000000">ct1_membrane_str</text>
</g>
</g>
<!-- ct1_membrane_str_0&#45;&gt;Logger_0_1 -->

<!-- SurfaceConstraint_4 --><g id="edge78" class="edge">
<title style="">ct1_perturbation_time_0-&gt;System_1_0_1</title>
<path fill="none" stroke="#112c5f" stroke-width="2" d="M5955.8553,-932.5265C5943.606,-930.5478 5930.9491,-928.674 5919,-927.2 5606.0063,-888.5915 5225.2055,-868.6695 5106.2887,-863.0735"></path>
<polygon fill="#112c5f" stroke="#112c5f" stroke-width="2" points="5106.3983,-859.5749 5096.2462,-862.6058 5106.0726,-866.5673 5106.3983,-859.5749"></polygon>
</g>
<g id="node63" class="node">
<title>SurfaceConstraint_4</title>
<g id="a_node63">">
<polygon fill="#fffea3" stroke="transparent" points="4162,-132 4046,-132 4046,-96 4162,-96 4162,-132"></polygon>
<text text-anchor="start" x="4049.8523" y="-109.5" font-family="times" font-size="15.00" fill="#000000">SurfaceConstraint</text>
<polygon fill="none" stroke="#000000" points="4046,-101 4046,-127 4162,-127 4162,-101 4046,-101"></polygon>
</g>
</g>
<!-- ct1_membrane_str_0&#45;&gt;SurfaceConstraint_4 -->
<g id="edge75" class="edge">
<title>ct1_membrane_str_0-&gt;SurfaceConstraint_4</title>
<path fill="none" stroke="#112c5f" stroke-width="2" d="M4670.3207,-182.0648C4545.8832,-167.109 4293.727,-136.8029 4172.3347,-122.213"></path>
<polygon fill="#112c5f" stroke="#112c5f" stroke-width="2" points="4172.4064,-118.6965 4162.0602,-120.9781 4171.571,-125.6465 4172.4064,-118.6965"></polygon>
</g>
<!-- ct1_membrane_str_final_0 --><g id="edge79" class="edge">
<title style="">ct2_adhesion_0-&gt;System_3_0_1</title>
<path fill="none" stroke="#112c5f" stroke-width="2" d="M3521.696,-765.8438C3540.1238,-753.4898 3565.5751,-736.4273 3586.2284,-722.5813"></path>
<polygon fill="#112c5f" stroke="#112c5f" stroke-width="2" points="3588.3944,-725.343 3594.7516,-716.8673 3584.4965,-719.5287 3588.3944,-725.343"></polygon>
</g>
<g id="node29" class="node">
<title>ct1_membrane_str_final_0</title>
<g id="a_node29">
<ellipse fill="#d3d247" stroke="#000000" cx="6464" cy="-945.2" rx="105.3567" ry="18"></ellipse>
<text text-anchor="middle" x="6464" y="-941" font-family="Times,serif" font-size="14.00" fill="#000000">ct1_membrane_str_final</text>
</g>
</g>
<!-- ct1_membrane_str_final_0&#45;&gt;System_11616943532684386609 -->

<!-- ct1_membrane_str_init_0 --><g id="edge80" class="edge">
<title style="">ct2_adhesion_weak_0-&gt;System_2_0_1</title>
<path fill="none" stroke="#112c5f" stroke-width="2" d="M2882.5313,-932.1063C2801.6134,-914.5845 2660.5388,-884.0366 2593.4747,-869.5147"></path>
<polygon fill="#112c5f" stroke="#112c5f" stroke-width="2" points="2593.8815,-866.0217 2583.3673,-867.326 2592.4,-872.8632 2593.8815,-866.0217"></polygon>
</g>
<g id="node30" class="node">
<title>ct1_membrane_str_init_0</title>
<g id="a_node30">
<ellipse fill="#d3d247" stroke="#000000" cx="6240" cy="-945.2" rx="100.721" ry="18"></ellipse>
<text text-anchor="middle" x="6240" y="-941" font-family="Times,serif" font-size="14.00" fill="#000000">ct1_membrane_str_init</text>
</g>
</g>
<!-- ct1_membrane_str_init_0&#45;&gt;System_11616943532684386609 -->

<!-- ct1_perturbation_time_0 --><g id="node94" class="node">
<title style="">System_10_1</title>
<g id="a_node94">" style="">
<polygon fill="#fffea3" stroke="transparent" points="2806,-294.8 2752,-294.8 2752,-244.8 2806,-244.8 2806,-294.8" style=""></polygon>
<text text-anchor="start" x="2756.9163" y="-277.3" font-family="times" font-size="15.00" fill="#000000" style="">System</text>
<text text-anchor="start" x="2775.25" y="-253.3" font-family="times" font-size="15.00" fill="#000000" style="">1</text>
<polygon fill="#000000" stroke="#000000" points="2753,-269.8 2753,-269.8 2805,-269.8 2805,-269.8 2753,-269.8" style=""></polygon>
<polygon fill="none" stroke="#000000" points="2753,-244.8 2753,-294.8 2805,-294.8 2805,-244.8 2753,-244.8" style=""></polygon>
</g>
</g>
<g id="node31" class="node">
<title>ct1_perturbation_time_0</title>
<g id="a_node31">
<ellipse fill="#d3d247" stroke="#000000" cx="6025" cy="-945.2" rx="96.71" ry="18"></ellipse>
<text text-anchor="middle" x="6025" y="-941" font-family="Times,serif" font-size="14.00" fill="#000000">ct1_perturbation_time</text>
</g>
</g>
<!-- ct1_perturbation_time_0&#45;&gt;System_11616943532684386609 --><g id="edge81" class="edge">
<title style="">ct2_area_0-&gt;System_10_1</title>
<path fill="none" stroke="#112c5f" stroke-width="2" d="M2442.9114,-765.6077C2468.511,-736.7536 2516,-674.8395 2516,-612.6 2516,-612.6 2516,-612.6 2516,-432.6 2516,-327.6758 2669.2086,-288.0794 2741.7546,-275.2114"></path>
<polygon fill="#112c5f" stroke="#112c5f" stroke-width="2" points="2742.57,-278.6232 2751.845,-273.5022 2741.4008,-271.7215 2742.57,-278.6232"></polygon>
</g>

<!-- ct2_adhesion_0 -->
<g id="node32" class="node">
<title>ct2_adhesion_0</title>
<g id="a_node32">
<ellipse fill="#d3d247" stroke="#000000" cx="3497" cy="-782.4" rx="61.9808" ry="18"></ellipse>
<text text-anchor="middle" x="3497" y="-778.2" font-family="Times,serif" font-size="14.00" fill="#000000">ct2_adhesion</text>
</g>
</g>
<!-- ct2_adhesion_0&#45;&gt;Logger_0_1 --><g id="edge82" class="edge">
<title style="">ct2_area_edge_0-&gt;System_10_1</title>
<path fill="none" stroke="#112c5f" stroke-width="2" d="M2578.9444,-765.379C2613.5244,-737.5767 2675,-678.836 2675,-612.6 2675,-612.6 2675,-612.6 2675,-432.6 2675,-379.8838 2714.2054,-330.5298 2744.4733,-300.2819"></path>
<polygon fill="#112c5f" stroke="#112c5f" stroke-width="2" points="2747.2186,-302.4944 2751.9467,-293.0131 2742.3379,-297.4764 2747.2186,-302.4944"></polygon>
</g>

<!-- ct2_adhesion_0&#45;&gt;System_6476179088226463468 -->

<!-- ct2_adhesion_weak_0 --><g id="edge83" class="edge">
<title style="">ct2_area_edge_final_0-&gt;System_2_0_1</title>
<path fill="none" stroke="#112c5f" stroke-width="2" d="M2710.5247,-928.8436C2676.4555,-913.9738 2626.4842,-892.1634 2592.6689,-877.4044"></path>
<polygon fill="#112c5f" stroke="#112c5f" stroke-width="2" points="2593.7232,-874.0458 2583.158,-873.2533 2590.923,-880.4614 2593.7232,-874.0458"></polygon>
</g>
<g id="node33" class="node">
<title>ct2_adhesion_weak_0</title>
<g id="a_node33">
<ellipse fill="#d3d247" stroke="#000000" cx="2943" cy="-945.2" rx="87.3847" ry="18"></ellipse>
<text text-anchor="middle" x="2943" y="-941" font-family="Times,serif" font-size="14.00" fill="#000000">ct2_adhesion_weak</text>
</g>
</g>
<!-- ct2_adhesion_weak_0&#45;&gt;System_18076252045494180204 -->

<!-- ct2_area_0 --><g id="edge84" class="edge">
<title style="">ct2_area_edge_init_0-&gt;System_2_0_1</title>
<path fill="none" stroke="#112c5f" stroke-width="2" d="M2556,-927.0166C2556,-918.1353 2556,-907.1343 2556,-896.6944"></path>
<polygon fill="#112c5f" stroke="#112c5f" stroke-width="2" points="2559.5001,-896.541 2556,-886.541 2552.5001,-896.541 2559.5001,-896.541"></polygon>
</g>
<g id="node34" class="node">
<title>ct2_area_0</title>
<g id="a_node34">
<ellipse fill="#d3d247" stroke="#000000" cx="2427" cy="-782.4" rx="43.9789" ry="18"></ellipse>
<text text-anchor="middle" x="2427" y="-778.2" font-family="Times,serif" font-size="14.00" fill="#000000">ct2_area</text>
</g>
</g>
<!-- ct2_area_0&#45;&gt;Logger_0_1 -->

<!-- ct2_area_0&#45;&gt;System_7197099255427773 --><g id="edge85" class="edge">
<title style="">ct2_area_final_0-&gt;System_2_0_1</title>
<path fill="none" stroke="#112c5f" stroke-width="2" d="M2419.1854,-929.2406C2447.8757,-915.0143 2489.8314,-894.2102 2519.7066,-879.3964"></path>
<polygon fill="#112c5f" stroke="#112c5f" stroke-width="2" points="2521.5455,-882.3912 2528.9497,-874.8131 2518.4358,-876.1199 2521.5455,-882.3912"></polygon>
</g>

<!-- ct2_area_edge_0 -->
<g id="node35" class="node">
<title>ct2_area_edge_0</title>
<g id="a_node35">
<ellipse fill="#d3d247" stroke="#000000" cx="2556" cy="-782.4" rx="66.5959" ry="18"></ellipse>
<text text-anchor="middle" x="2556" y="-778.2" font-family="Times,serif" font-size="14.00" fill="#000000">ct2_area_edge</text>
</g>
</g>
<!-- ct2_area_edge_0&#45;&gt;Logger_0_1 --><g id="edge86" class="edge">
<title style="">ct2_area_init_0-&gt;System_2_0_1</title>
<path fill="none" stroke="#112c5f" stroke-width="2" d="M2286.8037,-933.0148C2349.5816,-916.3138 2461.1376,-886.6364 2518.955,-871.2551"></path>
<polygon fill="#112c5f" stroke="#112c5f" stroke-width="2" points="2520.0019,-874.5984 2528.766,-868.6451 2518.2023,-867.8337 2520.0019,-874.5984"></polygon>
</g>

<!-- ct2_area_edge_0&#45;&gt;System_7197099255427773 -->

<!-- ct2_area_edge_final_0 -->
<g id="node36" class="node">
<title>ct2_area_edge_final_0</title>
<g id="a_node36">
<ellipse fill="#d3d247" stroke="#000000" cx="2748" cy="-945.2" rx="89.1472" ry="18"></ellipse>
<text text-anchor="middle" x="2748" y="-941" font-family="Times,serif" font-size="14.00" fill="#000000">ct2_area_edge_final</text>
</g>
</g>
<!-- ct2_area_edge_final_0&#45;&gt;System_18076252045494180204 --><g id="edge87" class="edge">
<title style="">ct2_generation_time_final_0-&gt;System_2_0_1</title>
<path fill="none" stroke="#112c5f" stroke-width="2" d="M2127.6625,-932.1982C2238.6426,-913.8547 2436.7896,-881.1038 2518.8402,-867.542"></path>
<polygon fill="#112c5f" stroke="#112c5f" stroke-width="2" points="2519.6481,-870.956 2528.9434,-865.8721 2518.5065,-864.0497 2519.6481,-870.956"></polygon>
</g>

<!-- ct2_area_edge_init_0 -->
<g id="node37" class="node">
<title>ct2_area_edge_init_0</title>
<g id="a_node37">
<ellipse fill="#d3d247" stroke="#000000" cx="2556" cy="-945.2" rx="84.5112" ry="18"></ellipse>
<text text-anchor="middle" x="2556" y="-941" font-family="Times,serif" font-size="14.00" fill="#000000">ct2_area_edge_init</text>
</g>
</g>
<!-- ct2_area_edge_init_0&#45;&gt;System_18076252045494180204 --><g id="edge88" class="edge">
<title style="">ct2_generation_time_init_0-&gt;System_2_0_1</title>
<path fill="none" stroke="#112c5f" stroke-width="2" d="M1887.9648,-932.6678C1900.9845,-930.7294 1914.363,-928.8321 1927,-927.2 2151.0859,-898.259 2421.353,-873.3281 2518.757,-864.6613"></path>
<polygon fill="#112c5f" stroke="#112c5f" stroke-width="2" points="2519.3191,-868.1252 2528.9709,-863.7558 2518.7009,-861.1526 2519.3191,-868.1252"></polygon>
</g>

<!-- ct2_area_final_0 -->
<g id="node38" class="node">
<title>ct2_area_final_0</title>
<g id="a_node38">
<ellipse fill="#d3d247" stroke="#000000" cx="2387" cy="-945.2" rx="66.03" ry="18"></ellipse>
<text text-anchor="middle" x="2387" y="-941" font-family="Times,serif" font-size="14.00" fill="#000000">ct2_area_final</text>
</g>
</g>
<!-- ct2_area_final_0&#45;&gt;System_18076252045494180204 --><g id="edge89" class="edge">
<title style="">ct2_hill_n_0-&gt;System_2_0_1</title>
<path fill="none" stroke="#112c5f" stroke-width="2" d="M1670.5116,-932.6982C1677.8836,-930.5614 1685.633,-928.5871 1693,-927.2 1855.2492,-896.6508 2374.8525,-870.0636 2518.7497,-863.1467"></path>
<polygon fill="#112c5f" stroke="#112c5f" stroke-width="2" points="2519.014,-866.6382 2528.8354,-862.6646 2518.6797,-859.6462 2519.014,-866.6382"></polygon>
</g>

<!-- ct2_area_init_0 -->
<g id="node39" class="node">
<title>ct2_area_init_0</title>
<g id="a_node39">
<ellipse fill="#d3d247" stroke="#000000" cx="2241" cy="-945.2" rx="61.3935" ry="18"></ellipse>
<text text-anchor="middle" x="2241" y="-941" font-family="Times,serif" font-size="14.00" fill="#000000">ct2_area_init</text>
</g>
</g>
<!-- ct2_area_init_0&#45;&gt;System_18076252045494180204 --><g id="edge90" class="edge">
<title style="">ct2_k_half_hours_0-&gt;System_2_0_1</title>
<path fill="none" stroke="#112c5f" stroke-width="2" d="M1543.1416,-932.5422C1553.6841,-930.4996 1564.6461,-928.5997 1575,-927.2 1940.6706,-877.7676 2388.2841,-864.9002 2518.7084,-862.0929"></path>
<polygon fill="#112c5f" stroke="#112c5f" stroke-width="2" points="2519.0223,-865.5872 2528.9472,-861.8794 2518.8763,-858.5888 2519.0223,-865.5872"></polygon>
</g>

<!-- ct2_generation_time_0 -->
<g id="node40" class="node">
<title>ct2_generation_time_0</title>
<g id="a_node40">
<ellipse fill="#d3d247" stroke="#000000" cx="2959" cy="-782.4" rx="90.3294" ry="18"></ellipse>
<text text-anchor="middle" x="2959" y="-778.2" font-family="Times,serif" font-size="14.00" fill="#000000">ct2_generation_time</text>
</g>
</g>
<!-- ct2_generation_time_final_0 --><g id="edge91" class="edge">
<title style="">ct2_membraneElasticity_0-&gt;System_10_1</title>
<path fill="none" stroke="#112c5f" stroke-width="2" d="M2749.3531,-764.3805C2754.8076,-733.4523 2765,-668.2184 2765,-612.6 2765,-612.6 2765,-612.6 2765,-432.6 2765,-388.4437 2770.1757,-337.7974 2774.2332,-304.8777"></path>
<polygon fill="#112c5f" stroke="#112c5f" stroke-width="2" points="2777.7198,-305.2034 2775.5033,-294.843 2770.7752,-304.3243 2777.7198,-305.2034"></polygon>
</g>
<g id="node41" class="node">
<title>ct2_generation_time_final_0</title>
<g id="a_node41">
<ellipse fill="#d3d247" stroke="#000000" cx="2049" cy="-945.2" rx="112.8809" ry="18"></ellipse>
<text text-anchor="middle" x="2049" y="-941" font-family="Times,serif" font-size="14.00" fill="#000000">ct2_generation_time_final</text>
</g>
</g>
<!-- ct2_generation_time_final_0&#45;&gt;System_18076252045494180204 -->

<!-- ct2_generation_time_init_0 --><g id="edge92" class="edge">
<title style="">ct2_membraneElasticity_edge_0-&gt;System_10_1</title>
<path fill="none" stroke="#112c5f" stroke-width="2" d="M3105.9664,-769.3911C3090.024,-767.4361 3073.5422,-765.657 3058,-764.4 3043.5957,-763.2351 2808.239,-766.5982 2798,-756.4 2752.6904,-711.2712 2793,-676.5497 2793,-612.6 2793,-612.6 2793,-612.6 2793,-432.6 2793,-388.4437 2787.8243,-337.7974 2783.7668,-304.8777"></path>
<polygon fill="#112c5f" stroke="#112c5f" stroke-width="2" points="2787.2248,-304.3243 2782.4967,-294.843 2780.2802,-305.2034 2787.2248,-304.3243"></polygon>
</g>
<g id="node42" class="node">
<title>ct2_generation_time_init_0</title>
<g id="a_node42">
<ellipse fill="#d3d247" stroke="#000000" cx="1810" cy="-945.2" rx="108.2453" ry="18"></ellipse>
<text text-anchor="middle" x="1810" y="-941" font-family="Times,serif" font-size="14.00" fill="#000000">ct2_generation_time_init</text>
</g>
</g>
<!-- ct2_generation_time_init_0&#45;&gt;System_18076252045494180204 -->

<!-- ct2_hill_n_0 --><g id="edge93" class="edge">
<title style="">ct2_membraneElasticity_edge_init_0-&gt;System_2_0_1</title>
<path fill="none" stroke="#112c5f" stroke-width="2" d="M1347.6316,-932.3424C1364.7673,-930.4431 1382.3733,-928.6432 1399,-927.2 1838.4884,-889.0526 2373.8948,-867.9815 2518.5103,-862.7195"></path>
<polygon fill="#112c5f" stroke="#112c5f" stroke-width="2" points="2518.7584,-866.2129 2528.6255,-862.3541 2518.5057,-859.2175 2518.7584,-866.2129"></polygon>
</g>
<g id="node43" class="node">
<title>ct2_hill_n_0</title>
<g id="a_node43">
<ellipse fill="#d3d247" stroke="#000000" cx="1634" cy="-945.2" rx="50.4013" ry="18"></ellipse>
<text text-anchor="middle" x="1634" y="-941" font-family="Times,serif" font-size="14.00" fill="#000000">ct2_hill_n</text>
</g>
</g>
<!-- ct2_hill_n_0&#45;&gt;System_18076252045494180204 -->

<!-- ct2_k_half_hours_0 --><g id="edge94" class="edge">
<title style="">ct2_membraneElasticity_final_0-&gt;System_2_0_1</title>
<path fill="none" stroke="#112c5f" stroke-width="2" d="M1043.1277,-932.2788C1058.7246,-930.3395 1074.8164,-928.543 1090,-927.2 1657.4273,-877.0107 2351.9801,-864.298 2518.7444,-861.8836"></path>
<polygon fill="#112c5f" stroke="#112c5f" stroke-width="2" points="2519.0092,-865.3803 2528.9586,-861.7391 2518.9101,-858.381 2519.0092,-865.3803"></polygon>
</g>
<g id="node44" class="node">
<title>ct2_k_half_hours_0</title>
<g id="a_node44">
<ellipse fill="#d3d247" stroke="#000000" cx="1487" cy="-945.2" rx="78.7376" ry="18"></ellipse>
<text text-anchor="middle" x="1487" y="-941" font-family="Times,serif" font-size="14.00" fill="#000000">ct2_k_half_hours</text>
</g>
</g>
<!-- ct2_k_half_hours_0&#45;&gt;System_18076252045494180204 -->

<!-- ct2_membraneElasticity_0 --><g id="edge95" class="edge">
<title style="">ct2_membraneElasticity_final_edge_0-&gt;System_2_0_1</title>
<path fill="none" stroke="#112c5f" stroke-width="2" d="M762.8955,-932.2726C781.2404,-930.334 800.1603,-928.5393 818,-927.2 1499.2293,-876.0562 2333.8094,-863.9182 2518.6244,-861.7874"></path>
<polygon fill="#112c5f" stroke="#112c5f" stroke-width="2" points="2518.9294,-865.2843 2528.8893,-861.6717 2518.8504,-858.2847 2518.9294,-865.2843"></polygon>
</g>
<g id="node45" class="node">
<title>ct2_membraneElasticity_0</title>
<g id="a_node45">
<ellipse fill="#d3d247" stroke="#000000" cx="2746" cy="-782.4" rx="104.7906" ry="18"></ellipse>
<text text-anchor="middle" x="2746" y="-778.2" font-family="Times,serif" font-size="14.00" fill="#000000">ct2_membraneElasticity</text>
</g>
</g>
<!-- ct2_membraneElasticity_0&#45;&gt;Logger_0_1 -->

<!-- ct2_membraneElasticity_0&#45;&gt;System_7197099255427773 --><g id="edge96" class="edge">
<title style="">ct2_membraneElasticity_init_0-&gt;System_2_0_1</title>
<path fill="none" stroke="#112c5f" stroke-width="2" d="M452.4197,-932.2374C467.8913,-930.2645 483.9038,-928.4673 499,-927.2 913.4212,-892.4098 2275.0549,-866.4822 2518.558,-862.0667"></path>
<polygon fill="#112c5f" stroke="#112c5f" stroke-width="2" points="2518.7346,-865.5641 2528.6698,-861.884 2518.6082,-858.5653 2518.7346,-865.5641"></polygon>
</g>

<!-- ct2_membraneElasticity_edge_0 -->
<g id="node46" class="node">
<title>ct2_membraneElasticity_edge_0</title>
<g id="a_node46">
<ellipse fill="#d3d247" stroke="#000000" cx="3195" cy="-782.4" rx="127.9082" ry="18"></ellipse>
<text text-anchor="middle" x="3195" y="-778.2" font-family="Times,serif" font-size="14.00" fill="#000000">ct2_membraneElasticity_edge</text>
</g>
</g>
<!-- ct2_membraneElasticity_edge_0&#45;&gt;Logger_0_1 -->

<!-- ct2_membraneElasticity_edge_0&#45;&gt;System_7197099255427773 -->

<!-- ct2_membraneElasticity_edge_init_0 -->
<g id="node47" class="node">
<title>ct2_membraneElasticity_edge_init_0</title>
<g id="a_node47">
<ellipse fill="#d3d247" stroke="#000000" cx="1245" cy="-945.2" rx="145.8243" ry="18"></ellipse>
<text text-anchor="middle" x="1245" y="-941" font-family="Times,serif" font-size="14.00" fill="#000000">ct2_membraneElasticity_edge_init</text>
</g>
</g>
<!-- ct2_membraneElasticity_edge_init_0&#45;&gt;System_18076252045494180204 --><g id="edge98" class="edge">
<title style="">ct2_membrane_str_final_0-&gt;System_2_0_1</title>
<path fill="none" stroke="#112c5f" stroke-width="2" d="M194.415,-932.1903C207.8767,-930.209 221.8322,-928.4211 235,-927.2 705.1351,-883.6013 2258.2892,-864.6971 2518.7759,-861.8"></path>
<polygon fill="#112c5f" stroke="#112c5f" stroke-width="2" points="2518.8958,-865.299 2528.8565,-861.6887 2518.8185,-858.2994 2518.8958,-865.299"></polygon>
</g>

<!-- ct2_membraneElasticity_final_0 -->
<g id="node48" class="node">
<title>ct2_membraneElasticity_final_0</title>
<g id="a_node48">
<ellipse fill="#d3d247" stroke="#000000" cx="954" cy="-945.2" rx="127.3421" ry="18"></ellipse>
<text text-anchor="middle" x="954" y="-941" font-family="Times,serif" font-size="14.00" fill="#000000">ct2_membraneElasticity_final</text>
</g>
</g>
<!-- ct2_membraneElasticity_final_0&#45;&gt;System_18076252045494180204 --><g id="edge99" class="edge">
<title style="">ct2_membrane_str_init_0-&gt;System_2_0_1</title>
<path fill="none" stroke="#112c5f" stroke-width="2" d="M3466.598,-932.4808C3454.094,-930.5191 3441.1877,-928.6627 3429,-927.2 3106.7258,-888.5217 2714.6239,-868.5848 2593.4607,-863.0369"></path>
<polygon fill="#112c5f" stroke="#112c5f" stroke-width="2" points="2593.3881,-859.5301 2583.2399,-862.5738 2593.0712,-866.523 2593.3881,-859.5301"></polygon>
</g>

<!-- ct2_membraneElasticity_final_edge_0 -->
<g id="node49" class="node">
<title>ct2_membraneElasticity_final_edge_0</title>
<g id="a_node49">
<ellipse fill="#d3d247" stroke="#000000" cx="658" cy="-945.2" rx="150.4598" ry="18"></ellipse>
<text text-anchor="middle" x="658" y="-941" font-family="Times,serif" font-size="14.00" fill="#000000">ct2_membraneElasticity_final_edge</text>
</g>
</g>
<!-- ct2_membraneElasticity_final_edge_0&#45;&gt;System_18076252045494180204 --><g id="edge100" class="edge">
<title style="">ct2_perturbation_time_0-&gt;System_2_0_1</title>
<path fill="none" stroke="#112c5f" stroke-width="2" d="M3253.2571,-932.6535C3241.1886,-930.6839 3228.7472,-928.7802 3217,-927.2 2980.2174,-895.349 2693.787,-871.9573 2593.1302,-864.1923"></path>
<polygon fill="#112c5f" stroke="#112c5f" stroke-width="2" points="2593.3905,-860.7021 2583.1521,-863.427 2592.8551,-867.6816 2593.3905,-860.7021"></polygon>
</g>

<!-- ct2_membraneElasticity_init_0 -->
<g id="node50" class="node">
<title>ct2_membraneElasticity_init_0</title>
<g id="a_node50">
<ellipse fill="#d3d247" stroke="#000000" cx="367" cy="-945.2" rx="122.7065" ry="18"></ellipse>
<text text-anchor="middle" x="367" y="-941" font-family="Times,serif" font-size="14.00" fill="#000000">ct2_membraneElasticity_init</text>
</g>
</g>
<!-- ct2_membraneElasticity_init_0&#45;&gt;System_18076252045494180204 -->

<!-- ct2_membrane_str_0 -->
<g id="node51" class="node">
<title>ct2_membrane_str_0</title>
<g id="a_node51">
<ellipse fill="#d3d247" stroke="#000000" cx="3403" cy="-190.8" rx="82.8052" ry="18"></ellipse>
<text text-anchor="middle" x="3403" y="-186.60000000000002" font-family="Times,serif" font-size="14.00" fill="#000000">ct2_membrane_str</text>
</g>
</g>
<!-- ct2_membrane_str_0&#45;&gt;Logger_0_1 --><g id="edge20" class="edge">
<title style="">System_1_0_1-&gt;ct1_adhesion_0</title>
<path fill="none" stroke="#8f100d" stroke-width="3" d="M5041.8306,-859.5826C4894.1807,-849.7059 4186.5556,-802.3711 3958.7923,-787.1355" style=""></path>
<polygon fill="#8f100d" stroke="#8f100d" stroke-width="3" points="3958.8457,-783.6313 3948.6344,-786.456 3958.3785,-790.6157 3958.8457,-783.6313" style=""></polygon>
</g>

<!-- SurfaceConstraint_5 --><g id="edge21" class="edge">
<title style="">System_1_0_1-&gt;ct1_area_0</title>
<path fill="none" stroke="#8f100d" stroke-width="3" d="M5041.6768,-859.9565C4927.6441,-853.7955 4489.356,-828.7205 4354,-800.4 4350.3618,-799.6388 4346.6276,-798.7032 4342.9073,-797.6623" style=""></path>
<polygon fill="#8f100d" stroke="#8f100d" stroke-width="3" points="4343.7528,-794.2614 4333.1675,-794.7087 4341.7214,-800.9602 4343.7528,-794.2614" style=""></polygon>
</g>
<g id="node81" class="node">
<title>SurfaceConstraint_5</title>
<g id="a_node81">">
<polygon fill="#fffea3" stroke="transparent" points="3096,-132 2980,-132 2980,-96 3096,-96 3096,-132"></polygon>
<text text-anchor="start" x="2983.8523" y="-109.5" font-family="times" font-size="15.00" fill="#000000">SurfaceConstraint</text>
<polygon fill="none" stroke="#000000" points="2980,-101 2980,-127 3096,-127 3096,-101 2980,-101"></polygon>
</g>
</g>
<!-- ct2_membrane_str_0&#45;&gt;SurfaceConstraint_5 --><g id="edge22" class="edge">
<title style="">System_1_0_1-&gt;ct1_area_edge_0</title>
<path fill="none" stroke="#8f100d" stroke-width="3" d="M5041.8789,-859.666C4960.342,-854.1954 4710.446,-835.5455 4506,-800.4 4500.2642,-799.414 4494.3153,-798.2526 4488.386,-797.0024" style=""></path>
<polygon fill="#8f100d" stroke="#8f100d" stroke-width="3" points="4488.9844,-793.5505 4478.4671,-794.8297 4487.4866,-800.3884 4488.9844,-793.5505" style=""></polygon>
</g>
<g id="edge97" class="edge">
<title>ct2_membrane_str_0-&gt;SurfaceConstraint_5</title>
<path fill="none" stroke="#112c5f" stroke-width="2" d="M3329.8635,-182.3055C3300.1449,-179.0377 3265.4596,-175.4572 3234,-172.8 3205.6012,-170.4013 3132.7523,-174.6266 3106,-164.8 3090.6027,-159.1443 3075.739,-148.8025 3063.856,-138.9191"></path>
<polygon fill="#112c5f" stroke="#112c5f" stroke-width="2" points="3065.9804,-136.1284 3056.1355,-132.2132 3061.3901,-141.4132 3065.9804,-136.1284"></polygon>
</g>
<!-- ct2_membrane_str_final_0 --><g id="edge23" class="edge">
<title style="">System_1_0_1-&gt;ct1_generation_time_0</title>
<path fill="none" stroke="#8f100d" stroke-width="3" d="M5041.9616,-857.0167C4981.4002,-847.169 4830.2654,-822.4285 4704,-800.4 4696.7008,-799.1266 4689.1028,-797.781 4681.5052,-796.4222" style=""></path>
<polygon fill="#8f100d" stroke="#8f100d" stroke-width="3" points="4682.0041,-792.9559 4671.5429,-794.6331 4680.7668,-799.8456 4682.0041,-792.9559" style=""></polygon>
</g>
<g id="node52" class="node">
<title>ct2_membrane_str_final_0</title>
<g id="a_node52">
<ellipse fill="#d3d247" stroke="#000000" cx="121" cy="-945.2" rx="105.3567" ry="18"></ellipse>
<text text-anchor="middle" x="121" y="-941" font-family="Times,serif" font-size="14.00" fill="#000000">ct2_membrane_str_final</text>
</g>
</g>
<!-- ct2_membrane_str_final_0&#45;&gt;System_18076252045494180204 --><g id="edge24" class="edge">
<title style="">System_1_0_1-&gt;ct1_membraneElasticity_0</title>
<path fill="none" stroke="#8f100d" stroke-width="3" d="M5041.6608,-852.7952C5002.6284,-840.5101 4929.9166,-817.6247 4877.9925,-801.2821" style=""></path>
<polygon fill="#8f100d" stroke="#8f100d" stroke-width="3" points="4878.8163,-797.8722 4868.2268,-798.2084 4876.7147,-804.5493 4878.8163,-797.8722" style=""></polygon>
</g>

<!-- ct2_membrane_str_init_0 --><g id="edge25" class="edge">
<title style="">System_1_0_1-&gt;ct1_membraneElasticity_edge_0</title>
<path fill="none" stroke="#8f100d" stroke-width="3" d="M5069,-835.9691C5069,-827.9402 5069,-819.0193 5069,-810.797" style=""></path>
<polygon fill="#8f100d" stroke="#8f100d" stroke-width="3" points="5072.5001,-810.5242 5069,-800.5242 5065.5001,-810.5242 5072.5001,-810.5242" style=""></polygon>
</g>
<g id="node53" class="node">
<title>ct2_membrane_str_init_0</title>
<g id="a_node53">
<ellipse fill="#d3d247" stroke="#000000" cx="3538" cy="-945.2" rx="100.721" ry="18"></ellipse>
<text text-anchor="middle" x="3538" y="-941" font-family="Times,serif" font-size="14.00" fill="#000000">ct2_membrane_str_init</text>
</g>
</g>
<!-- ct2_membrane_str_init_0&#45;&gt;System_18076252045494180204 --><g id="edge26" class="edge">
<title style="">System_1_0_1-&gt;ct1_membrane_str_0</title>
<path fill="none" stroke="#8f100d" stroke-width="3" d="M5096.2285,-857.5261C5128.1886,-851.4177 5180.1064,-836.2965 5206,-800.4 5232.5964,-763.5293 5216,-744.0622 5216,-698.6 5216,-698.6 5216,-698.6 5216,-353.6 5216,-271.6808 4959.1303,-222.088 4823.9805,-201.6644" style=""></path>
<polygon fill="#8f100d" stroke="#8f100d" stroke-width="3" points="4824.4757,-198.1997 4814.0688,-200.1859 4823.4429,-205.1231 4824.4757,-198.1997" style=""></polygon>
</g>

<!-- ct2_perturbation_time_0 --><g id="edge27" class="edge">
<title style="">System_2_0_1-&gt;ct2_adhesion_0</title>
<path fill="none" stroke="#8f100d" stroke-width="3" d="M2583.1731,-859.5626C2683.0174,-852.7479 3039.0242,-827.8893 3332,-800.4 3363.9516,-797.4021 3399.3302,-793.6059 3429.1072,-790.2735" style=""></path>
<polygon fill="#8f100d" stroke="#8f100d" stroke-width="3" points="3429.8453,-793.7126 3439.3912,-789.1161 3429.0625,-786.7565 3429.8453,-793.7126" style=""></polygon>
</g>
<g id="node54" class="node">
<title>ct2_perturbation_time_0</title>
<g id="a_node54">
<ellipse fill="#d3d247" stroke="#000000" cx="3323" cy="-945.2" rx="96.71" ry="18"></ellipse>
<text text-anchor="middle" x="3323" y="-941" font-family="Times,serif" font-size="14.00" fill="#000000">ct2_perturbation_time</text>
</g>
</g>
<!-- ct2_perturbation_time_0&#45;&gt;System_18076252045494180204 --><g id="edge28" class="edge">
<title style="">System_2_0_1-&gt;ct2_area_0</title>
<path fill="none" stroke="#8f100d" stroke-width="3" d="M2528.9574,-844.839C2509.0465,-832.6455 2481.8479,-815.9891 2460.5502,-802.9463" style=""></path>
<polygon fill="#8f100d" stroke="#8f100d" stroke-width="3" points="2462.1782,-799.8391 2451.8224,-797.6013 2458.5224,-805.8086 2462.1782,-799.8391" style=""></polygon>
</g>

<!-- ctall_medium_adhesion_0 --><g id="edge29" class="edge">
<title style="">System_2_0_1-&gt;ct2_area_edge_0</title>
<path fill="none" stroke="#8f100d" stroke-width="3" d="M2556,-835.9691C2556,-827.9402 2556,-819.0193 2556,-810.797" style=""></path>
<polygon fill="#8f100d" stroke="#8f100d" stroke-width="3" points="2559.5001,-810.5242 2556,-800.5242 2552.5001,-810.5242 2559.5001,-810.5242" style=""></polygon>
</g>
<g id="node55" class="node">
<title>ctall_medium_adhesion_0</title>
<ellipse fill="#d3d247" stroke="#000000" cx="3439" cy="-612.6" rx="103.1001" ry="18"></ellipse>
<ellipse fill="none" stroke="#000000" cx="3439" cy="-612.6" rx="107.0925" ry="22"></ellipse>
<text text-anchor="middle" x="3439" y="-608.4" font-family="Times,serif" font-size="14.00" fill="#000000">ctall_medium_adhesion</text>
</g>
<!-- ctall_medium_adhesion_0&#45;&gt;CPM_0_0_03 --><g id="edge30" class="edge">
<title style="">System_2_0_1-&gt;ct2_generation_time_0</title>
<path fill="none" stroke="#8f100d" stroke-width="3" d="M2583.0677,-856.0939C2643.8796,-844.173 2793.1142,-814.9186 2884.2078,-797.0615" style=""></path>
<polygon fill="#8f100d" stroke="#8f100d" stroke-width="3" points="2885.0596,-800.4612 2894.1995,-795.1028 2883.713,-793.592 2885.0596,-800.4612" style=""></polygon>
</g>
<g id="edge101" class="edge">
<title>ctall_medium_adhesion_0-&gt;CPM_0_0_03</title>
<path fill="none" stroke="#112c5f" stroke-width="2" d="M3439,-590.3528C3439,-581.7899 3439,-571.7355 3439,-562.0318"></path>
<polygon fill="#112c5f" stroke="#112c5f" stroke-width="2" points="3442.5001,-561.7272 3439,-551.7272 3435.5001,-561.7272 3442.5001,-561.7272"></polygon>
</g>
<!-- ctall_medium_adhesion_0&#45;&gt;ctall_medium_adhesion_0 --><g id="edge31" class="edge">
<title style="">System_2_0_1-&gt;ct2_membraneElasticity_0</title>
<path fill="none" stroke="#8f100d" stroke-width="3" d="M2583.2224,-850.0812C2612.7049,-837.8227 2660.3599,-818.0083 2696.5065,-802.9789" style=""></path>
<polygon fill="#8f100d" stroke="#8f100d" stroke-width="3" points="2698.0101,-806.1443 2705.9,-799.0732 2695.3226,-799.6807 2698.0101,-806.1443" style=""></polygon>
</g>
<g id="edge102" class="edge">
<title>ctall_medium_adhesion_0-&gt;ctall_medium_adhesion_0</title>
<path fill="none" stroke="#38568c" stroke-dasharray="5,2" d="M3512.3583,-628.662C3540.7215,-629.3759 3564.2961,-624.0219 3564.2961,-612.6 3564.2961,-601.1781 3540.7215,-595.8241 3512.3583,-596.538"></path>
</g>
<!-- System_11616943532684386609&#45;&gt;ct1_adhesion_0 --><g id="edge32" class="edge">
<title style="">System_2_0_1-&gt;ct2_membraneElasticity_edge_0</title>
<path fill="none" stroke="#8f100d" stroke-width="3" d="M2583.2195,-858.1867C2658.6633,-849.2601 2876.8314,-823.3083 3058,-800.4 3068.9525,-799.0151 3080.3944,-797.5464 3091.7959,-796.0689" style=""></path>
<polygon fill="#8f100d" stroke="#8f100d" stroke-width="3" points="3092.326,-799.5295 3101.7916,-794.77 3091.4239,-792.5878 3092.326,-799.5295" style=""></polygon>
</g>

<!-- System_11616943532684386609&#45;&gt;ct1_area_0 --><g id="edge33" class="edge">
<title style="">System_2_0_1-&gt;ct2_membrane_str_0</title>
<path fill="none" stroke="#8f100d" stroke-width="3" d="M2583.0015,-860.7848C2753.0834,-856.8254 3678.0376,-834.03 3959,-800.4 4059.3059,-788.3938 4114.5458,-831.6021 4182,-756.4 4199.217,-737.2054 4187,-724.3848 4187,-698.6 4187,-698.6 4187,-698.6 4187,-432.6 4187,-411.0158 4197.12,-351.0033 4182,-335.6 4173.105,-326.5384 4080.5798,-329.3275 4068,-327.6 3845.3231,-297.0207 3585.4025,-236.0927 3467.2784,-206.9962" style=""></path>
<polygon fill="#8f100d" stroke="#8f100d" stroke-width="3" points="3467.8633,-203.5356 3457.3157,-204.5348 3466.1843,-210.3312 3467.8633,-203.5356" style=""></polygon>
</g>

<!-- System_11616943532684386609&#45;&gt;ct1_area_edge_0 --><g id="edge34" class="edge">
<title style="">System_3_0_1-&gt;ct1_ct2_0</title>
<path fill="none" stroke="#8f100d" stroke-width="3" d="M3622,-673.2623C3622,-663.113 3622,-651.3747 3622,-640.9436" style=""></path>
<polygon fill="#8f100d" stroke="#8f100d" stroke-width="3" points="3625.5001,-640.6677 3622,-630.6677 3618.5001,-640.6678 3625.5001,-640.6677" style=""></polygon>
</g>

<!-- System_11616943532684386609&#45;&gt;ct1_generation_time_0 -->

<!-- System_11616943532684386609&#45;&gt;ct1_membraneElasticity_0 -->

<!-- System_11616943532684386609&#45;&gt;ct1_membraneElasticity_edge_0 -->

<!-- System_11616943532684386609&#45;&gt;ct1_membrane_str_0 -->

<!-- System_18076252045494180204&#45;&gt;ct2_adhesion_0 -->

<!-- System_18076252045494180204&#45;&gt;ct2_area_0 -->

<!-- System_18076252045494180204&#45;&gt;ct2_area_edge_0 -->

<!-- System_18076252045494180204&#45;&gt;ct2_generation_time_0 -->

<!-- System_18076252045494180204&#45;&gt;ct2_membraneElasticity_0 -->

<!-- System_18076252045494180204&#45;&gt;ct2_membraneElasticity_edge_0 -->

<!-- System_18076252045494180204&#45;&gt;ct2_membrane_str_0 -->

<!-- System_6476179088226463468&#45;&gt;ct1_ct2_0 -->

<!-- PersistentMotion_4_0_03 -->
<g id="node59" class="node">
<title>PersistentMotion_4_0_03</title>
<g id="a_node59">">
<polygon fill="#fffea3" stroke="transparent" points="3892,-132 3782,-132 3782,-96 3892,-96 3892,-132"></polygon>
<text text-anchor="start" x="3785.754" y="-109.5" font-family="times" font-size="15.00" fill="#000000">PersistentMotion</text>
<polygon fill="none" stroke="#000000" points="3782,-101 3782,-127 3892,-127 3892,-101 3782,-101"></polygon>
</g>
</g>
<!-- stored_center_4 -->
<g id="node72" class="node">
<title>stored_center_4</title>
<ellipse fill="#b5b426" stroke="#000000" cx="3788" cy="-42" rx="63.0996" ry="18"></ellipse>
<text text-anchor="middle" x="3788" y="-37.8" font-family="Times,serif" font-size="14.00" fill="#000000">stored_center</text>
</g>
<!-- PersistentMotion_4_0_03&#45;&gt;stored_center_4 -->
<g id="edge13" class="edge">
<title>PersistentMotion_4_0_03-&gt;stored_center_4</title>
<path fill="none" stroke="#8f100d" stroke-width="3" d="M3818.6828,-95.8314C3812.2654,-87.5829 3805.3185,-77.6635 3799.5611,-68.5992"></path>
<polygon fill="#8f100d" stroke="#8f100d" stroke-width="3" points="3802.4588,-66.6285 3794.2638,-59.9134 3796.4826,-70.2733 3802.4588,-66.6285"></polygon>
</g>
<!-- stored_direction_4 --><g id="edge51" class="edge">
<title style="">cell_type_4-&gt;NeighborhoodReporter_4_1</title>
<path fill="none" stroke="#112c5f" stroke-width="2" d="M3727.0709,-504.3872C3730.6105,-493.7685 3735.193,-480.0211 3739.3991,-467.4027"></path>
<polygon fill="#112c5f" stroke="#112c5f" stroke-width="2" points="3742.8225,-468.2002 3742.6645,-457.6065 3736.1818,-465.9865 3742.8225,-468.2002"></polygon>
</g>
<g id="node73" class="node">
<title>stored_direction_4</title>
<ellipse fill="#b5b426" stroke="#000000" cx="3943" cy="-42" rx="73.5753" ry="18"></ellipse>
<text text-anchor="middle" x="3943" y="-37.8" font-family="Times,serif" font-size="14.00" fill="#000000">stored_direction</text>
</g>
<!-- PersistentMotion_4_0_03&#45;&gt;stored_direction_4 --><g id="edge52" class="edge">
<title style="">cell_type_4-&gt;NeighborhoodReporter_5_1</title>
<path fill="none" stroke="#112c5f" stroke-width="2" d="M3699.0415,-506.6018C3691.1864,-501.637 3682.0347,-496.6681 3673,-493.6 3589.4885,-465.2405 3341.7034,-446.0215 3210.5647,-437.5364"></path>
<polygon fill="#112c5f" stroke="#112c5f" stroke-width="2" points="3210.7612,-434.0419 3200.5578,-436.8951 3210.3135,-441.0275 3210.7612,-434.0419"></polygon>
</g>
<g id="edge14" class="edge">
<title>PersistentMotion_4_0_03-&gt;stored_direction_4</title>
<path fill="none" stroke="#8f100d" stroke-width="3" d="M3857.7959,-95.8314C3871.0363,-86.2003 3888.4588,-74.2913 3904.1437,-64.1252"></path>
<polygon fill="#8f100d" stroke="#8f100d" stroke-width="3" points="3906.1083,-67.0233 3912.6411,-58.6822 3902.3326,-61.1288 3906.1083,-67.0233"></polygon>
</g>
<!-- CellDivision_4_0_03 -->
<g id="node60" class="node">
<title>CellDivision_4_0_03</title>
<g id="a_node60">">
<polygon fill="#fffea3" stroke="transparent" points="3946,-637.6 3862,-637.6 3862,-587.6 3946,-587.6 3946,-637.6"></polygon>
<text text-anchor="start" x="3865.6668" y="-620.1" font-family="times" font-size="15.00" fill="#000000">CellDivision</text>
<text text-anchor="start" x="3890.875" y="-596.1" font-family="times" font-size="15.00" fill="#000000">0.03</text>
<polygon fill="#000000" stroke="#000000" points="3862,-612.6 3862,-612.6 3946,-612.6 3946,-612.6 3862,-612.6"></polygon>
<polygon fill="none" stroke="#000000" points="3862,-587.6 3862,-637.6 3946,-637.6 3946,-587.6 3862,-587.6"></polygon>
</g>
</g>
<!-- cell_center_4 -->
<g id="node66" class="node">
<title>cell_center_4</title>
<ellipse fill="#b5b426" stroke="#000000" cx="3834" cy="-522.6" rx="50.9572" ry="18"></ellipse>
<text text-anchor="middle" x="3834" y="-518.4" font-family="Times,serif" font-size="14.00" fill="#000000">cell.center</text>
</g>
<!-- CellDivision_4_0_03&#45;&gt;cell_center_4 -->
<g id="edge7" class="edge">
<title>CellDivision_4_0_03-&gt;cell_center_4</title>
<path fill="none" stroke="#8f100d" stroke-width="3" d="M3884.5011,-587.53C3874.9691,-575.2746 3863.5149,-560.5478 3853.9265,-548.2198"></path>
<polygon fill="#8f100d" stroke="#8f100d" stroke-width="3" points="3856.5352,-545.8728 3847.633,-540.1281 3851.0097,-550.1704 3856.5352,-545.8728"></polygon>
</g>
<!-- dc_4 -->
<g id="node69" class="node">
<title>dc_4</title>
<g id="a_node69">
<ellipse fill="#d3d247" stroke="#000000" cx="3878" cy="-190.8" rx="27" ry="18"></ellipse>
<text text-anchor="middle" x="3878" y="-186.6" font-family="Times,serif" font-size="14.00" fill="#000000">dc</text>
</g>
</g>
<!-- CellDivision_4_0_03&#45;&gt;dc_4 -->
<g id="edge8" class="edge">
<title>CellDivision_4_0_03-&gt;dc_4</title>
<path fill="none" stroke="#8f100d" stroke-width="3" d="M3897.9747,-587.5575C3895,-552.7859 3895,-487.9125 3895,-432.6 3895,-432.6 3895,-432.6 3895,-353.6 3895,-306.027 3884.0399,-251.6018 3878.8149,-219.2762"></path>
<polygon fill="#8f100d" stroke="#8f100d" stroke-width="3" points="3882.2471,-218.5646 3877.2869,-209.2026 3875.3263,-219.6144 3882.2471,-218.5646"></polygon>
</g>
<!-- isEdgeCell_4 --><g id="edge109" class="edge">
<title style="">isEdgeCell_4-&gt;System_8_1</title>
<path fill="none" stroke="#112c5f" stroke-width="2" d="M3793.7363,-340.3778C3800.402,-338.4455 3807.3498,-336.7292 3814,-335.6 3828.3568,-333.1621 4063.6197,-335.2675 4076,-327.6 4084.7852,-322.159 4091.2374,-313.3122 4095.9067,-304.158"></path>
<polygon fill="#112c5f" stroke="#112c5f" stroke-width="2" points="4099.1079,-305.573 4100.0021,-295.016 4092.7196,-302.7112 4099.1079,-305.573"></polygon>
</g>
<g id="node71" class="node">
<title>isEdgeCell_4</title>
<g id="a_node71">
<ellipse fill="#d3d247" stroke="#000000" cx="3757" cy="-353.6" rx="53.3264" ry="18"></ellipse>
<text text-anchor="middle" x="3757" y="-349.4" font-family="Times,serif" font-size="14.00" fill="#000000">isEdgeCell</text>
</g>
</g>
<!-- NeighborhoodReporter_4_1&#45;&gt;isEdgeCell_4 -->
<g id="edge11" class="edge">
<title>NeighborhoodReporter_4_1-&gt;isEdgeCell_4</title>
<path fill="none" stroke="#8f100d" stroke-width="3" d="M3752.9315,-407.1691C3753.5481,-399.05 3754.234,-390.0187 3754.8643,-381.7201"></path>
<polygon fill="#8f100d" stroke="#8f100d" stroke-width="3" points="3758.356,-381.9606 3755.6235,-371.7242 3751.3761,-381.4304 3758.356,-381.9606"></polygon>
</g>
<!-- c_4 -->

<!-- c_4&#45;&gt;c_0 -->

<!-- cadherin_4 -->
<g id="node65" class="node">
<title>cadherin_4</title>
<g id="a_node65">
<ellipse fill="#d3d247" stroke="#000000" cx="3721" cy="-698.6" rx="44.0622" ry="18"></ellipse>
<text text-anchor="middle" x="3721" y="-694.4" font-family="Times,serif" font-size="14.00" fill="#000000">cadherin</text>
</g>
</g>
<!-- cadherin_4&#45;&gt;cadherin_0 -->
<g id="edge44" class="edge">
<title>cadherin_4-&gt;cadherin_0</title>
<path fill="none" stroke="#38568c" stroke-dasharray="5,2" d="M3698.075,-683.0138C3687.2934,-676.4828 3673.976,-669.5111 3661,-665.6 3516.6764,-622.0998 3469.2423,-674.1345 3323,-637.6 3314.5959,-635.5005 3305.8554,-632.316 3297.7864,-628.9161"></path>
</g>
<!-- cell_center_4&#45;&gt;cell_center_0 -->

<!-- cell_center_4&#45;&gt;PersistentMotion_4_0_03 --><g id="edge35" class="edge">
<title style="">System_8_1-&gt;dc_4</title>
<path fill="none" stroke="#8f100d" stroke-width="3" d="M4086.8981,-244.6674C4083.5394,-241.6397 4079.8759,-238.8868 4076,-236.8 4011.6645,-202.1618 3983.4179,-231.6041 3914,-208.8 3912.108,-208.1785 3910.191,-207.4722 3908.2782,-206.7078" style=""></path>
<polygon fill="#8f100d" stroke="#8f100d" stroke-width="3" points="3909.4413,-203.3945 3898.8822,-202.5244 3906.5941,-209.7893 3909.4413,-203.3945" style=""></polygon>
</g>
<g id="edge48" class="edge">
<title>cell_center_4-&gt;PersistentMotion_4_0_03</title>
<path fill="none" stroke="#112c5f" stroke-width="2" d="M3834.1328,-504.5157C3834.6061,-440.0547 3836.213,-221.1865 3836.7909,-142.4834"></path>
<polygon fill="#112c5f" stroke="#112c5f" stroke-width="2" points="3840.2917,-142.3645 3836.8654,-132.339 3833.2919,-142.313 3840.2917,-142.3645"></polygon>
</g>
<!-- cell_center_4&#45;&gt;NeighborhoodReporter_4_1 --><g id="edge36" class="edge">
<title style="">System_8_1-&gt;targetSurface_4</title>
<path fill="none" stroke="#8f100d" stroke-width="3" d="M4107,-244.3691C4107,-236.3402 4107,-227.4193 4107,-219.197" style=""></path>
<polygon fill="#8f100d" stroke="#8f100d" stroke-width="3" points="4110.5001,-218.9242 4107,-208.9242 4103.5001,-218.9242 4110.5001,-218.9242" style=""></polygon>
</g>
<g id="edge47" class="edge">
<title>cell_center_4-&gt;NeighborhoodReporter_4_1</title>
<path fill="none" stroke="#112c5f" stroke-width="2" d="M3817.9968,-505.2471C3807.6008,-493.9744 3793.7197,-478.9225 3781.2892,-465.4437"></path>
<polygon fill="#112c5f" stroke="#112c5f" stroke-width="2" points="3783.5276,-462.7082 3774.1753,-457.7298 3778.3818,-467.4538 3783.5276,-462.7082"></polygon>
</g>
<!-- cell_type_4 -->
<g id="node67" class="node">
<title>cell_type_4</title>
<g id="a_node67">
<ellipse fill="#d3d247" stroke="#000000" cx="3721" cy="-522.6" rx="44.0377" ry="18"></ellipse>
<text text-anchor="middle" x="3721" y="-518.4" font-family="Times,serif" font-size="14.00" fill="#000000">cell.type</text>
</g>
</g>
<!-- cell_type_4&#45;&gt;cell_type_0 -->

<!-- ctall_medium_adhesion_4 -->
<g id="node68" class="node">
<title>ctall_medium_adhesion_4</title>
<g id="a_node68">
<ellipse fill="#d3d247" stroke="#000000" cx="3887" cy="-698.6" rx="103.0925" ry="18"></ellipse>
<text text-anchor="middle" x="3887" y="-694.4" font-family="Times,serif" font-size="14.00" fill="#000000">ctall_medium_adhesion</text>
</g>
</g>
<!-- ctall_medium_adhesion_4&#45;&gt;ctall_medium_adhesion_0 -->
<g id="edge103" class="edge">
<title>ctall_medium_adhesion_4-&gt;ctall_medium_adhesion_0</title>
<path fill="none" stroke="#38568c" stroke-dasharray="5,2" d="M3838.1708,-682.6592C3818.4116,-676.6509 3795.2804,-670.1717 3774,-665.6 3686.2464,-646.7478 3662.5935,-651.9975 3574,-637.6 3555.6487,-634.6177 3535.9475,-631.1319 3517.4228,-627.7262"></path>
</g>
<!-- dc_4&#45;&gt;CellDivision_4_0_03 -->
<g id="edge105" class="edge">
<title>dc_4-&gt;CellDivision_4_0_03</title>
<path fill="none" stroke="#112c5f" stroke-width="2" d="M3887.9644,-207.7677C3898.978,-237.2146 3913,-299.7905 3913,-353.6 3913,-432.6 3913,-432.6 3913,-432.6 3913,-482.943 3913,-541.2061 3910.7572,-577.4853"></path>
<polygon fill="#112c5f" stroke="#112c5f" stroke-width="2" points="3907.2593,-577.3301 3910.0253,-587.5575 3914.2409,-577.8374 3907.2593,-577.3301"></polygon>
</g>
<!-- dt_4 -->
<g id="node70" class="node">
<title>dt_4</title>
<g id="a_node70">
<ellipse fill="#d3d247" stroke="#000000" cx="4035" cy="-698.6" rx="27" ry="18"></ellipse>
<text text-anchor="middle" x="4035" y="-694.4" font-family="Times,serif" font-size="14.00" fill="#000000">dt</text>
</g>
</g>
<!-- dt_4&#45;&gt;CellDivision_4_0_03 -->
<g id="edge107" class="edge">
<title>dt_4-&gt;CellDivision_4_0_03</title>
<path fill="none" stroke="#112c5f" stroke-width="2" d="M4019.9096,-683.3071C4013.7106,-677.4235 4006.2862,-670.8615 3999,-665.6 3994.6319,-662.4457 3975.2818,-651.5726 3955.1741,-640.4887"></path>
<polygon fill="#112c5f" stroke="#112c5f" stroke-width="2" points="3956.6929,-637.3296 3946.2438,-635.5786 3953.3202,-643.4636 3956.6929,-637.3296"></polygon>
</g>
<!-- isEdgeCell_4&#45;&gt;System_7197099255427773 -->

<!-- stored_center_4&#45;&gt;PersistentMotion_4_0_03 -->
<g id="edge111" class="edge">
<title>stored_center_4-&gt;PersistentMotion_4_0_03</title>
<path fill="none" stroke="#112c5f" stroke-width="2" d="M3805.7308,-59.4177C3812.2784,-67.7713 3819.4385,-77.964 3825.3557,-87.2699"></path>
<polygon fill="#112c5f" stroke="#112c5f" stroke-width="2" points="3822.3866,-89.1235 3830.5876,-95.8314 3828.3597,-85.4734 3822.3866,-89.1235"></polygon>
</g>
<!-- stored_direction_4&#45;&gt;PersistentMotion_4_0_03 -->
<g id="edge113" class="edge">
<title>stored_direction_4-&gt;PersistentMotion_4_0_03</title>
<path fill="none" stroke="#112c5f" stroke-width="2" d="M3923.2343,-59.4177C3910.5017,-68.7186 3893.6202,-80.2994 3878.1288,-90.3976"></path>
<polygon fill="#112c5f" stroke="#112c5f" stroke-width="2" points="3876.2088,-87.4711 3869.7007,-95.8314 3880.0019,-93.3544 3876.2088,-87.4711"></polygon>
</g>
<!-- targetArea_4 -->
<g id="node74" class="node">
<title>targetArea_4</title>
<g id="a_node74">
<ellipse fill="#d3d247" stroke="#000000" cx="3975" cy="-190.8" rx="51.5612" ry="18"></ellipse>
<text text-anchor="middle" x="3975" y="-186.6" font-family="Times,serif" font-size="14.00" fill="#000000">targetArea</text>
</g>
</g>
<!-- targetArea_4&#45;&gt;VolumeConstraint_4 -->
<g id="edge115" class="edge">
<title>targetArea_4-&gt;VolumeConstraint_4</title>
<path fill="none" stroke="#112c5f" stroke-width="2" d="M3973.5781,-172.5995C3972.8682,-163.5132 3971.9936,-152.3176 3971.1996,-142.1549"></path>
<polygon fill="#112c5f" stroke="#112c5f" stroke-width="2" points="3974.68,-141.7669 3970.4117,-132.0699 3967.7013,-142.3121 3974.68,-141.7669"></polygon>
</g>
<!-- targetSurface_4 -->
<g id="node75" class="node">
<title>targetSurface_4</title>
<g id="a_node75">
<ellipse fill="#d3d247" stroke="#000000" cx="4107" cy="-190.8" rx="62.5141" ry="18"></ellipse>
<text text-anchor="middle" x="4107" y="-186.6" font-family="Times,serif" font-size="14.00" fill="#000000">targetSurface</text>
</g>
</g>
<!-- targetSurface_4&#45;&gt;SurfaceConstraint_4 -->
<g id="edge117" class="edge">
<title>targetSurface_4-&gt;SurfaceConstraint_4</title>
<path fill="none" stroke="#112c5f" stroke-width="2" d="M4106.289,-172.5995C4105.9341,-163.5132 4105.4968,-152.3176 4105.0998,-142.1549"></path>
<polygon fill="#112c5f" stroke="#112c5f" stroke-width="2" points="4108.5936,-141.9256 4104.7059,-132.0699 4101.5989,-142.1989 4108.5936,-141.9256"></polygon>
</g>
<!-- System_7197099255427773&#45;&gt;dc_4 -->

<!-- System_7197099255427773&#45;&gt;targetSurface_4 --><g id="edge53" class="edge">
<title style="">cell_type_5-&gt;NeighborhoodReporter_4_1</title>
<path fill="none" stroke="#112c5f" stroke-width="2" d="M3178.9585,-506.6018C3186.8136,-501.637 3195.9653,-496.6681 3205,-493.6 3288.5115,-465.2405 3536.2966,-446.0215 3667.4353,-437.5364"></path>
<polygon fill="#112c5f" stroke="#112c5f" stroke-width="2" points="3667.6865,-441.0275 3677.4422,-436.8951 3667.2388,-434.0419 3667.6865,-441.0275"></polygon>
</g>

<!-- dc_5 --><g id="edge54" class="edge">
<title style="">cell_type_5-&gt;NeighborhoodReporter_5_1</title>
<path fill="none" stroke="#112c5f" stroke-width="2" d="M3150.9291,-504.3872C3147.3895,-493.7685 3142.807,-480.0211 3138.6009,-467.4027"></path>
<polygon fill="#112c5f" stroke="#112c5f" stroke-width="2" points="3141.8182,-465.9865 3135.3355,-457.6065 3135.1775,-468.2002 3141.8182,-465.9865"></polygon>
</g>
<g id="node87" class="node">
<title>dc_5</title>
<g id="a_node87">
<ellipse fill="#d3d247" stroke="#000000" cx="3000" cy="-190.8" rx="27" ry="18"></ellipse>
<text text-anchor="middle" x="3000" y="-186.6" font-family="Times,serif" font-size="14.00" fill="#000000">dc</text>
</g>
</g>
<!-- System_7197099255427773&#45;&gt;dc_5 -->

<!-- targetArea_5 -->
<g id="node92" class="node">
<title>targetArea_5</title>
<g id="a_node92">
<ellipse fill="#d3d247" stroke="#000000" cx="2760" cy="-190.8" rx="51.5612" ry="18"></ellipse>
<text text-anchor="middle" x="2760" y="-186.6" font-family="Times,serif" font-size="14.00" fill="#000000">targetArea</text>
</g>
</g>
<!-- System_7197099255427773&#45;&gt;targetArea_5 -->

<!-- targetSurface_5 -->
<g id="node93" class="node">
<title>targetSurface_5</title>
<g id="a_node93">
<ellipse fill="#d3d247" stroke="#000000" cx="2892" cy="-190.8" rx="62.5141" ry="18"></ellipse>
<text text-anchor="middle" x="2892" y="-186.6" font-family="Times,serif" font-size="14.00" fill="#000000">targetSurface</text>
</g>
</g>
<!-- System_7197099255427773&#45;&gt;targetSurface_5 -->

<!-- PersistentMotion_5_0_03 --><g id="edge110" class="edge">
<title style="">isEdgeCell_5-&gt;System_10_1</title>
<path fill="none" stroke="#112c5f" stroke-width="2" d="M2844.9179,-341.2198C2828.7422,-335.8443 2813.0253,-330.1908 2810,-327.6 2802.6323,-321.2904 2796.7354,-312.7797 2792.1461,-304.2315"></path>
<polygon fill="#112c5f" stroke="#112c5f" stroke-width="2" points="2795.1968,-302.5018 2787.6719,-295.0434 2788.9033,-305.5665 2795.1968,-302.5018"></polygon>
</g>
<g id="node77" class="node">
<title>PersistentMotion_5_0_03</title>
<g id="a_node77">">
<polygon fill="#fffea3" stroke="transparent" points="2962,-132 2852,-132 2852,-96 2962,-96 2962,-132"></polygon>
<text text-anchor="start" x="2855.754" y="-109.5" font-family="times" font-size="15.00" fill="#000000">PersistentMotion</text>
<polygon fill="none" stroke="#000000" points="2852,-101 2852,-127 2962,-127 2962,-101 2852,-101"></polygon>
</g>
</g>
<!-- stored_center_5 -->
<g id="node90" class="node">
<title>stored_center_5</title>
<ellipse fill="#b5b426" stroke="#000000" cx="2839" cy="-42" rx="63.0996" ry="18"></ellipse>
<text text-anchor="middle" x="2839" y="-37.8" font-family="Times,serif" font-size="14.00" fill="#000000">stored_center</text>
</g>
<!-- PersistentMotion_5_0_03&#45;&gt;stored_center_5 -->
<g id="edge15" class="edge">
<title>PersistentMotion_5_0_03-&gt;stored_center_5</title>
<path fill="none" stroke="#8f100d" stroke-width="3" d="M2883.8883,-95.8314C2874.9362,-87.2392 2864.931,-76.834 2856.5692,-67.4708"></path>
<polygon fill="#8f100d" stroke="#8f100d" stroke-width="3" points="2859.1965,-65.1583 2849.9909,-59.9134 2853.9165,-69.7542 2859.1965,-65.1583"></polygon>
</g>
<!-- stored_direction_5 -->
<g id="node91" class="node">
<title>stored_direction_5</title>
<ellipse fill="#b5b426" stroke="#000000" cx="2994" cy="-42" rx="73.5753" ry="18"></ellipse>
<text text-anchor="middle" x="2994" y="-37.8" font-family="Times,serif" font-size="14.00" fill="#000000">stored_direction</text>
</g>
<!-- PersistentMotion_5_0_03&#45;&gt;stored_direction_5 -->
<g id="edge16" class="edge">
<title>PersistentMotion_5_0_03-&gt;stored_direction_5</title>
<path fill="none" stroke="#8f100d" stroke-width="3" d="M2923.0014,-95.8314C2933.3272,-86.5362 2946.9884,-75.1192 2959.6175,-65.195"></path>
<polygon fill="#8f100d" stroke="#8f100d" stroke-width="3" points="2961.9535,-67.813 2967.7221,-58.9263 2957.6707,-62.276 2961.9535,-67.813"></polygon>
</g>
<!-- CellDivision_5_0_03 -->
<g id="node78" class="node">
<title>CellDivision_5_0_03</title>
<g id="a_node78">">
<polygon fill="#fffea3" stroke="transparent" points="3016,-637.6 2932,-637.6 2932,-587.6 3016,-587.6 3016,-637.6"></polygon>
<text text-anchor="start" x="2935.6668" y="-620.1" font-family="times" font-size="15.00" fill="#000000">CellDivision</text>
<text text-anchor="start" x="2960.875" y="-596.1" font-family="times" font-size="15.00" fill="#000000">0.03</text>
<polygon fill="#000000" stroke="#000000" points="2932,-612.6 2932,-612.6 3016,-612.6 3016,-612.6 2932,-612.6"></polygon>
<polygon fill="none" stroke="#000000" points="2932,-587.6 2932,-637.6 3016,-637.6 3016,-587.6 2932,-587.6"></polygon>
</g>
</g>
<!-- cell_center_5 -->
<g id="node84" class="node">
<title>cell_center_5</title>
<ellipse fill="#b5b426" stroke="#000000" cx="3044" cy="-522.6" rx="50.9572" ry="18"></ellipse>
<text text-anchor="middle" x="3044" y="-518.4" font-family="Times,serif" font-size="14.00" fill="#000000">cell.center</text>
</g>
<!-- CellDivision_5_0_03&#45;&gt;cell_center_5 --><g id="edge17" class="edge">
<title style="">System_10_1-&gt;dc_5</title>
<path fill="none" stroke="#8f100d" stroke-width="3" d="M2799.1186,-244.6983C2802.4748,-241.666 2806.1333,-238.9036 2810,-236.8 2871.1088,-203.5552 2898.0034,-230.7989 2964,-208.8 2965.8893,-208.1702 2967.8041,-207.4576 2969.7154,-206.6883" style=""></path>
<polygon fill="#8f100d" stroke="#8f100d" stroke-width="3" points="2971.4048,-209.767 2979.107,-202.4919 2968.5491,-203.376 2971.4048,-209.767" style=""></polygon>
</g>
<g id="edge9" class="edge">
<title>CellDivision_5_0_03-&gt;cell_center_5</title>
<path fill="none" stroke="#8f100d" stroke-width="3" d="M2993.4989,-587.53C3003.0309,-575.2746 3014.4851,-560.5478 3024.0735,-548.2198"></path>
<polygon fill="#8f100d" stroke="#8f100d" stroke-width="3" points="3026.9903,-550.1704 3030.367,-540.1281 3021.4648,-545.8728 3026.9903,-550.1704"></polygon>
</g>
<!-- CellDivision_5_0_03&#45;&gt;dc_5 --><g id="edge18" class="edge">
<title style="">System_10_1-&gt;targetArea_5</title>
<path fill="none" stroke="#8f100d" stroke-width="3" d="M2772.8837,-244.3691C2770.931,-236.25 2768.7589,-227.2187 2766.7631,-218.9201" style=""></path>
<polygon fill="#8f100d" stroke="#8f100d" stroke-width="3" points="2770.1004,-217.8285 2764.359,-208.9242 2763.2945,-219.4654 2770.1004,-217.8285" style=""></polygon>
</g>
<g id="edge10" class="edge">
<title>CellDivision_5_0_03-&gt;dc_5</title>
<path fill="none" stroke="#8f100d" stroke-width="3" d="M2967.9747,-587.5575C2965,-552.7859 2965,-487.9125 2965,-432.6 2965,-432.6 2965,-432.6 2965,-353.6 2965,-305.0453 2976.417,-249.3528 2986.7388,-217.3036"></path>
<polygon fill="#8f100d" stroke="#8f100d" stroke-width="3" points="2990.0759,-218.3625 2990.0356,-207.7677 2983.4601,-216.0752 2990.0759,-218.3625"></polygon>
</g>
<!-- isEdgeCell_5 --><g id="edge19" class="edge">
<title style="">System_10_1-&gt;targetSurface_5</title>
<path fill="none" stroke="#8f100d" stroke-width="3" d="M2800.9013,-244.7896C2803.8358,-241.9566 2806.9046,-239.2219 2810,-236.8 2822.2209,-227.238 2836.6728,-218.4344 2850.0136,-211.1446" style=""></path>
<polygon fill="#8f100d" stroke="#8f100d" stroke-width="3" points="2851.8454,-214.1346 2859.0309,-206.3488 2848.5584,-207.9543 2851.8454,-214.1346" style=""></polygon>
</g>
<g id="node89" class="node">
<title>isEdgeCell_5</title>
<g id="a_node89">
<ellipse fill="#d3d247" stroke="#000000" cx="2884" cy="-353.6" rx="53.3264" ry="18"></ellipse>
<text text-anchor="middle" x="2884" y="-349.4" font-family="Times,serif" font-size="14.00" fill="#000000">isEdgeCell</text>
</g>
</g>
<!-- NeighborhoodReporter_5_1&#45;&gt;isEdgeCell_5 -->
<g id="edge12" class="edge">
<title>NeighborhoodReporter_5_1-&gt;isEdgeCell_5</title>
<path fill="none" stroke="#8f100d" stroke-width="3" d="M3053.4325,-408.683C3014.2736,-395.9523 2967.2035,-380.6497 2932.6241,-369.4078"></path>
<polygon fill="#8f100d" stroke="#8f100d" stroke-width="3" points="2933.3608,-365.9671 2922.7686,-366.2038 2931.1965,-372.6241 2933.3608,-365.9671"></polygon>
</g>

<g id="node83" class="node">
<title>cadherin_5</title>
<g id="a_node83">
<ellipse fill="#d3d247" stroke="#000000" cx="2932" cy="-698.6" rx="44.0622" ry="18"></ellipse>
<text text-anchor="middle" x="2932" y="-694.4" font-family="Times,serif" font-size="14.00" fill="#000000">cadherin</text>
</g>
</g><g id="edge45" class="edge">
<title>cadherin_5-&gt;cadherin_0</title>
<path fill="none" stroke="#38568c" stroke-dasharray="5,2" d="M2953.2646,-682.6983C2962.8034,-676.3545 2974.485,-669.6169 2986,-665.6 3081.9812,-632.1182 3115.4595,-666.2232 3213,-637.6 3220.0165,-635.541 3227.2597,-632.6234 3234.0298,-629.5044"></path>
</g><g id="edge50" class="edge">
<title>cell_center_5-&gt;PersistentMotion_5_0_03</title>
<path fill="none" stroke="#112c5f" stroke-width="2" d="M3044.2349,-504.528C3045.0609,-434.6196 3047.2095,-185.1855 3036,-172.8 3026.2342,-162.0097 2984.4233,-170.423 2971,-164.8 2956.6809,-158.8018 2942.9085,-148.6483 2931.8321,-138.9884"></path>
<polygon fill="#112c5f" stroke="#112c5f" stroke-width="2" points="2934.0251,-136.2517 2924.2741,-132.1083 2929.3129,-141.4282 2934.0251,-136.2517"></polygon>
</g><g id="edge49" class="edge">
<title>cell_center_5-&gt;NeighborhoodReporter_5_1</title>
<path fill="none" stroke="#112c5f" stroke-width="2" d="M3060.0032,-505.2471C3070.3992,-493.9744 3084.2803,-478.9225 3096.7108,-465.4437"></path>
<polygon fill="#112c5f" stroke="#112c5f" stroke-width="2" points="3099.6182,-467.4538 3103.8247,-457.7298 3094.4724,-462.7082 3099.6182,-467.4538"></polygon>
</g><g id="node85" class="node">
<title>cell_type_5</title>
<g id="a_node85">
<ellipse fill="#d3d247" stroke="#000000" cx="3157" cy="-522.6" rx="44.0377" ry="18"></ellipse>
<text text-anchor="middle" x="3157" y="-518.4" font-family="Times,serif" font-size="14.00" fill="#000000">cell.type</text>
</g>
</g><g id="node86" class="node">
<title>ctall_medium_adhesion_5</title>
<g id="a_node86">
<ellipse fill="#d3d247" stroke="#000000" cx="3098" cy="-698.6" rx="103.0925" ry="18"></ellipse>
<text text-anchor="middle" x="3098" y="-694.4" font-family="Times,serif" font-size="14.00" fill="#000000">ctall_medium_adhesion</text>
</g>
</g><g id="edge104" class="edge">
<title>ctall_medium_adhesion_5-&gt;ctall_medium_adhesion_0</title>
<path fill="none" stroke="#38568c" stroke-dasharray="5,2" d="M3150.2337,-683.0248C3169.8573,-677.3281 3192.3976,-670.9683 3213,-665.6 3263.893,-652.339 3321.6275,-638.8253 3366.0034,-628.7627"></path>
</g><g id="edge106" class="edge">
<title>dc_5-&gt;CellDivision_5_0_03</title>
<path fill="none" stroke="#112c5f" stroke-width="2" d="M3000.7131,-209.2026C2996.578,-239.2095 2983,-300.6492 2983,-353.6 2983,-432.6 2983,-432.6 2983,-432.6 2983,-482.943 2983,-541.2061 2980.7572,-577.4853"></path>
<polygon fill="#112c5f" stroke="#112c5f" stroke-width="2" points="2977.2593,-577.3301 2980.0253,-587.5575 2984.2409,-577.8374 2977.2593,-577.3301"></polygon>
</g><g id="node88" class="node">
<title>dt_5</title>
<g id="a_node88">
<ellipse fill="#d3d247" stroke="#000000" cx="2843" cy="-698.6" rx="27" ry="18"></ellipse>
<text text-anchor="middle" x="2843" y="-694.4" font-family="Times,serif" font-size="14.00" fill="#000000">dt</text>
</g>
</g><g id="edge108" class="edge">
<title>dt_5-&gt;CellDivision_5_0_03</title>
<path fill="none" stroke="#112c5f" stroke-width="2" d="M2858.0904,-683.3071C2864.2894,-677.4235 2871.7138,-670.8615 2879,-665.6 2883.3681,-662.4457 2902.7182,-651.5726 2922.8259,-640.4887"></path>
<polygon fill="#112c5f" stroke="#112c5f" stroke-width="2" points="2924.6798,-643.4636 2931.7562,-635.5786 2921.3071,-637.3296 2924.6798,-643.4636"></polygon>
</g><g id="edge112" class="edge">
<title>stored_center_5-&gt;PersistentMotion_5_0_03</title>
<path fill="none" stroke="#112c5f" stroke-width="2" d="M2860.8113,-58.9263C2869.9224,-67.5899 2880.2908,-78.3256 2888.9674,-88.0111"></path>
<polygon fill="#112c5f" stroke="#112c5f" stroke-width="2" points="2886.5805,-90.599 2895.7931,-95.8314 2891.8542,-85.9959 2886.5805,-90.599"></polygon>
</g><g id="edge114" class="edge">
<title>stored_direction_5-&gt;PersistentMotion_5_0_03</title>
<path fill="none" stroke="#112c5f" stroke-width="2" d="M2978.5571,-59.665C2968.5788,-68.6787 2955.3348,-79.7844 2942.9101,-89.6013"></path>
<polygon fill="#112c5f" stroke="#112c5f" stroke-width="2" points="2940.6476,-86.927 2934.9062,-95.8314 2944.9473,-92.4509 2940.6476,-86.927"></polygon>
</g><g id="edge116" class="edge">
<title>targetArea_5-&gt;VolumeConstraint_5</title>
<path fill="none" stroke="#112c5f" stroke-width="2" d="M2763.5548,-172.5995C2765.3295,-163.5132 2767.5161,-152.3176 2769.501,-142.1549"></path>
<polygon fill="#112c5f" stroke="#112c5f" stroke-width="2" points="2772.9888,-142.5554 2771.4707,-132.0699 2766.1186,-141.2135 2772.9888,-142.5554"></polygon>
</g><g id="edge118" class="edge">
<title>targetSurface_5-&gt;SurfaceConstraint_5</title>
<path fill="none" stroke="#112c5f" stroke-width="2" d="M2938.1743,-178.4424C2949.2217,-174.7205 2960.772,-170.1683 2971,-164.8 2984.625,-157.6487 2998.3896,-147.7733 3009.8685,-138.6298"></path>
<polygon fill="#112c5f" stroke="#112c5f" stroke-width="2" points="3012.2645,-141.1917 3017.7883,-132.1507 3007.8321,-135.7737 3012.2645,-141.1917"></polygon>
</g><g id="node95" class="node">
<title>cadherin_6</title>
<g id="a_node95">
<ellipse fill="#d3d247" stroke="#000000" cx="3269" cy="-698.6" rx="44.0622" ry="18"></ellipse>
<text text-anchor="middle" x="3269" y="-694.4" font-family="Times,serif" font-size="14.00" fill="#000000">cadherin</text>
</g>
</g><g id="edge46" class="edge">
<title>cadherin_6-&gt;cadherin_0</title>
<path fill="none" stroke="#38568c" stroke-dasharray="5,2" d="M3268.1517,-680.3616C3267.5325,-667.0491 3266.6899,-648.9332 3266.0317,-634.7821"></path>
</g></g>
</svg>