{
  "consumes": [
    "application/json"
  ],
  "produces": [
    "application/json"
  ],
  "schemes": [
    "http"
  ],
  "swagger": "2.0",
  "info": {
    "description": "Documentation of our awesome API.",
    "title": "awesome.",
    "version": "1.0.0"
  },
  "host": "ec2-54-144-66-165.compute-1.amazonaws.com",
  "basePath": "/",
  "paths": {
    "/admin/api/urlshortener": {
      "post": {
        "description": "Create a new url shortener",
        "tags": [
          "shortener-Admin"
        ],
        "operationId": "paramPostRequest",
        "parameters": [
          {
            "name": "Body",
            "in": "body",
            "schema": {
              "type": "object",
              "properties": {
                "activo": {
                  "type": "boolean",
                  "x-go-name": "Acitvo"
                },
                "email": {
                  "type": "string",
                  "x-go-name": "Email"
                },
                "targetUrl": {
                  "type": "string",
                  "x-go-name": "TargetUrl"
                }
              }
            }
          }
        ],
        "responses": {
          "200": {
            "$ref": "#/responses/shortenerResponseWrapper"
          },
          "500": {
            "description": ""
          }
        }
      }
    },
    "/admin/api/urlshortener/{UriShortener}": {
      "get": {
        "description": "Get a url shortener",
        "tags": [
          "shortener-Admin"
        ],
        "operationId": "paramGetRequest",
        "parameters": [
          {
            "type": "string",
            "description": "Code of UriShortener to return",
            "name": "UriShortener",
            "in": "path",
            "required": true
          }
        ],
        "responses": {
          "200": {
            "$ref": "#/responses/shortenerResponseWrapper"
          },
          "404": {
            "description": ""
          },
          "500": {
            "description": ""
          }
        }
      },
      "put": {
        "description": "Update a url shortener",
        "tags": [
          "shortener-Admin"
        ],
        "operationId": "paramPutRequest",
        "parameters": [
          {
            "type": "string",
            "description": "Code of UriShortener to update",
            "name": "UriShortener",
            "in": "path",
            "required": true
          },
          {
            "name": "Body",
            "in": "body",
            "schema": {
              "$ref": "#/definitions/ShortenerUrl"
            }
          }
        ],
        "responses": {
          "200": {
            "$ref": "#/responses/shortenerResponseWrapper"
          },
          "404": {
            "description": ""
          },
          "500": {
            "description": ""
          }
        }
      },
      "delete": {
        "description": "DELETE a url shortener",
        "tags": [
          "shortener-Admin"
        ],
        "operationId": "paramDeleteRequest",
        "parameters": [
          {
            "type": "string",
            "description": "Code of UriShortener to delete",
            "name": "UriShortener",
            "in": "path",
            "required": true
          }
        ],
        "responses": {
          "200": {
            "description": ""
          },
          "404": {
            "description": ""
          },
          "500": {
            "description": ""
          }
        }
      }
    },
    "/admin/metric": {
      "get": {
        "description": "Metric for prometheus",
        "tags": [
          "shortener-Metric"
        ],
        "operationId": "paramGetMetricRequest",
        "responses": {
          "200": {
            "description": ""
          }
        }
      }
    },
    "/{UriShortener}": {
      "get": {
        "description": "Get a url shortener",
        "tags": [
          "shortener-Server"
        ],
        "operationId": "paramGetRedirect",
        "parameters": [
          {
            "type": "string",
            "description": "Code of UriShortener to redirect",
            "name": "UriShortener",
            "in": "path",
            "required": true
          }
        ],
        "responses": {
          "308": {
            "description": ""
          }
        }
      }
    }
  },
  "definitions": {
    "ShortenerUrl": {
      "type": "object",
      "properties": {
        "activo": {
          "type": "boolean",
          "x-go-name": "Acitvo"
        },
        "email": {
          "type": "string",
          "x-go-name": "Email"
        },
        "id": {
          "type": "integer",
          "format": "int64",
          "x-go-name": "Id"
        },
        "shortenerUri": {
          "type": "string",
          "x-go-name": "ShortenerUri"
        },
        "shortenerUrl": {
          "type": "string",
          "x-go-name": "ShortenerUrl"
        },
        "targetUrl": {
          "type": "string",
          "x-go-name": "TargetUrl"
        }
      },
      "x-go-package": "urlshortener.fmac.com/model"
    }
  },
  "responses": {
    "shortenerResponseDeleteWrapper": {
      "description": "",
      "schema": {
        "$ref": "#/definitions/ShortenerUrl"
      }
    },
    "shortenerResponseWrapper": {
      "description": "",
      "schema": {
        "$ref": "#/definitions/ShortenerUrl"
      }
    }
  },
  "securityDefinitions": {
    "basic": {
      "type": "basic"
    }
  }
}