<?xml version="1.0" encoding="UTF-8" standalone="no"?>
<!DOCTYPE svg PUBLIC "-//W3C//DTD SVG 1.1//EN" "http://www.w3.org/Graphics/SVG/1.1/DTD/svg11.dtd">
<svg xmlns="http://www.w3.org/2000/svg" version="1.1">
    <title/>
    <desc xmlns:goal="http://goal.im.ntu.edu.tw/">
        <goal:description/>
        <goal:formula/>
        <goal:alphabet type="propositional"/>
    </desc>
    <defs>
        <marker id="Arrow" markerHeight="8" markerUnits="strokeWidth" markerWidth="8" orient="auto" refX="30" refY="10" viewBox="0 0 30 20">
            <path d="M 0 0 L 30 10 L 0 20" fill="none" stroke="#000000" stroke-width="1.5"/>
        </marker>
    </defs>
    <g id="automaton" onmouseup="mouseUp(evt)">
        <g id="transitions">
            <g from="s0" opacity="1.0" to="s1">
                <path d="M100.0,218.0 Q104.0,202.0 108.0,186.0" fill="none" marker-end="url(#Arrow)" stroke="#000000" stroke-width="1.5"/>
                <text alignment-baseline="central" color="#000000" font-family="Dialog" font-size="12px" text-anchor="middle" transform="rotate(-75.96375653207353,104.0,202.0) translate(0,-9.0)" x="104.0" y="202.0">Lift</text>
            </g>
            <g from="s1" opacity="1.0" to="s2">
                <path d="M124.0,155.0 Q134.0,144.0 144.0,133.0" fill="none" marker-end="url(#Arrow)" stroke="#000000" stroke-width="1.5"/>
                <text alignment-baseline="central" color="#000000" font-family="Dialog" font-size="12px" text-anchor="middle" transform="rotate(-47.72631099390627,134.0,144.0) translate(0,-9.0)" x="134.0" y="144.0">Cargo</text>
            </g>
            <g from="s2" opacity="1.0" to="s3">
                <path d="M173.0,113.0 Q187.5,107.5 202.0,102.0" fill="none" marker-end="url(#Arrow)" stroke="#000000" stroke-width="1.5"/>
                <text alignment-baseline="central" color="#000000" font-family="Dialog" font-size="12px" text-anchor="middle" transform="rotate(-20.772254682045833,187.5,107.5) translate(0,-9.0)" x="187.5" y="107.5">CargoOk</text>
            </g>
            <g from="s2" opacity="1.0" to="s4">
                <path d="M174.0,117.0 Q220.5,111.5 267.0,106.0" fill="none" marker-end="url(#Arrow)" stroke="#000000" stroke-width="1.5"/>
                <text alignment-baseline="central" color="#000000" font-family="Dialog" font-size="12px" text-anchor="middle" transform="rotate(-6.74557964748282,220.5,111.5) translate(0,-9.0)" x="220.5" y="111.5">Lift</text>
            </g>
            <g from="s2" opacity="1.0" to="s4">
                <text alignment-baseline="central" color="#000000" font-family="Dialog" font-size="12px" text-anchor="middle" transform="rotate(-6.74557964748282,219.2294905600798,100.0736188166862) translate(0,-9.0)" x="219.2294905600798" y="100.0736188166862">move</text>
            </g>
            <g from="s3" opacity="1.0" to="s6">
                <path d="M234.0,106.0 Q295.0,148.5 356.0,191.0" fill="none" marker-end="url(#Arrow)" stroke="#000000" stroke-width="1.5"/>
                <text alignment-baseline="central" color="#000000" font-family="Dialog" font-size="12px" text-anchor="middle" transform="rotate(34.86574871260432,295.0,148.5) translate(0,-9.0)" x="295.0" y="148.5">Lambda</text>
            </g>
            <g from="s3" opacity="1.0" to="s7">
                <path d="M231.0,109.0 Q295.0,182.0 359.0,255.0" fill="none" marker-end="url(#Arrow)" stroke="#000000" stroke-width="1.5"/>
                <text alignment-baseline="central" color="#000000" font-family="Dialog" font-size="12px" text-anchor="middle" transform="rotate(48.758555685472,295.0,182.0) translate(0,-9.0)" x="295.0" y="182.0">Lift</text>
            </g>
            <g from="s3" opacity="1.0" to="s7">
                <text alignment-baseline="central" color="#000000" font-family="Dialog" font-size="12px" text-anchor="middle" transform="rotate(48.56326806290617,303.7426199402926,174.4658242388112) translate(0,-9.0)" x="303.7426199402926" y="174.4658242388112">move</text>
            </g>
            <g from="s10" opacity="1.0" to="s3">
                <path d="M219.0,355.0 Q219.0,234.5 219.0,114.0" fill="none" marker-end="url(#Arrow)" stroke="#000000" stroke-width="1.5"/>
                <text alignment-baseline="central" color="#000000" font-family="Dialog" font-size="12px" text-anchor="middle" transform="rotate(-90.0,219.0,234.5) translate(0,-9.0)" x="219.0" y="234.5">CargoOk</text>
            </g>
            <g from="s4" opacity="1.0" to="s5">
                <path d="M300.0,114.0 Q312.5,123.0 325.0,132.0" fill="none" marker-end="url(#Arrow)" stroke="#000000" stroke-width="1.5"/>
                <text alignment-baseline="central" color="#000000" font-family="Dialog" font-size="12px" text-anchor="middle" transform="rotate(35.75388725443675,312.5,123.0) translate(0,-9.0)" x="312.5" y="123.0">True</text>
            </g>
            <g from="s6" opacity="1.0" to="s9">
                <path d="M363.0,217.0 Q328.0,283.0 293.0,349.0" fill="none" marker-end="url(#Arrow)" stroke="#000000" stroke-width="1.5"/>
                <text alignment-baseline="central" color="#000000" font-family="Dialog" font-size="12px" text-anchor="middle" transform="rotate(297.9371428265386,328.0,283.0) translate(0,7.0)" x="328.0" y="283.0">Lift</text>
            </g>
            <g from="s7" opacity="1.0" to="s8">
                <path d="M363.0,284.0 Q355.5,297.5 348.0,311.0" fill="none" marker-end="url(#Arrow)" stroke="#000000" stroke-width="1.5"/>
                <text alignment-baseline="central" color="#000000" font-family="Dialog" font-size="12px" text-anchor="middle" transform="rotate(299.05460409907715,355.5,297.5) translate(0,7.0)" x="355.5" y="297.5">True</text>
            </g>
            <g from="s9" opacity="1.0" to="s10">
                <path d="M267.0,367.0 Q252.0,369.0 237.0,371.0" fill="none" marker-end="url(#Arrow)" stroke="#000000" stroke-width="1.5"/>
                <text alignment-baseline="central" color="#000000" font-family="Dialog" font-size="12px" text-anchor="middle" transform="rotate(352.40535663140855,252.0,369.0) translate(0,7.0)" x="252.0" y="369.0">Cargo</text>
            </g>
            <g from="s10" opacity="1.0" to="s11">
                <path d="M202.0,367.0 Q187.5,361.5 173.0,356.0" fill="none" marker-end="url(#Arrow)" stroke="#000000" stroke-width="1.5"/>
                <text alignment-baseline="central" color="#000000" font-family="Dialog" font-size="12px" text-anchor="middle" transform="rotate(20.77225468204582,187.5,361.5) translate(0,7.0)" x="187.5" y="361.5">Lift</text>
            </g>
            <g from="s10" opacity="1.0" to="s11">
                <text alignment-baseline="central" color="#000000" font-family="Dialog" font-size="12px" text-anchor="middle" transform="rotate(20.77225468204582,183.72766028707147,372.3329305180216) translate(0,7.0)" x="183.72766028707147" y="372.3329305180216">move</text>
            </g>
            <g from="s11" opacity="1.0" to="s12">
                <path d="M144.0,336.0 Q134.0,325.0 124.0,314.0" fill="none" marker-end="url(#Arrow)" stroke="#000000" stroke-width="1.5"/>
                <text alignment-baseline="central" color="#000000" font-family="Dialog" font-size="12px" text-anchor="middle" transform="rotate(47.72631099390626,134.0,325.0) translate(0,7.0)" x="134.0" y="325.0">True</text>
            </g>
            <g from="s5" opacity="1.0" to="s5">
                <path d="M356.0,133.0 Q340.0,62.0 324.0,133.0" fill="none" marker-end="url(#Arrow)" stroke="#000000" stroke-width="1.5"/>
                <text alignment-baseline="central" color="#000000" font-family="Dialog" font-size="12px" text-anchor="middle" transform="rotate(360.0,340.0,97.5) translate(0,-9.0)" x="340.0" y="97.5">True</text>
            </g>
            <g from="s8" opacity="1.0" to="s8">
                <path d="M349.0,311.0 Q420.0,327.0 349.0,343.0" fill="none" marker-end="url(#Arrow)" stroke="#000000" stroke-width="1.5"/>
                <text alignment-baseline="central" color="#000000" font-family="Dialog" font-size="12px" text-anchor="middle" transform="rotate(90.0,384.5,327.0) translate(0,-9.0)" x="384.5" y="327.0">True</text>
            </g>
            <g from="s12" opacity="1.0" to="s12">
                <path d="M121.0,284.0 Q192.0,300.0 121.0,316.0" fill="none" marker-end="url(#Arrow)" stroke="#000000" stroke-width="1.5"/>
                <text alignment-baseline="central" color="#000000" font-family="Dialog" font-size="12px" text-anchor="middle" transform="rotate(90.0,156.5,300.0) translate(0,-9.0)" x="156.5" y="300.0">True</text>
            </g>
        </g>
        <g cursor="move" id="states" onmousedown="mouseDown(evt)" onmousemove="mouseMove(evt)">
            <g id="s0" opacity="1.0">
                <circle cx="96" cy="235" fill="#ffff78" r="18.0" stroke="#000000" stroke-width="1.5" type="state"/>
                <path d="M68.00,241.00 L78.00,235.00 L68.00,229.00 L68.00,241.00 " fill="none" stroke="#000000" stroke-width="1.5"/>
                <text alignment-baseline="central" color="#000000" font-family="Dialog" font-size="12px" text-anchor="middle" x="96.0" y="235.0">s0</text>
            </g>
            <g id="s1" opacity="1.0">
                <circle cx="112" cy="169" fill="#ffff78" r="18.0" stroke="#000000" stroke-width="1.5" type="state"/>
                <text alignment-baseline="central" color="#000000" font-family="Dialog" font-size="12px" text-anchor="middle" x="112.0" y="169.0">s1</text>
            </g>
            <g id="s2" opacity="1.0">
                <circle cx="156" cy="119" fill="#ffff78" r="18.0" stroke="#000000" stroke-width="1.5" type="state"/>
                <text alignment-baseline="central" color="#000000" font-family="Dialog" font-size="12px" text-anchor="middle" x="156.0" y="119.0">s2</text>
            </g>
            <g id="s3" opacity="1.0">
                <circle cx="219" cy="96" fill="#ffff78" r="18.0" stroke="#000000" stroke-width="1.5" type="state"/>
                <text alignment-baseline="central" color="#000000" font-family="Dialog" font-size="12px" text-anchor="middle" x="219.0" y="96.0">s3</text>
            </g>
            <g id="s4" opacity="1.0">
                <circle cx="285" cy="104" fill="#ffff78" r="18.0" stroke="#000000" stroke-width="1.5" type="state"/>
                <text alignment-baseline="central" color="#000000" font-family="Dialog" font-size="12px" text-anchor="middle" x="285.0" y="104.0">s4</text>
            </g>
            <g id="s5" opacity="1.0">
                <circle cx="340" cy="142" fill="#ffff78" r="18.0" stroke="#000000" stroke-width="1.5" type="state"/>
                <text alignment-baseline="central" color="#000000" font-family="Dialog" font-size="12px" text-anchor="middle" x="340.0" y="142.0">s5</text>
            </g>
            <g id="s6" opacity="1.0">
                <circle cx="371" cy="201" fill="#ffff78" r="18.0" stroke="#000000" stroke-width="1.5" type="state"/>
                <text alignment-baseline="central" color="#000000" font-family="Dialog" font-size="12px" text-anchor="middle" x="371.0" y="201.0">s6</text>
            </g>
            <g id="s7" opacity="1.0">
                <circle cx="371" cy="268" fill="#ffff78" r="18.0" stroke="#000000" stroke-width="1.5" type="state"/>
                <text alignment-baseline="central" color="#000000" font-family="Dialog" font-size="12px" text-anchor="middle" x="371.0" y="268.0">s7</text>
            </g>
            <g id="s8" opacity="1.0">
                <circle cx="340" cy="327" fill="#ffff78" r="18.0" stroke="#000000" stroke-width="1.5" type="state"/>
                <text alignment-baseline="central" color="#000000" font-family="Dialog" font-size="12px" text-anchor="middle" x="340.0" y="327.0">s8</text>
            </g>
            <g id="s9" opacity="1.0">
                <circle cx="285" cy="365" fill="#ffff78" r="18.0" stroke="#000000" stroke-width="1.5" type="state"/>
                <text alignment-baseline="central" color="#000000" font-family="Dialog" font-size="12px" text-anchor="middle" x="285.0" y="365.0">s9</text>
            </g>
            <g id="s10" opacity="1.0">
                <circle cx="219" cy="373" fill="#ffff78" r="18.0" stroke="#000000" stroke-width="1.5" type="state"/>
                <text alignment-baseline="central" color="#000000" font-family="Dialog" font-size="12px" text-anchor="middle" x="219.0" y="373.0">s10</text>
            </g>
            <g id="s11" opacity="1.0">
                <circle cx="156" cy="350" fill="#ffff78" r="18.0" stroke="#000000" stroke-width="1.5" type="state"/>
                <text alignment-baseline="central" color="#000000" font-family="Dialog" font-size="12px" text-anchor="middle" x="156.0" y="350.0">s11</text>
            </g>
            <g id="s12" opacity="1.0">
                <circle cx="112" cy="300" fill="#ffff78" r="18.0" stroke="#000000" stroke-width="1.5" type="state"/>
                <text alignment-baseline="central" color="#000000" font-family="Dialog" font-size="12px" text-anchor="middle" x="112.0" y="300.0">s12</text>
            </g>
        </g>
    </g>
    <script type="text/javascript"><![CDATA[
var target = null;
var sx = 0;
var sy = 0;

function isCircleNode(node) {
  return node != null && node.nodeName == "circle";
}

function isRectNode(node) {
  return node != null && node.nodeName == "rect";
}

function isStateNode(node) {
  return (isCircleNode(node) || isRectNode(node)) && node.getAttribute("type") == "state";
}

function isTextNode(node) {
  return node != null && node.nodeName == "text";
}

function isPathNode(node) {
  return node != null && node.nodeName == "path";
}
    
function isPolygonNode(node) {
  return node != null && node.nodeName == "polygon";
}

function getX(node) {
  if (isCircleNode(node))
    return parseFloat(node.getAttribute("cx"));
  else if (isRectNode(node) || isTextNode(node))
    return parseFloat(node.getAttribute("x"));
}

function setX(node, x) {
  if (isCircleNode(node))
    return node.setAttribute("cx", x);
  else if (isRectNode(node) || isTextNode(node))
    return node.setAttribute("x", x);
}

function getY(node) {
  if (isCircleNode(node))
    return parseFloat(node.getAttribute("cy"));
  else if (isRectNode(node) || isTextNode(node))
    return parseFloat(node.getAttribute("y"));
}

function setY(node, y) {
  if (isCircleNode(node))
    return node.setAttribute("cy", y);
  else if (isRectNode(node) || isTextNode(node))
    return node.setAttribute("y", y);
}

function getWidth(node) {
  if (isCircleNode(node))
    return parseFloat(node.getAttribute("r"));
  else if (isRectNode(node))
    return parseFloat(node.getAttribute("width"));
}

function getHeight(node) {
  if (isCircleNode(node))
    return parseFloat(node.getAttribute("r"));
  else if (isRectNode(node))
    return parseFloat(node.getAttribute("height"));
}
 
function mouseDown(evt) {
  target = evt.target;
  if (target == null)
    return;
  if (target.nodeName == "g") {
    var parent = target;
    for (var i = 0; !isStateNode(target) && i < parent.childNodes.length; i++) {
      target = parent.childNodes[i];
    }
  } else {
    var parent = target.parentNode;
    for (var i = 0; !isStateNode(target) && i < parent.childNodes.length; i++) {
      target = parent.childNodes[i];
    }
  }
      
  /* Determine the center. */
  sx = getX(target);
  sy = getY(target);
  if (isRectNode(target)) {
    sx += getWidth(target) / 2;
    sy += getHeight(target) / 2;
  }
}
    
function mouseUp(evt) {
  target = null;
}
    
function mouseMove(evt) {
  if (target == null)
    return;
  var dx = evt.clientX - sx;
  var dy = evt.clientY - sy;
  var state = target.parentNode;
  moveState(state, dx, dy);
  moveTransitions(state, dx, dy);
}

function getTransitionsFromState(sid) {
  var ret = new Array();
  var trans = document.getElementById("transitions").childNodes;
  for (var i in trans) {
    if (trans[i].nodeName != "g")
      continue;
    if (trans[i].getAttribute("from") == sid)
      ret.push(trans[i]);
  }
  return ret;
}

function getTransitionsToState(sid) {
  var ret = new Array();
  var trans = document.getElementById("transitions").childNodes;
  for (var i in trans) {
    if (trans[i].nodeName != "g")
      continue;
    if (trans[i].getAttribute("to") == sid)
      ret.push(trans[i]);
  }
  return ret;
}
    
function movePoint(node, xn, yn, dx, dy) {
  var x = parseFloat(node.getAttribute(xn)) + dx;
  var y = parseFloat(node.getAttribute(yn)) + dy;
  node.setAttribute(xn, x);
  node.setAttribute(yn, y);      
  return [x, y];
}
    
function movePoints(node, an, dx, dy) {
  var points = node.getAttribute(an).split(" ");
  for (var i = 0; i < points.length; i++) {
    var cs = points[i].split(",");
    var x = parseFloat(cs[0]);
    var y = parseFloat(cs[1]);
    points[i] = (x + dx) + "," + (y + dy);
  }
  node.setAttribute(an, points.join(" "));
}

function moveState(state, dx, dy) {
  var childs = state.childNodes;
  for (var i in childs) {
    var child = childs[i];

    var xn = null;
    var yn = null;
    if (isCircleNode(child)) {
      var cs = movePoint(child, "cx", "cy", dx, dy);
      if (isStateNode(child)) {
        sx = cs[0];
        sy = cs[1];
      }
    } else if (isRectNode(child)) {
      var cs = movePoint(child, "x", "y", dx, dy);
      if (isStateNode(child)) {
        sx = cs[0] + getWidth(child) / 2;
        sy = cs[1] + getWidth(child) / 2;
      }
    } else if (isTextNode(child)) {
      movePoint(child, "x", "y", dx, dy);
    } else if (isPolygonNode(child)) {
      movePoints(child, "points", dx, dy);
    }
  }
}

function moveTransitions(state, dx, dy) {
    var id = state.getAttribute("id");

    var trans = getTransitionsFromState(id);
    for (var i in trans)
      moveTransition(trans[i], id, dx, dy);

    trans = getTransitionsToState(id);
    for (var i in trans) {
      /* Skip self-loops. */
      if (trans[i].getAttribute("from") == id)
        continue;
      moveTransition(trans[i], id, dx, dy);
    }
}
    
function moveTransition(tran, sid, dx, dy) {
  var from = tran.getAttribute("from");
  var to = tran.getAttribute("to");

  var childs = tran.childNodes;
  for (var i in childs) {
    var child = childs[i];
    if (isPathNode(child)) {
      var points = child.getAttribute("d").split(" ");
      for (var j in points) {
        var point = points[j];
        var mod = point.charAt(0) == "M" || point.charAt(0) == "Q" ? point.charAt(0) : "";
        var cods = (mod.length == 0 ? point : point.substr(1)).split(",");
        var x = parseFloat(cods[0]);
        var y = parseFloat(cods[1]);

        if (from == sid && j == 0 || from == sid && to == sid && j == 1 || to == sid && j == 2)
          points[j] = mod + (x + dx) + "," + (y + dy);
        else if (j == 1)
          points[j] = mod + (x + dx / 2) + "," + (y + dy / 2);
      }
      child.setAttribute("d", points.join(" "));
    } else if (isTextNode(child)) {
      if (from != sid || to != sid) {
        dx = dx / 2;
        dy = dy / 2;
      }
      movePoint(child, "x", "y", dx, dy);

      var transforms = child.getAttribute("transform").split(" ");
      for (var j in transforms) {
        var transform = transforms[j];
        if (!transform.match(/rotate\(.*\)/))
          continue;
        var ts = transform.substring(7, transform.length - 1).split(",");
        ts[1] = parseFloat(ts[1]) + dx;
        ts[2] = parseFloat(ts[2]) + dy;
        transforms[j] = "rotate(" + ts.join(",") + ")";
      }
      child.setAttribute("transform", transforms.join(" "));
    } 
  }
}

]]></script>
</svg>
