<?xml version="1.0" encoding="UTF-8" standalone="no"?>
<svg
   width="28"
   height="28"
   viewBox="48.478 103.112 25.384 21"
   version="1.1"
   style="text-align:center"
   id="svg4"
   sodipodi:docname="comd.svg"
   inkscape:version="1.2.2 (b0a8486541, 2022-12-01)"
   xmlns:inkscape="http://www.inkscape.org/namespaces/inkscape"
   xmlns:sodipodi="http://sodipodi.sourceforge.net/DTD/sodipodi-0.dtd"
   xmlns="http://www.w3.org/2000/svg"
   xmlns:svg="http://www.w3.org/2000/svg"
   xmlns:rdf="http://www.w3.org/1999/02/22-rdf-syntax-ns#"
   xmlns:cc="http://creativecommons.org/ns#"
   xmlns:dc="http://purl.org/dc/elements/1.1/">
  <metadata
     id="metadata10">
    <rdf:RDF>
      <cc:Work
         rdf:about="">
        <dc:format>image/svg+xml</dc:format>
        <dc:type
           rdf:resource="http://purl.org/dc/dcmitype/StillImage" />
      </cc:Work>
    </rdf:RDF>
  </metadata>
  <defs
     id="defs8">
    <clipPath
       clipPathUnits="userSpaceOnUse"
       id="clipPath2004">
      <rect
         style="fill:none;fill-rule:evenodd;stroke-width:0.90657"
         id="rect2006"
         width="26.767981"
         height="26.52632"
         x="78.921684"
         y="137.42365" />
    </clipPath>
    <clipPath
       clipPathUnits="userSpaceOnUse"
       id="clipPath2010">
      <rect
         style="fill:none;fill-rule:evenodd;stroke-width:0.90657"
         id="rect2012"
         width="23.811476"
         height="24.462343"
         x="80.189255"
         y="138.42543" />
    </clipPath>
  </defs>
  <sodipodi:namedview
     pagecolor="#ffffff"
     bordercolor="#666666"
     borderopacity="1"
     objecttolerance="10"
     gridtolerance="10"
     guidetolerance="10"
     inkscape:pageopacity="0"
     inkscape:pageshadow="2"
     inkscape:window-width="1846"
     inkscape:window-height="1136"
     id="namedview6"
     showgrid="false"
     fit-margin-top="0"
     fit-margin-left="0"
     fit-margin-right="0"
     fit-margin-bottom="0"
     inkscape:zoom="18.346666"
     inkscape:cx="8.9662067"
     inkscape:cy="4.9327763"
     inkscape:window-x="0"
     inkscape:window-y="0"
     inkscape:window-maximized="1"
     inkscape:current-layer="svg4"
     inkscape:showpageshadow="2"
     inkscape:pagecheckerboard="0"
     inkscape:deskcolor="#d1d1d1" />
  <g
     id="g2016"
     transform="translate(-30.827097,-36.936497)">
    <rect
       style="opacity:1;vector-effect:none;fill:#2b2d2d;fill-opacity:1;fill-rule:nonzero;stroke:none;stroke-width:1.77478;stroke-linecap:butt;stroke-linejoin:miter;stroke-miterlimit:4;stroke-dasharray:none;stroke-dashoffset:0;stroke-opacity:1"
       id="rect4498"
       width="25.384001"
       height="25.384001"
       x="79.30143"
       y="137.91486" />
    <path
       d="m 145.92307,161.29766 h 5.16225 v -12.11637 c 0,-1.83016 0.34078,-3.21033 1.02364,-4.13857 0.68286,-0.93077 1.68209,-1.39657 3.00008,-1.39657 1.31736,0 2.29891,0.4658 2.9416,1.39657 0.64398,0.92824 0.96532,2.29396 0.96532,4.09212 v 12.16282 h 5.1629 v -13.72122 c 0,-1.28726 -0.20582,-2.46848 -0.6157,-3.54612 -0.41116,-1.07827 -0.97657,-2.00407 -1.69831,-2.7798 -0.72126,-0.77444 -1.57283,-1.37889 -2.55759,-1.81384 -0.98476,-0.4343 -2.04359,-0.65088 -3.17521,-0.65088 -1.44108,0 -2.73272,0.32649 -3.87189,0.97673 -1.13917,0.65072 -2.0812,1.59725 -2.82495,2.83748 -0.79019,-1.24023 -1.73655,-2.18676 -2.83748,-2.83748 -1.10029,-0.65024 -2.35675,-0.97673 -3.76761,-0.97673 -0.60446,0 -1.16681,0.0741 -1.68514,0.22044 -0.52106,0.1475 -0.98541,0.34191 -1.39657,0.58116 -0.411,0.241 -0.77139,0.5127 -1.08132,0.81461 -0.3101,0.30254 -0.55738,0.60124 -0.74376,0.89495 v -1.88277 h -5.06938 v 21.88347 h 5.16225 v -12.11637 c 0,-1.83016 0.31701,-3.21033 0.95279,-4.13857 0.63642,-0.93077 1.61364,-1.39657 2.93099,-1.39657 1.31736,0 2.31658,0.4658 2.99944,1.39657 0.68286,0.92824 1.02365,2.29396 1.02365,4.09212 z m 139.4398,-4.86036 c -0.44989,0.20084 -0.91102,0.3565 -1.38339,0.46445 -0.47238,0.10921 -0.94155,0.16381 -1.4075,0.16381 -0.48041,0 -0.91744,-0.0709 -1.3143,-0.21026 -0.39525,-0.13871 -0.73106,-0.36339 -1.01063,-0.67344 -0.27957,-0.31005 -0.49648,-0.71802 -0.65073,-1.22137 -0.15585,-0.50399 -0.23297,-1.12785 -0.23297,-1.87159 v -9.04733 h 6.53456 v -4.62738 h -6.53456 v -6.62776 h -5.16241 v 20.58052 c 0,2.91596 0.68928,5.07061 2.06946,6.46519 1.37857,1.39648 3.34039,2.09378 5.88383,2.09378 0.8837,0 1.70153,-0.0979 2.45348,-0.29059 0.75194,-0.19457 1.45248,-0.43872 2.10481,-0.73307 z M 82.655023,154.99439 c 0.596246,1.41215 1.422209,2.6285 2.475997,3.65216 1.053788,1.02366 2.310296,1.82515 3.767646,2.40696 1.457349,0.58182 3.038337,0.87241 4.744857,0.87241 1.87473,0 3.597575,-0.3339 5.16227,-1.00107 1.566557,-0.66529 2.914607,-1.63561 4.047507,-2.90655 l -3.070296,-3.86118 c -0.774442,0.86928 -1.685778,1.57034 -2.733332,2.10508 -1.046268,0.53473 -2.182272,0.80336 -3.406149,0.80336 -0.930134,0 -1.799405,-0.16381 -2.604649,-0.4883 -0.806496,-0.32636 -1.508813,-0.77951 -2.105069,-1.36132 -0.597494,-0.58118 -1.061934,-1.28162 -1.394575,-2.10444 -0.33391,-0.82095 -0.500849,-1.72912 -0.500849,-2.72015 0,-0.99291 0.166939,-1.90422 0.500849,-2.73332 0.332641,-0.82909 0.797081,-1.54207 1.394575,-2.1402 0.596256,-0.59561 1.298573,-1.0569 2.105069,-1.38323 0.805244,-0.32649 1.674515,-0.48845 2.604649,-0.48845 1.223877,0 2.356748,0.27186 3.394838,0.81478 1.039424,0.54291 1.953812,1.25453 2.744643,2.1383 l 3.070296,-3.85927 c -1.1329,-1.25646 -2.48095,-2.2287 -4.047507,-2.91911 -1.564695,-0.68977 -3.28754,-1.03505 -5.16227,-1.03505 -1.70652,0 -3.287508,0.29387 -4.744857,0.8837 -1.45735,0.58935 -2.713858,1.39962 -3.767646,2.43082 -1.053788,1.03007 -1.879751,2.25569 -2.475997,3.67298 -0.597502,1.41904 -0.894997,2.95798 -0.894997,4.61805 0,1.65819 0.297495,3.194 0.894997,4.60304 M 112.31853,139.6695 c -1.44284,0.58935 -2.68677,1.40283 -3.73243,2.44223 -1.04758,1.03811 -1.86525,2.25874 -2.45347,3.66157 -0.58983,1.40459 -0.8837,2.92785 -0.8837,4.57162 0,1.64312 0.29387,3.16951 0.8837,4.58043 0.58822,1.4109 1.40589,2.63666 2.45347,3.67477 1.04566,1.03934 2.28959,1.85212 3.73243,2.4421 1.44107,0.58808 3.00763,0.8837 4.69791,0.8837 1.68883,0 3.25041,-0.29562 4.68522,-0.8837 1.4348,-0.58998 2.67873,-1.40276 3.73242,-2.4421 1.05385,-1.03811 1.87987,-2.26387 2.47725,-3.67477 0.59626,-1.41092 0.89511,-2.93731 0.89511,-4.58043 0,-1.64377 -0.29885,-3.16703 -0.89511,-4.57162 -0.59738,-1.40283 -1.4234,-2.62346 -2.47725,-3.66157 -1.05369,-1.0394 -2.29762,-1.85288 -3.73242,-2.44223 -1.43481,-0.58983 -2.99639,-0.8837 -4.68522,-0.8837 -1.69028,0 -3.25684,0.29387 -4.69791,0.8837 m 2.0693,16.90776 c -0.79083,-0.32636 -1.47369,-0.78265 -2.04729,-1.37199 -0.57296,-0.58997 -1.01866,-1.29542 -1.33615,-2.11637 -0.31829,-0.82282 -0.47768,-1.73665 -0.47768,-2.74398 0,-0.99354 0.16388,-1.89921 0.48828,-2.72203 0.32633,-0.82094 0.77637,-1.52639 1.34997,-2.1163 0.57377,-0.58935 1.2547,-1.04566 2.04553,-1.37199 0.79212,-0.32649 1.65943,-0.48845 2.60595,-0.48845 0.94459,0 1.81689,0.16196 2.61591,0.48845 0.79838,0.32633 1.4843,0.78264 2.05806,1.37199 0.5736,0.58991 1.02364,1.29536 1.34804,2.1163 0.32633,0.82282 0.48829,1.72849 0.48829,2.72203 0,1.00733 -0.16196,1.92116 -0.48829,2.74398 -0.3244,0.82095 -0.77444,1.5264 -1.34804,2.11637 -0.57376,0.58934 -1.25968,1.04563 -2.05806,1.37199 -0.79902,0.32449 -1.67132,0.4883 -2.61591,0.4883 -0.96227,0 -1.83842,-0.16381 -2.62861,-0.4883 m 76.76765,-28.81074 h -5.16225 v 14.11223 c -0.69716,-0.96082 -1.60849,-1.71775 -2.7332,-2.26693 -1.12295,-0.55111 -2.45348,-0.82602 -3.98806,-0.82602 -1.55017,0 -2.98498,0.29066 -4.30233,0.87245 -1.31736,0.5818 -2.46151,1.3834 -3.43053,2.40704 -0.96917,1.02365 -1.72418,2.2393 -2.26709,3.65017 -0.54291,1.41097 -0.81268,2.95494 -0.81268,4.62946 0,1.67387 0.26977,3.21972 0.81268,4.63817 0.54291,1.41907 1.29792,2.6398 2.26709,3.66346 0.96902,1.02366 2.11317,1.82515 3.43053,2.40696 1.31735,0.58182 2.75216,0.87241 4.30233,0.87241 1.55097,0 2.89211,-0.26863 4.02373,-0.80337 1.13097,-0.53348 2.03042,-1.29041 2.69753,-2.267 v 2.44211 h 5.16225 z m -13.83729,28.77497 c -0.7738,-0.34834 -1.42967,-0.8291 -1.96439,-1.44104 -0.53536,-0.61194 -0.93832,-1.32555 -1.21018,-2.14021 -0.26977,-0.81466 -0.40666,-1.68519 -0.40666,-2.61532 0,-0.93078 0.13689,-1.80319 0.40666,-2.61785 0.27186,-0.81278 0.67482,-1.52326 1.21018,-2.12697 0.53472,-0.60445 1.19059,-1.08149 1.96439,-1.43047 0.77637,-0.34834 1.66634,-0.52348 2.67568,-0.52348 0.9446,0 1.8013,0.1671 2.56884,0.4997 0.76817,0.33452 1.42211,0.79838 1.96502,1.39641 0.54292,0.59566 0.95777,1.30111 1.24522,2.11577 0.28632,0.81341 0.42931,1.70966 0.42931,2.68689 0,0.93013 -0.14299,1.80569 -0.42931,2.62661 -0.28745,0.82283 -0.7023,1.53581 -1.24522,2.14022 -0.54291,0.60441 -1.19685,1.0814 -1.96502,1.42974 -0.76754,0.34897 -1.62424,0.52407 -2.56884,0.52407 -1.00934,0 -1.89931,-0.1751 -2.67568,-0.52407 m 53.28132,-16.90702 c -1.33375,0.5667 -2.48609,1.35753 -3.45447,2.37298 -0.96917,1.01562 -1.72096,2.23191 -2.25632,3.65033 -0.53488,1.41844 -0.8016,2.98061 -0.8016,4.68714 0,1.73475 0.27941,3.31764 0.83727,4.74298 0.55737,1.4266 1.3331,2.6442 2.32477,3.65218 0.99296,1.00734 2.17535,1.78936 3.54733,2.34858 1.37263,0.55796 2.87958,0.83726 4.52326,0.83726 1.69028,0 3.29074,-0.23599 4.80267,-0.71048 1.51193,-0.47198 2.93372,-1.26718 4.2673,-2.38248 l -2.41828,-3.83857 c -0.91568,0.72929 -1.92807,1.30294 -3.03527,1.7222 -1.10832,0.41801 -2.20539,0.62702 -3.28993,0.62702 -0.74569,0 -1.47064,-0.0967 -2.17599,-0.2906 -0.70552,-0.19332 -1.33696,-0.49521 -1.89418,-0.90631 -0.5593,-0.41172 -1.02364,-0.93829 -1.39656,-1.58099 -0.37212,-0.64457 -0.60381,-1.40776 -0.69732,-2.29147 h 15.79123 c 0.0466,-0.29372 0.082,-0.61193 0.10444,-0.95274 0.0225,-0.34205 0.0353,-0.66653 0.0353,-0.97658 0,-1.70653 -0.25547,-3.2687 -0.76802,-4.68714 -0.51094,-1.41842 -1.22432,-2.63471 -2.14016,-3.65033 -0.9139,-1.01545 -2.00664,-1.80628 -3.27756,-2.37298 -1.27285,-0.56621 -2.67568,-0.84867 -4.20946,-0.84867 -1.61364,0 -3.08669,0.28246 -4.4185,0.84867 m -1.11732,8.73216 c 0.0935,-0.6973 0.27491,-1.34816 0.54677,-1.95194 0.27105,-0.60572 0.63642,-1.12469 1.09273,-1.55835 0.45744,-0.4343 1.00421,-0.77637 1.63999,-1.02364 0.63514,-0.24728 1.36443,-0.37293 2.18531,-0.37293 0.74568,0 1.41842,0.12565 2.0248,0.37293 0.6038,0.24727 1.13402,0.58934 1.59226,1.02364 0.4576,0.43366 0.82088,0.94958 1.09209,1.54518 0.2717,0.59814 0.44683,1.25338 0.52396,1.96511 z m -13.94141,-8.82567 c -1.06189,0.50451 -1.91988,1.33053 -2.57076,2.4779 v -2.60467 h -5.09317 v 21.88347 h 5.16402 v -11.97641 c 0,-0.90002 0.11874,-1.70151 0.35975,-2.40696 0.23972,-0.70545 0.58179,-1.30294 1.02364,-1.79123 0.44185,-0.48893 0.96902,-0.85671 1.58102,-1.10398 0.61184,-0.24921 1.29037,-0.37293 2.03589,-0.37293 0.58822,0 1.21645,0.066 1.88292,0.19779 0.66663,0.13176 1.25646,0.32954 1.7674,0.5924 l 1.11651,-4.97572 c -0.54291,-0.21723 -1.10526,-0.38416 -1.68706,-0.49969 -0.57987,-0.11729 -1.24328,-0.17513 -1.98768,-0.17513 -1.3331,0 -2.53188,0.25242 -3.59248,0.75516 m -13.40793,-0.12677 h -5.16225 v 21.88347 h 5.16225 z m 47.68766,15.5802 c 0.5961,1.41215 1.42195,2.6285 2.47597,3.65216 1.05401,1.02366 2.31047,1.82515 3.76777,2.40696 1.4573,0.58182 3.03832,0.87241 4.74467,0.87241 1.87505,0 3.59585,-0.3339 5.16241,-1.00107 1.56495,-0.66529 2.9146,-1.63561 4.04574,-2.90655 l -3.06885,-3.86118 c -0.77605,0.86928 -1.68706,1.57034 -2.73304,2.10508 -1.04598,0.53473 -2.18194,0.80336 -3.40626,0.80336 -0.9303,0 -1.79954,-0.16381 -2.60451,-0.4883 -0.80658,-0.32636 -1.50872,-0.77951 -2.10481,-1.36132 -0.5977,-0.58118 -1.06205,-1.28162 -1.39625,-2.10444 -0.33259,-0.82095 -0.49969,-1.72912 -0.49969,-2.72015 0,-0.99291 0.1671,-1.90422 0.49969,-2.73332 0.3342,-0.82909 0.79855,-1.54207 1.39625,-2.1402 0.59609,-0.59561 1.29823,-1.0569 2.10481,-1.38323 0.80497,-0.32649 1.67421,-0.48845 2.60451,-0.48845 1.22432,0 2.35546,0.27186 3.39501,0.81478 1.03795,0.54291 1.95378,1.25453 2.74429,2.1383 l 3.06885,-3.85927 c -1.13114,-1.25646 -2.48079,-2.2287 -4.04574,-2.91911 -1.56656,-0.68977 -3.28736,-1.03505 -5.16241,-1.03505 -1.70635,0 -3.28737,0.29387 -4.74467,0.8837 -1.4573,0.58935 -2.71376,1.39962 -3.76777,2.43082 -1.05402,1.03007 -1.87987,2.25569 -2.47597,3.67298 -0.5977,1.41904 -0.89655,2.95798 -0.89655,4.61805 0,1.65819 0.29885,3.194 0.89655,4.60304"
       style="fill:#fff010;fill-opacity:1;fill-rule:nonzero;stroke:none;stroke-width:0.160673"
       id="path14"
       inkscape:connector-curvature="0"
       clip-path="url(#clipPath2010)" />
  </g>
</svg>
