{
    "type": "set",
    "cards": [
        {
            "url": "http://cardfight.wikia.com/wiki/Interdimensional_Beast,_Metallica_Phoenix_(V_Series)",
            "name": "Interdimensional Beast, Metallica Phoenix",
            "grade": 4,
            "skill": "triple-drive",
            "power": 15,
            "critical": 1,
            "clan": "Gear Chronicle",
            "race": "Gear Beast",
            "id": "V-TD10/001",
            "image": "https://vignette.wikia.nocookie.net/cardfight/images/5/5d/V-TD10-001EN_(Sample).png/revision/latest/scale-to-width/273",
            "description": "[CONT]:You cannot normal ride this card.",
            "abilities": [
                {
                    "type": "cont",
                    "conditions": [],
                    "effects": [
                        {
                            "type": "do_mark_card",
                            "options": {
                                "card": "self"
                            }
                        },
                        {
                            "type": "do_property_marked",
                            "options": {
                                "property": "cannot_ride"
                            }
                        },
                        {
                            "type": "do_clear_buffer"
                        }
                    ]
                }
            ]
        },
        {
            "url": "http://cardfight.wikia.com/wiki/Chronojet_Dragon_(V_Series)",
            "name": "Chronojet Dragon",
            "grade": 3,
            "skill": "twin-drive",
            "power": 13,
            "critical": 1,
            "clan": "Gear Chronicle",
            "race": "Gear Dragon",
            "gift": "force",
            "id": "V-TD10/002",
            "image": "https://vignette.wikia.nocookie.net/cardfight/images/2/2b/V-TD10-002EN_(Sample).png/revision/latest/scale-to-width/273",
            "description": "[ACT](VC):COST [Discard one or more cards with the sum of their grades being 3 or greater from your hand], search your deck for up to one grade 4 card, ride it as [Stand], and shuffle your deck. At the end of the turn, retire that unit, and ride a grade 3 card from your soul as [Rest].\n[AUTO](VC/RC):When it attacks, COST [Counter Blast (1)], and until end of that battle, this unit gets [Power]+5000, and your opponent cannot call sentinels from his or her hand.",
            "abilities": [
                {
                    "type": "auto",
                    "event": "phase_end_start",
                    "conditions": [
                        {
                            "type": "is_not",
                            "options": {
                                "condition": {
                                    "type": "is_available_usage1"
                                }
                            }
                        }
                    ],
                    "effects": [
                        {
                            "type": "do_retire_vanguard"
                        },
                        {
                            "type": "do_condition",
                            "options": {
                                "if": [
                                    {
                                        "type": "is_list_check",
                                        "options": {
                                            "zone": "soul",
                                            "grade": 3,
                                            "min_count": 1
                                        }
                                    }
                                ],
                                "then": [
                                    {
                                        "type": "do_mark_list",
                                        "options": {
                                            "title": "Select grade3 from soul to be your new vanguard",
                                            "zone": "soul",
                                            "grade": 3,
                                            "count": 1
                                        }
                                    }
                                ],
                                "else": [
                                    {
                                        "type": "do_mark_list",
                                        "options": {
                                            "title": "Select one card from soul to be your new vanguard",
                                            "zone": "soul",
                                            "count": 1
                                        }
                                    }
                                ]
                            }
                        },
                        {
                            "type": "do_move_marked",
                            "options": {
                                "from": "soul",
                                "to": "buffer"
                            }
                        },
                        {
                            "type": "do_modify_buffer",
                            "options": {
                                "state": "rest"
                            }
                        },
                        {
                            "type": "do_clear_buffer",
                            "options": {
                                "part": "marked"
                            }
                        },
                        {
                            "type": "do_condition",
                            "options": {
                                "if": [
                                    {
                                        "type": "is_list_check",
                                        "options": {
                                            "zone": "buffer",
                                            "min_count": 1
                                        }
                                    }
                                ],
                                "then": [
                                    {
                                        "type": "do_ride_buffer"
                                    }
                                ]
                            }
                        },
                        {
                            "type": "do_clear_buffer"
                        }
                    ]
                },
                {
                    "type": "auto",
                    "event": "before_attack",
                    "conditions": [
                        {
                            "type": "is_card_check",
                            "options": {
                                "card": "self",
                                "location": "field"
                            }
                        },
                        {
                            "type": "is_list_check",
                            "options": {
                                "zone": "damage",
                                "face": "up",
                                "min_count": 1
                            }
                        }
                    ],
                    "costs": [
                        {
                            "type": "do_counter_blast",
                            "options": {
                                "count": 1
                            }
                        }
                    ],
                    "effects": [
                        {
                            "type": "do_mark_card",
                            "options": {
                                "card": "self"
                            }
                        },
                        {
                            "type": "do_modify_buffer",
                            "options": {
                                "length": "battle",
                                "power": 5
                            }
                        },
                        {
                            "type": "do_clear_buffer"
                        },
                        {
                            "type": "do_player_property",
                            "options": {
                                "player": "opponent",
                                "property": "cannot_call_sentinel_from_hand_to_gc"
                            }
                        }
                    ]
                },
                {
                    "type": "act",
                    "conditions": [
                        {
                            "type": "is_card_check",
                            "options": {
                                "card": "self",
                                "location": "vanguard"
                            }
                        },
                        {
                            "type": "is_list_check",
                            "options": {
                                "zone": "hand",
                                "intent": "discard",
                                "min_grade_sum": 3,
                                "min_count": 1
                            }
                        }
                    ],
                    "costs": [
                        {
                            "type": "do_mark_list",
                            "options": {
                                "title": "Select one or more cards with the sum of their grades being 3 or greater from your hand",
                                "zone": "hand",
                                "intent": "discard",
                                "min_grade_sum": 3,
                                "min_count": 1
                            }
                        },
                        {
                            "type": "do_move_marked",
                            "options": {
                                "from": "hand",
                                "to": "drop"
                            }
                        }
                    ],
                    "effects": [
                        {
                            "type": "do_clear_buffer"
                        },
                        {
                            "type": "do_mark_list",
                            "options": {
                                "title": "Search your deck for up to one grade 4 card",
                                "event": "after_search",
                                "zone": "deck",
                                "view_count": 50,
                                "max_count": 1,
                                "grade": 4
                            }
                        },
                        {
                            "type": "do_move_marked",
                            "options": {
                                "from": "deck",
                                "to": "buffer"
                            }
                        },
                        {
                            "type": "do_condition",
                            "options": {
                                "if": [
                                    {
                                        "type": "is_list_check",
                                        "options": {
                                            "zone": "buffer",
                                            "min_count": 1
                                        }
                                    }
                                ],
                                "then": [
                                    {
                                        "type": "do_register_usage1"
                                    },
                                    {
                                        "type": "do_ride_buffer"
                                    }
                                ]
                            }
                        },
                        {
                            "type": "do_clear_buffer"
                        },
                        {
                            "type": "do_deck_shuffle"
                        }
                    ]
                }
            ]
        },
        {
            "url": "http://cardfight.wikia.com/wiki/Steam_Gunner,_Yarlaganda",
            "name": "Steam Gunner, Yarlaganda",
            "grade": 3,
            "skill": "twin-drive",
            "power": 13,
            "critical": 1,
            "clan": "Gear Chronicle",
            "race": "Gearoid",
            "id": "V-TD10/003",
            "gift": "force",
            "image": "https://vignette.wikia.nocookie.net/cardfight/images/4/49/V-TD10-003EN_(Sample).png/revision/latest/scale-to-width/273",
            "description": "[AUTO](VC/RC):When it attacks, COST [Counter Blast (1)], draw a card, and this unit gets [Power]+5000 until end of turn.",
            "abilities": [
                {
                    "type": "auto",
                    "event": "before_attack",
                    "conditions": [
                        {
                            "type": "is_card_check",
                            "options": {
                                "card": "self",
                                "location": "field"
                            }
                        },
                        {
                            "type": "is_list_check",
                            "options": {
                                "zone": "damage",
                                "face": "up",
                                "min_count": 1
                            }
                        }
                    ],
                    "costs": [
                        {
                            "type": "do_counter_blast",
                            "options": {
                                "count": 1
                            }
                        }
                    ],
                    "effects": [
                        {
                            "type": "do_draw",
                            "options": {
                                "count": 1
                            }
                        },
                        {
                            "type": "do_mark_card",
                            "options": {
                                "card": "self"
                            }
                        },
                        {
                            "type": "do_modify_buffer",
                            "options": {
                                "length": "turn",
                                "power": 5
                            }
                        },
                        {
                            "type": "do_clear_buffer"
                        }
                    ]
                }
            ]
        },
        {
            "url": "http://cardfight.wikia.com/wiki/Stroboscope_Dragon",
            "name": "Stroboscope Dragon",
            "grade": 2,
            "skill": "intercept",
            "power": 10,
            "critical": 1,
            "shield": 5,
            "clan": "Gear Chronicle",
            "race": "Gear Dragon",
            "id": "V-TD10/004",
            "image": "https://vignette.wikia.nocookie.net/cardfight/images/3/34/V-TD10-004_(Sample).png/revision/latest/scale-to-width/273",
            "description": "[AUTO](VC/RC):At the end of the battle it attacked, COST [Soul Blast (1) & discard a card from your hand], choose one of your opponent's rear-guards, retire it, and if your vanguard is grade 4, draw a card.",
            "abilities": [
                {
                    "type": "auto",
                    "event": "after_attack",
                    "conditions": [
                        {
                            "type": "is_card_check",
                            "options": {
                                "card": "self",
                                "location": "field"
                            }
                        },
                        {
                            "type": "is_list_check",
                            "options": {
                                "zone": "soul",
                                "min_count": 1
                            }
                        }
                    ],
                    "costs": [
                        {
                            "type": "do_soul_blast",
                            "options": {
                                "count": 1
                            }
                        },
                        {
                            "type": "do_discard",
                            "options": {
                                "count": 1
                            }
                        }
                    ],
                    "effects": [
                        {
                            "type": "do_mark_list",
                            "options": {
                                "title": "Choose one of your opponent's rear-guards",
                                "player": "opponent",
                                "zone": "field",
                                "location": "rearguard",
                                "count": 1
                            }
                        },
                        {
                            "type": "do_retire_marked",
                            "options": {
                                "player": "opponent"
                            }
                        },
                        {
                            "type": "do_clear_buffer"
                        },
                        {
                            "type": "do_condition",
                            "options": {
                                "if": [
                                    {
                                        "type": "is_card_check",
                                        "options": {
                                            "card": "vanguard",
                                            "min_grade": 4,
                                            "max_grade": 4
                                        }
                                    }
                                ],
                                "then": [
                                    {
                                        "type": "do_draw",
                                        "options": {
                                            "count": 1
                                        }
                                    }
                                ]
                            }
                        }

                    ]
                }
            ]
        },
        {
            "url": "http://cardfight.wikia.com/wiki/Steam_Fighter,_Salrab",
            "name": "Steam Fighter, Salrab",
            "grade": 2,
            "skill": "intercept",
            "power": 10,
            "critical": 1,
            "shield": 10,
            "clan": "Gear Chronicle",
            "race": "Gearoid",
            "id": "V-TD10/005",
            "image": "https://vignette.wikia.nocookie.net/cardfight/images/1/1f/V-TD10-005_(Sample).png/revision/latest/scale-to-width/273"
        },
        {
            "url": "http://cardfight.wikia.com/wiki/Steam_Fencer,_Idena",
            "name": "Steam Fencer, Idena",
            "grade": 2,
            "skill": "intercept",
            "power": 10,
            "critical": 1,
            "shield": 5,
            "clan": "Gear Chronicle",
            "race": "Gearoid",
            "id": "V-TD10/006",
            "image": "https://vignette.wikia.nocookie.net/cardfight/images/8/8e/V-TD10-006EN_(Sample).png/revision/latest/scale-to-width/273",
            "description": "[AUTO](RC):When it attacks while boosted, this unit gets [Power]+5000 until end of turn.",
            "abilities": [
                {
                    "type": "auto",
                    "event": "before_attack",
                    "conditions": [
                        {
                            "type": "is_card_check",
                            "options": {
                                "card": "self",
                                "location": "rearguard"
                            }
                        },
                        {
                            "type": "is_card_check",
                            "options": {
                                "card": "booster"
                            }
                        }
                    ],
                    "effects": [
                        {
                            "type": "do_mark_card",
                            "options": {
                                "card": "self"
                            }
                        },
                        {
                            "type": "do_modify_buffer",
                            "options": {
                                "length": "turn",
                                "power": 5
                            }
                        },
                        {
                            "type": "do_clear_buffer"
                        }
                    ]
                }
            ]
        },
        {
            "url": "http://cardfight.wikia.com/wiki/Gears_Repeater",
            "name": "Gears Repeater",
            "grade": 1,
            "skill": "boost",
            "power": 8,
            "critical": 1,
            "shield": 10,
            "clan": "Gear Chronicle",
            "race": "Gear Dragon",
            "id": "V-TD10/007",
            "image": "https://vignette.wikia.nocookie.net/cardfight/images/4/48/V-TD10-007EN_(Sample).png/revision/latest/scale-to-width/273",
            "description": "[AUTO](VC/RC):When placed from hand, COST [Soul Blast (1)], and this unit gets [Power]+5000 until end of turn.",
            "abilities": [
                {
                    "type": "auto",
                    "event": "after_call_from_hand",
                    "conditions": [
                        {
                            "type": "is_card_check",
                            "options": {
                                "card": "self",
                                "location": "field"
                            }
                        },
                        {
                            "type": "is_list_check",
                            "options": {
                                "zone": "soul",
                                "min_count": 1
                            }
                        }
                    ],
                    "costs": [
                        {
                            "type": "do_soul_blast",
                            "options": {
                                "count": 1
                            }
                        }
                    ],
                    "effects": [
                        {
                            "type": "do_mark_card",
                            "options": {
                                "card": "self"
                            }
                        },
                        {
                            "type": "do_modify_buffer",
                            "options": {
                                "length": "turn",
                                "power": 5
                            }
                        },
                        {
                            "type": "do_clear_buffer"
                        }
                    ]
                }
            ]
        },
        {
            "url": "http://cardfight.wikia.com/wiki/Bearing_Rover",
            "name": "Bearing Rover",
            "grade": 1,
            "skill": "boost",
            "power": 8,
            "critical": 1,
            "shield": 10,
            "clan": "Gear Chronicle",
            "race": "Gear Dragon",
            "id": "V-TD10/008",
            "image": "https://vignette.wikia.nocookie.net/cardfight/images/a/aa/V-TD10-008_(Sample).png/revision/latest/scale-to-width/273",
            "description": "[AUTO](VC):When its attack hits, COST [discard a card from your hand], and draw a card.\n[CONT](Hand):When this card would be discarded, it may be discarded as a grade 3.",
            "abilities": [
                {
                    "type": "cont",
                    "conditions": [
                        {
                            "type": "is_card_check",
                            "options": {
                                "card": "self",
                                "zone": "hand"
                            }
                        }
                    ],
                    "effects": [
                        {
                            "type": "do_mark_card",
                            "options": {
                                "card": "self"
                            }
                        },
                        {
                            "type": "do_property_marked",
                            "options": {
                                "property": "discard_as_grade3"
                            }
                        },
                        {
                            "type": "do_clear_buffer"
                        }
                    ]
                }
            ]
        },
        {
            "url": "http://cardfight.wikia.com/wiki/Steam_Janitor,_Gitlim",
            "name": "Steam Janitor, Gitlim",
            "grade": 1,
            "skill": "boost",
            "power": 6,
            "critical": 1,
            "shield": 0,
            "clan": "Gear Chronicle",
            "race": "Gearoid",
            "id": "V-TD10/009",
            "image": "https://vignette.wikia.nocookie.net/cardfight/images/4/44/V-EB13-032-R_(Sample).png/revision/latest/scale-to-width/273",
            "description": "[CONT]:Sentinel (You may only have up to four cards with \"[CONT]:Sentinel\" in a deck.)\n[AUTO](GC):When placed, COST [discard a card from your hand], and one of your units cannot be hit until end of that battle.[AUTO](VC):When placed, draw a card, and discard a card from your hand."
        },
        {
            "url": "http://cardfight.wikia.com/wiki/Chrono_Dran_(V_Series)",
            "name": "Chrono Dran",
            "grade": 0,
            "skill": "boost",
            "power": 6,
            "critical": 1,
            "shield": 10,
            "clan": "Gear Chronicle",
            "race": "Gear Dragon",
            "id": "V-TD10/010",
            "image": "https://vignette.wikia.nocookie.net/cardfight/images/2/23/V-TD10-010_(Sample).png/revision/latest/scale-to-width/273",
            "description": "[AUTO]:When rode upon, draw a card. Then, if your opponent's vanguard is grade 1 or greater, put a Quick Shield Ticket into your hand.",
            "abilities": [
                {
                    "type": "auto",
                    "event": "before_ride_other",
                    "conditions": [
                        {
                            "type": "is_active_player"
                        },
                        {
                            "type": "is_card_check",
                            "options": {
                                "card": "self",
                                "location": "vanguard"
                            }
                        }
                    ],
                    "effects": [
                        {
                            "type": "do_draw",
                            "options": {
                                "count": 1
                            }
                        },
                        {
                            "type": "do_condition",
                            "options": {
                                "if": [
                                    {
                                        "type": "is_card_check",
                                        "options": {
                                            "card": "vanguard",
                                            "player": "opponent",
                                            "min_grade": 1
                                        }
                                    }
                                ],
                                "then": [
                                    {
                                        "type": "do_quick_shield"
                                    }
                                ]
                            }
                        }
                    ]
                }
            ]
        },
        {
            "url": "http://cardfight.wikia.com/wiki/Steam_Bomber,_Digul",
            "name": "Steam Bomber, Digul",
            "grade": 0,
            "skill": "boost",
            "power": 5,
            "critical": 1,
            "shield": 15,
            "clan": "Gear Chronicle",
            "race": "Gearoid",
            "trigger": "critical",
            "id": "V-TD10/011",
            "image": "https://vignette.wikia.nocookie.net/cardfight/images/8/81/V-EB04-052EN-C.png/revision/latest/scale-to-width/273"
        },
        {
            "url": "http://cardfight.wikia.com/wiki/Ring_Ring_Worker",
            "name": "Ring Ring Worker",
            "grade": 0,
            "skill": "boost",
            "power": 5,
            "critical": 1,
            "shield": 15,
            "clan": "Gear Chronicle",
            "race": "Workeroid",
            "trigger": "critical",
            "id": "V-TD10/012",
            "image": "https://vignette.wikia.nocookie.net/cardfight/images/e/ec/V-EB04-053EN-C.png/revision/latest/scale-to-width/273"
        },
        {
            "url": "http://cardfight.wikia.com/wiki/Steam_Guard,_Kastilia",
            "name": "Steam Guard, Kastilia",
            "grade": 0,
            "skill": "boost",
            "power": 5,
            "critical": 1,
            "shield": 0,
            "clan": "Gear Chronicle",
            "race": "Gearoid",
            "trigger": "draw",
            "id": "V-TD10/013",
            "image": "https://vignette.wikia.nocookie.net/cardfight/images/b/b9/V-EB04-014EN-RR.png/revision/latest/scale-to-width/273",
            "description": "[CONT]:Sentinel (You may only have up to four cards with \"[CONT]:Sentinel\" in a deck.)[AUTO](GC):When placed, COST [discard a card from your hand], and one of your units cannot be hit until end of that battle."
        },
        {
            "url": "http://cardfight.wikia.com/wiki/Luckypot_Dracokid_(V_Series)",
            "name": "Luckypot Dracokid",
            "grade": 0,
            "skill": "boost",
            "power": 5,
            "critical": 1,
            "shield": 5,
            "clan": "Gear Chronicle",
            "race": "Gear Dragon",
            "trigger": "draw",
            "id": "V-TD10/014",
            "image": "https://vignette.wikia.nocookie.net/cardfight/images/4/4b/V-TD10-014_(Sample).png/revision/latest/scale-to-width/273"
        },
        {
            "url": "http://cardfight.wikia.com/wiki/Steam_Maiden,_Uluru_(V_Series)",
            "name": "Steam Maiden, Uluru",
            "grade": 0,
            "skill": "boost",
            "power": 5,
            "critical": 1,
            "shield": 20,
            "clan": "Gear Chronicle",
            "race": "Gearoid",
            "trigger": "heal",
            "id": "V-TD10/015",
            "image": "https://vignette.wikia.nocookie.net/cardfight/images/e/ec/V-TD10-015_(Sample).png/revision/latest/scale-to-width/273",
            "description": "(You may only have up to four cards with \"HEAL\" in a deck.)"
        },
        {
            "url": "http://cardfight.wikia.com/wiki/Power_Rise_Elixir",
            "name": "Power Rise Elixir",
            "type": "normal_order",
            "grade": 2,
            "skill": null,
            "critical": 0,
            "id": "V-TD10/016",
            "image": "https://vignette.wikia.nocookie.net/cardfight/images/3/3e/V-TD12-016_(Sample).png/revision/latest/scale-to-width/273",
            "description": "COST [Counter Blast (2)]One of your units gets [Power]+20000 until end of turn.(This card is regarded as being from all clans)"
        }
    ]
}
