{
    "type": "set",
    "cards": [
        {
            "url": "http://cardfight.wikia.com/wiki/Full_Full_Appeal,_Farlull",
            "name": "Full Full Appeal, Farlull",
            "grade": 3,
            "skill": "twin-drive",
            "power": 13,
            "critical": 1,
            "clan": "Bermuda Triangle",
            "race": "Mermaid",
            "id": "V-TD08/001",
            "gift": "force",
            "image": "https://vignette.wikia.nocookie.net/cardfight/images/4/4c/V-TD08-001EN.png/revision/latest/scale-to-width/273",
            "description": "[CONT](VC):If you called a rear-guard during this turn, this unit gets [Power]+5000.\n[ACT](VC)1/Turn:COST [Counter Blast (1)], this unit gets [Power]+15000 until end of turn, and if you have five rear-guards, draw a card.",
            "abilities": [
                {
                    "type": "act",
                    "conditions": [
                        {
                            "type": "is_available_usage1"
                        },
                        {
                            "type": "is_card_check",
                            "options": {
                                "card": "self",
                                "location": "vanguard"
                            }
                        },
                        {
                            "type": "is_list_check",
                            "options": {
                                "zone": "damage",
                                "face": "up",
                                "min_count": 1
                            }
                        }
                    ],
                    "costs": [
                        {
                            "type": "do_counter_blast",
                            "options": {
                                "count": 1
                            }
                        }
                    ],
                    "effects": [
                        {
                            "type": "do_mark_card",
                            "options": {
                                "card": "self"
                            }
                        },
                        {
                            "type": "do_modify_buffer",
                            "options": {
                                "length": "turn",
                                "power": 15
                            }
                        },
                        {
                            "type": "do_clear_buffer"
                        },
                        {
                            "type": "do_condition",
                            "options": {
                                "if": [
                                    {
                                        "type": "is_list_check",
                                        "options": {
                                            "zone": "field",
                                            "location": "rearguard",
                                            "min_count": 5
                                        }
                                    }
                                ],
                                "then": [
                                    {
                                        "type": "do_draw",
                                        "options": {
                                            "count": 1
                                        }
                                    }
                                ]
                            }
                        }
                    ]
                },
                {
                    "type": "cont",
                    "conditions": [
                        {
                            "type": "is_event_log_check",
                            "options": {
                                "events": [
                                    "after_call"
                                ],
                                "min_count": 1
                            }
                        }
                    ],
                    "effects": [
                        {
                            "type": "do_mark_card",
                            "options": {
                                "card": "self"
                            }
                        },
                        {
                            "type": "do_modify_buffer",
                            "options": {
                                "length": "permanent",
                                "power": 5
                            }
                        },
                        {
                            "type": "do_clear_buffer"
                        }
                    ]
                }
            ]
        },
        {
            "url": "http://cardfight.wikia.com/wiki/Graceful_Prayer,_Amie",
            "name": "Graceful Prayer, Amie",
            "grade": 3,
            "skill": "twin-drive",
            "power": 13,
            "critical": 1,
            "clan": "Bermuda Triangle",
            "race": "Mermaid",
            "id": "V-TD08/002",
            "gift": "force",
            "image": "https://vignette.wikia.nocookie.net/cardfight/images/d/d0/V-TD08-002EN.png/revision/latest/scale-to-width/273",
            "description": "[AUTO](VC/RC):When it attacks a vanguard, if you have five rear-guards, this unit gets [Power]+15000 until end of that battle.",
            "abilities": [
                {
                    "type": "auto",
                    "event": "before_attack",
                    "conditions": [
                        {
                            "type": "is_card_check",
                            "options": {
                                "card": "self",
                                "location": "field"
                            }
                        },
                        {
                            "type": "is_card_check",
                            "options": {
                                "card": "defender",
                                "location": "vanguard"
                            }
                        },
                        {
                            "type": "is_list_check",
                            "options": {
                                "zone": "field",
                                "location": "rearguard",
                                "min_count": 5
                            }
                        }
                    ],
                    "effects": [
                        {
                            "type": "do_mark_card",
                            "options": {
                                "card": "self"
                            }
                        },
                        {
                            "type": "do_modify_buffer",
                            "options": {
                                "length": "battle",
                                "power": 15
                            }
                        },
                        {
                            "type": "do_clear_buffer"
                        }
                    ]
                }
            ]
        },
        {
            "url": "http://cardfight.wikia.com/wiki/Choco_Love_Heart,_Liselotte",
            "name": "Choco Love Heart, Liselotte",
            "grade": 2,
            "skill": "intercept",
            "power": 10,
            "critical": 1,
            "shield": 5,
            "clan": "Bermuda Triangle",
            "race": "Mermaid",
            "id": "V-TD08/003",
            "image": "https://vignette.wikia.nocookie.net/cardfight/images/2/2e/V-TD08-003EN_(Sample).png/revision/latest/scale-to-width/273",
            "description": "[CONT](Hand):It can be called as a grade 1. (Can be called to (RC) even when your vanguard is grade 1. Is grade 2 after being placed)\n[AUTO](VC/RC):When placed, look at the top card of your deck, and call it to (RC) or put it into your soul. This ability may only be used by a card with the same card name once a turn.",
            "abilities": [
                {
                    "type": "auto",
                    "event": "after_place",
                    "conditions": [
                        {
                            "type": "is_card_check",
                            "options": {
                                "card": "self",
                                "location": "field"
                            }
                        },
                        {
                            "type": "is_available_named_usage"
                        }
                    ],
                    "effects": [
                        {
                            "type": "do_register_named_usage"
                        },
                        {
                            "type": "do_mark_list",
                            "options": {
                                "title": "View top deck card",
                                "event": "after_look",
                                "zone": "deck",
                                "view_count": 1,
                                "max_count": 0
                            }
                        },
                        {
                            "type": "do_mark_list",
                            "options": {
                                "title": "View top two deck cards",
                                "zone": "deck",
                                "view_count": 1,
                                "count": 1
                            }
                        },
                        {
                            "type": "do_move_marked",
                            "options": {
                                "from": "deck",
                                "to": "buffer"
                            }
                        },
                        {
                            "type": "do_choice",
                            "options": [
                                {
                                    "id": "soul",
                                    "label": "Move viewed card to soul",
                                    "effects": [
                                        {
                                            "type": "do_return_buffer_to_deck"
                                        }
                                    ]
                                },
                                {
                                    "id": "call",
                                    "label": "Call viewed card to RC",
                                    "effects": [
                                        {
                                            "type": "do_call_buffer"
                                        }
                                    ]
                                }
                            ]
                        },
                        {
                            "type": "do_clear_buffer"
                        }
                    ]
                },
                {
                    "type": "cont",
                    "conditions": [
                        {
                            "type": "is_card_check",
                            "options": {
                                "card": "self",
                                "zone": "hand"
                            }
                        }
                    ],
                    "effects": [
                        {
                            "type": "do_mark_card",
                            "options": {
                                "card": "self"
                            }
                        },
                        {
                            "type": "do_property_marked",
                            "options": {
                                "property": "one_grade_lower_to_call"
                            }
                        },
                        {
                            "type": "do_clear_buffer"
                        }
                    ]
                }
            ]
        },
        {
            "url": "http://cardfight.wikia.com/wiki/Feeling_Hide,_Rilm",
            "name": "Feeling Hide, Rilm",
            "grade": 2,
            "skill": "intercept",
            "power": 10,
            "critical": 1,
            "shield": 10,
            "clan": "Bermuda Triangle",
            "race": "Mermaid",
            "id": "V-TD08/004",
            "image": "https://vignette.wikia.nocookie.net/cardfight/images/a/ac/V-TD08-004EN.png/revision/latest/scale-to-width/273"
        },
        {
            "url": "http://cardfight.wikia.com/wiki/Concealed_Bitter,_Enes",
            "name": "Concealed Bitter, Enes",
            "grade": 2,
            "skill": "intercept",
            "power": 9,
            "critical": 1,
            "shield": 5,
            "clan": "Bermuda Triangle",
            "race": "Mermaid",
            "id": "V-TD08/005",
            "image": "https://vignette.wikia.nocookie.net/cardfight/images/e/e4/V-TD08-005EN.png/revision/latest/scale-to-width/273",
            "description": "[AUTO](RC):When placed, COST [Counter Blast (1) & Soul Blast (1)], this unit gets [Power]+5000 until end of turn, and if you called another rear-guard during this turn, draw a card.",
            "abilities": [
                {
                    "type": "auto",
                    "event": "after_place",
                    "conditions": [
                        {
                            "type": "is_card_check",
                            "options": {
                                "card": "self",
                                "location": "rearguard"
                            }
                        },
                        {
                            "type": "is_list_check",
                            "options": {
                                "zone": "damage",
                                "face": "up",
                                "min_count": 1
                            }
                        },
                        {
                            "type": "is_list_check",
                            "options": {
                                "zone": "soul",
                                "min_count": 1
                            }
                        }
                    ],
                    "costs": [
                        {
                            "type": "do_counter_blast",
                            "options": {
                                "count": 1
                            }
                        },
                        {
                            "type": "do_soul_blast",
                            "options": {
                                "count": 1
                            }
                        }
                    ],
                    "effects": [
                        {
                            "type": "do_mark_card",
                            "options": {
                                "card": "self"
                            }
                        },
                        {
                            "type": "do_modify_buffer",
                            "options": {
                                "length": "turn",
                                "power": 5
                            }
                        },
                        {
                            "type": "do_clear_buffer"
                        },
                        {
                            "type": "do_condition",
                            "options": {
                                "if": [
                                    {
                                        "type": "is_event_log_check",
                                        "options": {
                                            "events": [
                                                "after_call"
                                            ],
                                            "min_count": 1
                                        }
                                    }
                                ],
                                "then": [
                                    {
                                        "type": "do_draw",
                                        "options": {
                                            "count": 1
                                        }
                                    }
                                ]
                            }
                        }

                    ]
                }
            ]
        },
        {
            "url": "http://cardfight.wikia.com/wiki/Anybody_Like,_Lahti",
            "name": "Anybody Like, Lahti",
            "grade": 1,
            "skill": "boost",
            "power": 8,
            "critical": 1,
            "shield": 10,
            "clan": "Bermuda Triangle",
            "race": "Mermaid",
            "id": "V-TD08/006",
            "image": "https://vignette.wikia.nocookie.net/cardfight/images/a/ab/V-TD08-006EN.png/revision/latest/scale-to-width/273",
            "description": "[AUTO](RC):When placed, one of your other units gets [Power]+5000 until end of turn.",
            "abilities": [
                {
                    "type": "auto",
                    "event": "after_place",
                    "conditions": [
                        {
                            "type": "is_card_check",
                            "options": {
                                "card": "self",
                                "location": "rearguard"
                            }
                        }
                    ],
                    "effects": [
                        {
                            "type": "set_card_value",
                            "options": {
                                "card": "self",
                                "value": "location"
                            }
                        },
                        {
                            "type": "do_mark_list",
                            "options": {
                                "title": "Select another unit to receive bonus power",
                                "zone": "field",
                                "invalid_locations": "stored_value"
                            }
                        },
                        {
                            "type": "do_modify_buffer",
                            "options": {
                                "length": "turn",
                                "power": 5
                            }
                        },
                        {
                            "type": "do_clear_buffer"
                        }
                    ]
                }
            ]
        },
        {
            "url": "http://cardfight.wikia.com/wiki/Special_Message,_Ourora",
            "name": "Special Message, Ourora",
            "grade": 1,
            "skill": "boost",
            "power": 8,
            "critical": 1,
            "shield": 10,
            "clan": "Bermuda Triangle",
            "race": "Mermaid",
            "id": "V-TD08/007",
            "image": "https://vignette.wikia.nocookie.net/cardfight/images/1/15/V-TD08-007EN.png/revision/latest/scale-to-width/273",
            "description": "[AUTO](VC/RC):When placed, draw a card, and discard a card from your hand. This ability may only be used by a card with the same card name once a turn.",
            "abilities": [
                {
                    "type": "auto",
                    "event": "after_place",
                    "conditions": [
                        {
                            "type": "is_card_check",
                            "options": {
                                "card": "self",
                                "location": "field"
                            }
                        },
                        {
                            "type": "is_available_named_usage"
                        }
                    ],
                    "effects": [
                        {
                            "type": "do_register_named_usage"
                        },
                        {
                            "type": "do_draw",
                            "options": {
                                "count": 1
                            }
                        },
                        {
                            "type": "do_discard",
                            "options": {
                                "count": 1
                            }
                        }
                    ]
                }
            ]
        },
        {
            "url": "http://cardfight.wikia.com/wiki/Suave_Heart,_Lilly",
            "name": "Suave Heart, Lilly",
            "grade": 1,
            "skill": "boost",
            "power": 7,
            "critical": 1,
            "shield": 0,
            "clan": "Bermuda Triangle",
            "race": "Mermaid",
            "id": "V-TD08/008",
            "image": "https://vignette.wikia.nocookie.net/cardfight/images/6/6d/V-TD08-008EN.png/revision/latest/scale-to-width/273",
            "description": "[CONT]:Sentinel (You may only have up to four cards with \"[CONT]:Sentinel\" in a deck.)\n[AUTO](GC):When placed, COST [discard a card from your hand], and one of your units cannot be hit until end of that battle."
        },
        {
            "url": "http://cardfight.wikia.com/wiki/Best_of_Best,_Isabella",
            "name": "Best of Best, Isabella",
            "grade": 1,
            "skill": "boost",
            "power": 7,
            "critical": 1,
            "shield": 10,
            "clan": "Bermuda Triangle",
            "race": "Mermaid",
            "id": "V-TD08/009",
            "image": "https://vignette.wikia.nocookie.net/cardfight/images/5/52/V-TD08-009EN.png/revision/latest/scale-to-width/273",
            "description": "[AUTO](RC):When placed, COST [Soul Blast (2)], two of your other rear-guards get [Power]+5000 until end of turn, and if you have five rear-guards, draw a card.",
            "abilities": [
                {
                    "type": "auto",
                    "event": "after_place",
                    "conditions": [
                        {
                            "type": "is_card_check",
                            "options": {
                                "card": "self",
                                "location": "rearguard"
                            }
                        },
                        {
                            "type": "is_list_check",
                            "options": {
                                "zone": "soul",
                                "min_count": 2
                            }
                        }
                    ],
                    "costs": [
                        {
                            "type": "do_soul_blast",
                            "options": {
                                "count": 2
                            }
                        }
                    ],
                    "effects": [
                        {
                            "type": "set_card_value",
                            "options": {
                                "card": "self",
                                "value": "location"
                            }
                        },
                        {
                            "type": "do_mark_list",
                            "options": {
                                "title": "Select two of your other rearguards",
                                "zone": "field",
                                "location": "rearguard",
                                "count": 2,
                                "invalid_locations": "stored_value"
                            }
                        },
                        {
                            "type": "do_modify_buffer",
                            "options": {
                                "length": "turn",
                                "power": 5
                            }
                        },
                        {
                            "type": "do_clear_buffer"
                        },
                        {
                            "type": "do_condition",
                            "options": {
                                "if": [
                                    {
                                        "type": "is_list_check",
                                        "options": {
                                            "zone": "field",
                                            "location": "rearguard",
                                            "min_count": 5
                                        }
                                    }
                                ],
                                "then": [
                                    {
                                        "type": "do_draw",
                                        "options": {
                                            "count": 1
                                        }
                                    }
                                ]
                            }
                        }
                    ]
                }
            ]
        },
        {
            "url": "http://cardfight.wikia.com/wiki/Pure_Gifter,_Aliche",
            "name": "Pure Gifter, Aliche",
            "grade": 0,
            "skill": "boost",
            "power": 6,
            "critical": 1,
            "shield": 10,
            "clan": "Bermuda Triangle",
            "race": "Mermaid",
            "id": "V-TD08/010",
            "image": "https://vignette.wikia.nocookie.net/cardfight/images/2/2f/V-EB11-043EN-C.png/revision/latest/scale-to-width/273",
            "description": "[AUTO]:When rode upon, draw a card. Then, if your opponent's vanguard is grade 1 or greater, put a Quick Shield Ticket into your hand.",
            "abilities": [
                {
                    "type": "auto",
                    "event": "before_ride_other",
                    "conditions": [
                        {
                            "type": "is_active_player"
                        },
                        {
                            "type": "is_card_check",
                            "options": {
                                "card": "self",
                                "location": "vanguard"
                            }
                        }
                    ],
                    "effects": [
                        {
                            "type": "do_draw",
                            "options": {
                                "count": 1
                            }
                        },
                        {
                            "type": "do_condition",
                            "options": {
                                "if": [
                                    {
                                        "type": "is_card_check",
                                        "options": {
                                            "card": "vanguard",
                                            "player": "opponent",
                                            "min_grade": 1
                                        }
                                    }
                                ],
                                "then": [
                                    {
                                        "type": "do_quick_shield"
                                    }
                                ]
                            }
                        }
                    ]
                }
            ]
        },
        {
            "url": "http://cardfight.wikia.com/wiki/Direct_Sign,_Pursh",
            "name": "Direct Sign, Pursh",
            "grade": 0,
            "skill": "boost",
            "power": 5,
            "critical": 1,
            "shield": 15,
            "clan": "Bermuda Triangle",
            "race": "Mermaid",
            "trigger": "critical",
            "id": "V-TD08/011",
            "image": "https://vignette.wikia.nocookie.net/cardfight/images/5/59/V-EB11-044EN-C.png/revision/latest/scale-to-width/273"
        },
        {
            "url": "http://cardfight.wikia.com/wiki/Lover_Hope,_Rina",
            "name": "Lover Hope, Rina",
            "grade": 0,
            "skill": "boost",
            "power": 5,
            "critical": 1,
            "shield": 15,
            "clan": "Bermuda Triangle",
            "race": "Mermaid",
            "trigger": "critical",
            "id": "V-TD08/012",
            "image": "https://vignette.wikia.nocookie.net/cardfight/images/d/d6/V-EB11-046EN-C.png/revision/latest/scale-to-width/273"
        },
        {
            "url": "http://cardfight.wikia.com/wiki/Joyful_A_la_Carte,_Irma",
            "name": "Joyful A la Carte, Irma",
            "grade": 0,
            "skill": "boost",
            "power": 5,
            "critical": 1,
            "shield": 5,
            "clan": "Bermuda Triangle",
            "race": "Mermaid",
            "trigger": "draw",
            "id": "V-TD08/013",
            "image": "https://vignette.wikia.nocookie.net/cardfight/images/e/e2/V-EB11-047EN-C.png/revision/latest/scale-to-width/273"
        },
        {
            "url": "http://cardfight.wikia.com/wiki/Handmade_Lover,_Elena",
            "name": "Handmade Lover, Elena",
            "grade": 0,
            "skill": "boost",
            "power": 5,
            "critical": 1,
            "shield": 20,
            "clan": "Bermuda Triangle",
            "race": "Mermaid",
            "trigger": "heal",
            "id": "V-TD08/014",
            "image": "https://vignette.wikia.nocookie.net/cardfight/images/a/ae/V-EB11-048EN-C.png/revision/latest/scale-to-width/273"
        }
    ]
}
