<?xml version="1.0" encoding="UTF-8" standalone="no"?>
<svg
   xmlns:dc="http://purl.org/dc/elements/1.1/"
   xmlns:cc="http://creativecommons.org/ns#"
   xmlns:rdf="http://www.w3.org/1999/02/22-rdf-syntax-ns#"
   xmlns:svg="http://www.w3.org/2000/svg"
   xmlns="http://www.w3.org/2000/svg"
   xmlns:xlink="http://www.w3.org/1999/xlink"
   xmlns:sodipodi="http://sodipodi.sourceforge.net/DTD/sodipodi-0.dtd"
   xmlns:inkscape="http://www.inkscape.org/namespaces/inkscape"
   width="360"
   height="320"
   id="svg2"
   version="1.1"
   inkscape:version="1.0 (4035a4fb49, 2020-05-01)"
   sodipodi:docname="searx.svg"
   inkscape:export-filename="/home/a/magnif.png"
   inkscape:export-xdpi="203.1774"
   inkscape:export-ydpi="203.1774">
  <defs
     id="defs4">
    <linearGradient
       inkscape:collect="always"
       id="linearGradient3857">
      <stop
         style="stop-color:#ffffff;stop-opacity:1;"
         offset="0"
         id="stop3859" />
      <stop
         style="stop-color:#ffffff;stop-opacity:0;"
         offset="1"
         id="stop3861" />
    </linearGradient>
    <linearGradient
       id="linearGradient3790">
      <stop
         style="stop-color:#a9a9a9;stop-opacity:1;"
         offset="0"
         id="stop3792" />
      <stop
         style="stop-color:#000000;stop-opacity:1;"
         offset="1"
         id="stop3794" />
    </linearGradient>
    <radialGradient
       gradientTransform="translate(-158.95893,-88.569597)"
       inkscape:collect="always"
       xlink:href="#linearGradient3790"
       id="radialGradient3798"
       cx="294.45947"
       cy="208.37973"
       fx="294.45947"
       fy="208.37973"
       r="107.58125"
       gradientUnits="userSpaceOnUse" />
    <linearGradient
       gradientTransform="matrix(0.76865672,0,0,0.76865672,33.9199,-110.49634)"
       inkscape:collect="always"
       xlink:href="#linearGradient3857"
       id="linearGradient3865"
       x1="120.68947"
       y1="239.61774"
       x2="120.68947"
       y2="602.17517"
       gradientUnits="userSpaceOnUse" />
    <linearGradient
       inkscape:collect="always"
       xlink:href="#linearGradient3790"
       id="linearGradient3912"
       x1="186.74416"
       y1="354.42426"
       x2="255.84358"
       y2="254.35953"
       gradientUnits="userSpaceOnUse"
       gradientTransform="matrix(1.2227304,0,0,0.89945099,-289.31433,113.40259)" />
    <filter
       inkscape:collect="always"
       id="filter4024"
       x="-0.12996517"
       width="1.2599303"
       y="-0.14709377"
       height="1.2941875">
      <feGaussianBlur
         inkscape:collect="always"
         stdDeviation="6.4759344"
         id="feGaussianBlur4026" />
    </filter>
  </defs>
  <sodipodi:namedview
     id="base"
     pagecolor="#ffffff"
     bordercolor="#666666"
     borderopacity="1.0"
     inkscape:pageopacity="0.0"
     inkscape:pageshadow="2"
     inkscape:zoom="1.4"
     inkscape:cx="207.76587"
     inkscape:cy="194.39273"
     inkscape:document-units="px"
     inkscape:current-layer="layer1"
     showgrid="false"
     inkscape:window-width="1916"
     inkscape:window-height="1041"
     inkscape:window-x="1080"
     inkscape:window-y="37"
     inkscape:window-maximized="0"
     showguides="true"
     inkscape:guide-bbox="true"
     inkscape:document-rotation="0" />
  <metadata
     id="metadata7">
    <rdf:RDF>
      <cc:Work
         rdf:about="">
        <dc:format>image/svg+xml</dc:format>
        <dc:type
           rdf:resource="http://purl.org/dc/dcmitype/StillImage" />
        <dc:title />
      </cc:Work>
    </rdf:RDF>
  </metadata>
  <g
     inkscape:label="Layer 1"
     inkscape:groupmode="layer"
     id="layer1">
    <g
       transform="translate(36.769989,40.779816)"
       id="g34">
      <path
         inkscape:connector-curvature="0"
         id="path3814-0-7"
         d="M 18.640421,6.9102263 C 11.520831,22.15312 8.4624415,38.689419 10.414791,55.724793 15.431561,99.498923 52.0901,135.04929 101.9509,150.88768 95.32514,128.48016 96.60997,105.95148 104.5904,85.043376 56.85342,70.860687 22.945381,42.234991 18.640421,6.9102263 Z"
         style="fill:#000000;fill-opacity:1;fill-rule:nonzero;stroke:none" />
      <path
         inkscape:connector-curvature="0"
         id="path3814-0"
         d="m 251.896,8.2536156 c 7.11959,15.2428934 10.17798,31.7791924 8.22563,48.8145664 -5.01677,43.774128 -41.67531,79.324498 -91.53611,95.162888 6.62576,-22.40752 5.34093,-44.9362 -2.6395,-65.844304 C 213.683,72.204076 247.59104,43.57838 251.896,8.2536156 Z"
         style="fill:#000000;fill-opacity:1;fill-rule:nonzero;stroke:none" />
      <path
         id="rect3804"
         d="m 140.38503,145.73867 12.07512,-13.9057 c 4.07849,-4.6968 19.95773,2.45971 35.60367,16.04597 l 130.50177,113.32219 c 15.64594,13.58627 24.95835,28.30512 20.87985,33.00192 l -12.07511,13.9057 c -4.0785,4.6968 -19.95774,-2.45971 -35.60368,-16.04597 L 161.26488,178.74059 c -15.64594,-13.58627 -24.95835,-28.30513 -20.87985,-33.00192 z"
         style="fill:#000000;fill-opacity:1;fill-rule:nonzero;stroke:none" />
      <circle
         id="path2987"
         style="fill:url(#radialGradient3798);fill-opacity:1;fill-rule:nonzero;stroke:none"
         cx="135.50055"
         cy="119.81013"
         r="107.58125" />
      <circle
         id="path3757"
         style="fill:url(#linearGradient3865);fill-opacity:1;fill-rule:nonzero;stroke:none;stroke-width:0.768657"
         cx="135.248"
         cy="119.55759"
         r="78.034286" />
      <circle
         id="path3800"
         style="fill:#1a1a1a;fill-opacity:1;fill-rule:nonzero;stroke:none"
         cx="136.45993"
         cy="121.25356"
         r="27.274118" />
      <circle
         id="path3802"
         style="fill:#ffffff;fill-opacity:1;fill-rule:nonzero;stroke:none"
         cx="147.59192"
         cy="111.80396"
         r="5.5558391" />
      <rect
         transform="matrix(0.74466525,-0.84318084,0.84318084,0.74466525,-87.425964,-54.310361)"
         ry="9.0007057"
         rx="2.8666623"
         y="337.8396"
         x="19.525793"
         height="159.43797"
         width="2.2392972"
         id="rect3916"
         style="fill:#ffffff;fill-opacity:0.822115;fill-rule:nonzero;stroke:none;filter:url(#filter4024)" />
    </g>
  </g>
</svg>
