D:\dev\M183\m183\03_2FA\gs-spring-boot-complete\src\main\java\com\example\springboot\HelloController.java
D:\dev\M183\m183\03_2FA\gs-spring-boot-complete\src\main\java\com\example\springboot\Application.java
D:\dev\M183\m183\03_2FA\gs-spring-boot-complete\src\main\java\com\example\springboot\source\CustomWebAuthenticationDetailsSource.java
D:\dev\M183\m183\03_2FA\gs-spring-boot-complete\src\main\java\com\example\springboot\data\User.java
