{
  "todos": [
    {
      "id": 1,
      "title": "Aula 1",
      "description": "Aprender sobre componentes.",
      "finished": true,
      "date": "2018-10-31"
    },
    {
      "id": 2,
      "title": "Aula 2",
      "description": "Aprender sobre requisições e rotas.",
      "finished": false,
      "date": "2018-11-01"
    },
    {
      "id": 3,
      "title": "Aula 3",
      "description": "Aprender sobre formulários.",
      "finished": false,
      "date": "2018-11-02"
    },
    {
      "id": 4,
      "title": "qeria star morta",
      "description": "ler o titulo",
      "finished": false,
      "date": "2018-11-09"
    }
  ]
}