[gd_scene load_steps=2 format=2]

[ext_resource path="res://assets/map_elements/tree_01.png" type="Texture" id=1]

[node name="Tree01" type="Node2D"]

[node name="Sprite" type="Sprite" parent="."]
position = Vector2( 11, -63 )
texture = ExtResource( 1 )
