[gd_scene load_steps=2 format=2]

[ext_resource path="res://assets/map_elements/ruin_01.png" type="Texture" id=1]

[node name="Ruin01" type="Node2D"]

[node name="Sprite" type="Sprite" parent="."]
position = Vector2( -1, -29 )
texture = ExtResource( 1 )
