[gd_scene load_steps=2 format=2]

[ext_resource path="res://globals/http_seed_request/http_seed_request.gd" type="Script" id=1]

[node name="HTTPSeedRequest" type="HTTPRequest"]
script = ExtResource( 1 )

[connection signal="request_completed" from="." to="." method="_on_request_completed"]
