[gd_scene load_steps=2 format=2]

[ext_resource path="res://assets/map_elements/tree_02.png" type="Texture" id=1]

[node name="Tree02" type="Node2D"]

[node name="Sprite" type="Sprite" parent="."]
position = Vector2( -3, -108 )
texture = ExtResource( 1 )
