[gd_scene load_steps=3 format=2]

[ext_resource path="res://assets/illustrations/character_test_mage.png" type="Texture" id=1]
[ext_resource path="res://entities/job_selection_button/job_selection_button.gd" type="Script" id=2]

[node name="JobSelectionButton" type="TextureButton"]
margin_right = 120.0
margin_bottom = 243.0
rect_min_size = Vector2( 120, 0 )
script = ExtResource( 2 )

[node name="TextureRect" type="TextureRect" parent="."]
margin_right = 120.0
margin_bottom = 240.0
mouse_filter = 2
texture = ExtResource( 1 )
expand = true
stretch_mode = 5

[node name="JobNameLabel" type="Label" parent="."]
margin_left = 38.0
margin_top = 247.0
margin_right = 78.0
margin_bottom = 261.0
grow_horizontal = 2
text = "Name"
align = 1

[connection signal="pressed" from="." to="." method="_on_pressed"]
