[gd_scene load_steps=2 format=2]

[ext_resource path="res://assets/map_elements/grass_02.png" type="Texture" id=1]

[node name="Grass02" type="Node2D"]

[node name="Sprite" type="Sprite" parent="."]
position = Vector2( -1, -42 )
texture = ExtResource( 1 )
