[gd_scene load_steps=2 format=2]

[ext_resource path="res://assets/map_elements/grass_01.png" type="Texture" id=1]

[node name="Grass01" type="Node2D"]

[node name="Sprite" type="Sprite" parent="."]
position = Vector2( 0, -13 )
scale = Vector2( 0.2, 0.2 )
texture = ExtResource( 1 )
