[gd_scene load_steps=4 format=2]

[ext_resource path="res://assets/particle/mushroom.png" type="Texture" id=1]
[ext_resource path="res://entities/ground_effect/visuals/visual.gd" type="Script" id=2]

[sub_resource type="Gradient" id=1]
offsets = PoolRealArray( 0, 0.00226757 )
colors = PoolColorArray( 1, 1, 1, 0, 1, 1, 1, 1 )

[node name="Mushrooms" type="Node2D"]
script = ExtResource( 2 )

[node name="Line2D" type="Line2D" parent="."]
points = PoolVector2Array( -31, 0, 0, -18, 31, 0, 0, 18, -31, 0 )
width = 3.0
default_color = Color( 0.729412, 0.282353, 0.823529, 0.945098 )

[node name="Polygon2D" type="Polygon2D" parent="."]
self_modulate = Color( 0.368627, 0.054902, 0.372549, 0.498039 )
polygon = PoolVector2Array( -29, 0, 0, -17, 29, 0, 0, 17 )

[node name="Particles2D" type="CPUParticles2D" parent="Polygon2D"]
amount = 6
lifetime = 6.0
explosiveness = 0.95
texture = ExtResource( 1 )
emission_shape = 2
emission_rect_extents = Vector2( 20, 15 )
direction = Vector2( 0, -2 )
spread = 2.25
gravity = Vector2( 0, 0 )
initial_velocity = 20.0
linear_accel = -60.0
angle = 1.0
angle_random = 1.0
scale_amount = 0.06
scale_amount_random = 0.03
color_ramp = SubResource( 1 )

[node name="FreezeTimer" type="Timer" parent="."]
wait_time = 2.0
one_shot = true
autostart = true

[connection signal="timeout" from="FreezeTimer" to="." method="_on_freeze_timer_timeout"]
