[gd_scene load_steps=7 format=2]

[ext_resource path="res://globals/ground_effects_holder/ground_effects/frost_ground_effect.gd" type="Script" id=1]
[ext_resource path="res://globals/ground_effects_holder/ground_effects_holder.gd" type="Script" id=2]
[ext_resource path="res://globals/ground_effects_holder/ground_effects/thorns_ground_effect.gd" type="Script" id=3]
[ext_resource path="res://globals/ground_effects_holder/ground_effects/darkness_ground_effect.gd" type="Script" id=4]
[ext_resource path="res://globals/ground_effects_holder/ground_effects/mushrooms_ground_effect.gd" type="Script" id=5]
[ext_resource path="res://globals/ground_effects_holder/ground_effects/scorched_earth_ground_effect.gd" type="Script" id=6]

[node name="GroundEffectsHolder" type="Node"]
script = ExtResource( 2 )

[node name="Frost" type="Node" parent="."]
script = ExtResource( 1 )

[node name="Darkness" type="Node" parent="."]
script = ExtResource( 4 )

[node name="Thorns" type="Node" parent="."]
script = ExtResource( 3 )

[node name="Mushrooms" type="Node" parent="."]
script = ExtResource( 5 )

[node name="ScorchedEarth" type="Node" parent="."]
script = ExtResource( 6 )
