meldedatum,baden-württemberg,bayern,berlin,brandenburg,bremen,hamburg,hessen,mecklenburg-vorpommern,niedersachsen,nordrhein-westfalen,rheinland-pfalz,saarland,sachsen,sachsen-anhalt,schleswig-holstein,thüringen
2020-01-28,,2-0,,,,,,,,,,,,,,
2020-01-29,,4-0,,,,,,,,,,,,,,
2020-01-31,,7-0,,,,,,,,,,,,,,
2020-02-03,,8-0,,,,,,,,,,,,,,
2020-02-04,,10-0,,,,,,,1-0,,,,,,,
2020-02-06,,11-0,,,,,,,,,,,,,,
2020-02-07,,12-0,,,,,,,,,,,,,,
2020-02-11,,14-0,,,,,,,,,,,,,,
2020-02-12,,15-0,,,,,,,,,,,,,,
2020-02-25,2-0,,,,,,,,,,,,,,,
2020-02-26,7-0,,,,,,,,,3-0,,,,,,
2020-02-27,9-0,16-0,,,,,,,,21-0,,,,,,
2020-02-28,12-0,19-0,,,,,1-0,,,53-0,1-0,,,,1-0,
2020-02-29,14-0,20-0,,,,1-0,,,,67-0,2-0,,,,2-0,
2020-03-01,,23-0,,1-0,1-0,2-0,5-0,,2-0,89-0,,,,,,
2020-03-02,25-0,29-0,,,2-0,,9-0,,3-0,104-0,,,1-0,,3-0,
2020-03-03,36-0,35-0,5-0,,4-0,,11-0,2-0,9-0,132-0,3-0,,,,4-0,1-0
2020-03-04,73-0,45-0,8-0,,,4-0,12-0,4-0,12-0,210-1,7-0,,,,,
2020-03-05,108-0,67-1,19-0,2-0,,9-0,16-0,5-0,17-0,296-1,8-0,,,,5-0,
2020-03-06,153-1,114-1,23-0,,,11-0,17-0,,25-0,345-1,10-0,,3-0,,7-0,
2020-03-07,185-1,130-1,24-0,,,14-0,20-0,,32-0,410-3,12-0,,5-0,,,2-0
2020-03-08,200-1,144-1,35-0,5-0,,19-0,,7-0,35-0,430-3,15-0,1-0,10-0,,8-0,
2020-03-09,249-1,223-1,57-0,9-0,11-0,38-0,40-0,11-0,51-0,507-4,22-0,6-0,14-0,,11-0,
2020-03-10,359-1,313-3,90-0,20-0,22-0,63-0,55-0,,85-0,664-4,38-0,8-0,34-0,6-0,18-0,11-0
2020-03-11,498-5,414-3,133-0,28-0,33-0,91-0,89-0,19-0,137-0,849-4,66-0,18-0,47-0,21-0,36-0,12-0
2020-03-12,672-8,529-4,180-0,48-0,40-0,131-0,125-0,28-0,202-0,1113-4,124-0,30-0,74-0,35-0,53-0,23-0
2020-03-13,966-8,759-6,239-0,68-0,50-0,162-0,197-0,36-0,283-0,1485-6,181-0,40-0,106-0,46-0,78-0,33-0
2020-03-14,1290-8,939-8,268-0,81-0,53-0,236-0,274-0,37-0,342-0,1780-6,230-0,53-0,135-0,48-0,102-0,49-0
2020-03-15,1453-8,1052-10,293-0,101-0,56-0,307-0,298-0,38-0,391-0,1995-6,325-1,70-0,160-0,,122-0,
2020-03-16,1847-9,1276-11,353-0,122-0,57-0,375-0,415-0,52-0,519-0,2530-6,435-1,87-0,200-0,83-0,144-0,62-0
2020-03-17,2413-11,1689-14,449-0,171-0,69-0,497-0,572-0,83-0,660-1,3164-6,598-1,102-0,280-0,112-0,183-0,86-0
2020-03-18,3110-14,2227-16,593-0,207-0,79-0,621-0,781-1,126-0,877-1,3541-6,754-1,127-0,393-0,150-0,232-1,115-0
2020-03-19,3574-17,2730-18,773-1,250-0,120-0,807-0,973-1,160-0,1064-1,3544-6,888-2,157-0,532-0,189-0,284-1,153-0
2020-03-20,3795-21,3223-20,932-1,272-0,142-0,869-0,1162-2,172-0,1279-1,3545-6,1043-2,187-0,606-0,211-0,328-1,201-0
2020-03-21,3807-21,3650-21,1024-1,274-0,165-0,872-0,1175-2,,1306-1,,1053-2,,,,347-1,216-0
