{
    "equipmentEditInventoryItem.addNewEquipment": "Add New Equipment",
    "equipmentEditInventoryItem.district": "District",
    "equipmentEditInventoryItem.facility": "Facility",
    "equipmentEditInventoryItem.program": "Program",
    "equipmentEditInventoryItem.equipmentType": "Equipment Type",
    "equipmentEditInventoryItem.makeModel": "Make/Model",
    "equipmentEditInventoryItem.equipmentIdentification": "Equipment Identification",
    "equipmentEditInventoryItem.serialNumber": "Serial Number",
    "equipmentEditInventoryItem.referenceName": "Reference Name",
    "equipmentEditInventoryItem.referenceName.description": "Enter the name that is used to refer to this device (e.g. \"Refrigerator 2\").",
    "equipmentEditInventoryItem.equipmentHistory": "Equipment History",
    "equipmentEditInventoryItem.yearOfInstallation": "Year of Installation/Commission",
    "equipmentEditInventoryItem.source": "Source",
    "equipmentEditInventoryItem.source.description": "Enter the ministry or organization that provided this device.",
    "equipmentEditInventoryItem.yearOfWarrantyExpiry": "Year of Warranty Expiry",
    "equipmentEditInventoryItem.equipmentInstallation": "Equipment Installation",
    "equipmentEditInventoryItem.voltageStabilizer": "Voltage Stabilizer",
    "equipmentEditInventoryItem.voltageRegulator": "Voltage Regulator",
    "equipmentEditInventoryItem.backupGenerator": "Backup Generator",
    "equipmentEditInventoryItem.manualTemperatureGauge": "Manual Temperature Gauge",
    "equipmentEditInventoryItem.cancel": "Cancel",
    "equipmentEditInventoryItem.save": "Save",
    "equipmentEditInventoryItem.additionalNotes": "Additional Notes",
    "equipmentEditInventoryItem.closeAddInventoryItemModal": "Are you sure you want to close the modal? All progress will be lost.",
    "equipmentEditInventoryItem.yes": "Yes",
    "equipmentEditInventoryItem.no": "No",
    "equipmentEditInventoryItem.utilization": "Utilization",
    "equipmentEditInventoryItem.remoteTemperatureMonitor": "Remote Temperature Monitor",
    "equipmentEditInventoryItem.editEquipmentDetails": "Edit Equipment Details"
}
