{
  "type": "object",
  "$schema": "http://json-schema.org/draft-04/schema",
  "title": "Equipment Type",
  "description": "A single equipment type",
  "properties": {
    "id": {
      "type": "string",
      "title": "id"
    },
    "name": {
      "type": "string",
      "title": "name"
    },
    "code": {
      "type": "string",
      "title": "code"
    },
    "isBioChemistry": {
      "type": "boolean",
      "title": "isBioChemistry"
    },
    "isColdChain": {
      "type": "boolean",
      "title": "isColdChain"
    },
    "active": {
      "type": "boolean",
      "title": "active"
    }
  },
  "required": [
    "name",
    "code",
    "isBioChemistry",
    "isColdChain",
    "active"
  ]
}
