{
  "type": "object",
  "$schema": "http://json-schema.org/draft-04/schema",
  "title": "OperationMode",
  "description": "A single equipment operation mode",
  "properties": {
    "id": {
      "type": "string",
      "title": "id"
    },
    "name": {
      "type": "string",
      "title": "name"
    },
    "code": {
      "type": "string",
      "title": "code"
    },
    "displayOrder": {
      "type": "integer",
      "title": "displayOrder"
    },
    "description": {
      "type": "string",
      "title": "description"
    },
    "active": {
      "type": "boolean",
      "title": "active",
      "default": true
    }
  },
  "required": [
    "name",
    "code",
    "displayOrder"
  ]
}
