n_pts,n_kernel_evecs,n_common_evecs,random_seed,time_example,time_k1,mat_sparsity_k1,mat_neighbors_per_row_k1,time_k2,mat_sparsity_k2,mat_neighbors_per_row_k2,time_eig_k1,time_eig_k2,time_common
10000,100,10,0,0.0017058849334716797,0.46513843536376953,0.24112999999999998,24,0.4568209648132324,0.24288600000000002,24,0.8963837623596191,0.8077890872955322,0.04073667526245117
10000,100,10,1,0.0024275779724121094,0.48879504203796387,0.240728,24,0.4511256217956543,0.242682,24,0.8227629661560059,0.7733123302459717,0.03391838073730469
10000,100,10,2,0.002389192581176758,0.4909670352935791,0.24102400000000002,24,0.4555699825286865,0.24286,24,0.8544223308563232,0.7541797161102295,0.036313772201538086
10000,100,10,3,0.002367734909057617,0.48663926124572754,0.24118,24,0.4449646472930908,0.242768,24,0.827519416809082,0.7501661777496338,0.034177541732788086
10000,100,10,4,0.0024614334106445312,0.48912787437438965,0.24085,24,0.46471500396728516,0.24298599999999998,24,0.8363816738128662,0.7603962421417236,0.03540182113647461
10000,100,10,5,0.0025877952575683594,0.498349666595459,0.24080600000000002,24,0.45160531997680664,0.24281799999999998,24,0.8192827701568604,0.7528302669525146,0.042244672775268555
10000,100,10,6,0.0023865699768066406,0.48131895065307617,0.24104,24,0.4509871006011963,0.243114,24,0.8308224678039551,0.8863959312438965,0.04329061508178711
10000,100,10,7,0.0030858516693115234,0.49556493759155273,0.240938,24,0.4550473690032959,0.24273799999999998,24,0.8353734016418457,0.8825666904449463,0.0376126766204834
10000,100,10,8,0.003084897994995117,0.4974796772003174,0.241,24,0.47915029525756836,0.24299600000000002,24,0.9179220199584961,0.9070875644683838,0.036731719970703125
10000,100,10,9,0.003093719482421875,0.49835729598999023,0.24083400000000002,24,0.4561331272125244,0.242752,24,0.8325204849243164,0.8798153400421143,0.033805131912231445
10000,200,10,0,0.003077983856201172,0.5050351619720459,0.24112999999999998,24,0.458406925201416,0.24288600000000002,24,3.048018217086792,3.039641857147217,0.24748492240905762
10000,200,10,1,0.0028009414672851562,0.4957427978515625,0.240728,24,0.4504714012145996,0.242682,24,3.572171211242676,3.2572906017303467,0.29386234283447266
10000,200,10,2,0.003478527069091797,0.5243988037109375,0.24102400000000002,24,0.4690210819244385,0.24286,24,3.371314287185669,3.26383113861084,0.2699546813964844
