n_pts,n_kernel_evecs,n_common_evecs,random_seed,time_example,time_k1,mat_sparsity_k1,mat_neighbors_per_row_k1,time_k2,mat_sparsity_k2,mat_neighbors_per_row_k2,time_eig_k1,time_eig_k2,time_common
5000,100,10,0,0.0019915103912353516,2.445570707321167,1.9699200000000001,98,2.4224843978881836,1.964624,98,0.5330157279968262,0.4591083526611328,0.08477377891540527
10000,100,10,0,0.000997781753540039,4.72907018661499,0.9887760000000001,98,4.710222959518433,0.975294,97,1.2648870944976807,1.0941529273986816,0.18849825859069824
15000,100,10,0,0.0009975433349609375,7.252113580703735,0.6597644444444445,98,7.283602237701416,0.6511600000000001,97,2.2497644424438477,1.8849568367004395,0.30717897415161133
20000,100,10,0,0.001995086669921875,10.357463836669922,0.4948815,98,10.72046971321106,0.48945000000000005,97,3.654226303100586,3.492877960205078,0.3510615825653076
25000,100,10,0,0.001995563507080078,12.776377439498901,0.39595391999999996,98,13.613152503967285,0.39186912,97,4.684927463531494,4.6375768184661865,0.4468061923980713
30000,100,10,0,0.001995086669921875,15.159773111343384,0.3299984444444444,98,16.191556930541992,0.32666755555555554,98,6.19476580619812,6.123630523681641,0.6253290176391602
35000,100,10,0,0.003989696502685547,17.441816568374634,0.2829549387755102,99,17.88216280937195,0.28006514285714285,98,8.612844705581665,8.43743371963501,0.5255935192108154
40000,100,10,0,0.003988981246948242,20.43362808227539,0.247615375,99,20.497761726379395,0.24506575,98,10.58867859840393,11.446989297866821,0.888624906539917
45000,100,10,0,0.005983591079711914,22.28234839439392,0.22022044444444444,99,23.43604302406311,0.21791180246913583,98,13.862210750579834,13.951348543167114,0.9135575294494629
