n_pts,n_kernel_evecs,n_common_evecs,random_seed,time_example,time_k1,mat_sparsity_k1,mat_neighbors_per_row_k1,time_k2,mat_sparsity_k2,mat_neighbors_per_row_k2,time_eig_k1,time_eig_k2,time_common
5000,100,10,0,0.000997304916381836,1.2267565727233887,0.982792,49,1.2247288227081299,0.970296,48,0.5368473529815674,0.48370790481567383,0.1077127456665039
10000,100,10,0,0.0019948482513427734,2.3926401138305664,0.49121,49,2.5479655265808105,0.485962,48,1.4366168975830078,1.4871675968170166,0.16755199432373047
15000,100,10,0,0.0009982585906982422,3.7599799633026123,0.3278017777777778,49,3.8727972507476807,0.3244382222222222,48,2.5482871532440186,2.388465404510498,0.2752647399902344
20000,100,10,0,0.0009975433349609375,5.100358247756958,0.245772,49,4.998114824295044,0.2433535,48,4.006540775299072,3.8658504486083984,0.3430819511413574
25000,100,10,0,0.001993417739868164,6.3793394565582275,0.19686847999999998,49,6.814239978790283,0.19483296,48,5.4084014892578125,5.519268751144409,0.42885375022888184
30000,100,10,0,0.0019960403442382812,7.600920677185059,0.16398666666666667,49,7.947870492935181,0.16235755555555556,48,7.0468590259552,6.938232660293579,0.5305817127227783
35000,100,10,0,0.003989696502685547,9.053665399551392,0.14061632653061226,49,9.097394943237305,0.13918661224489795,48,9.19934368133545,9.114232301712036,0.48969221115112305
40000,100,10,0,0.002991199493408203,10.399353504180908,0.12310925,49,10.586893320083618,0.121767625,48,12.207327604293823,12.41695261001587,0.6876821517944336
45000,100,10,0,0.0049860477447509766,14.16298222541809,0.10942083950617285,49,17.70988631248474,0.10821313580246913,48,20.62136483192444,20.47375750541687,1.3673427104949951
