M xabr 0 xaaf -2.04848
M xacf 0 xaaf -1.35307
M xacz 0 xaaf -0.815235
M xaei 0 xaaf -0.378505
M xaeo 0 xaaf -1.07674
M xafa 1 xaaf 0.209535
M xafn 1 xaaf 1.06416
M xaga 0 xaaf -2.10985
M xaha 0 xaaf -0.971293
M xahk 0 xaaf -2.21981
M xaht 0 xaaf -0.67346
M xaig 0 xaaf -1.78794
M xajc 0 xaaf -0.291281
M xajx 0 xaaf -2.25545
M xakm 0 xaaf -0.395279
M xakw 0 xaaf -1.62328
M xali 0 xaaf -2.17937
M xalx 0 xaaf -3.32103
M xanp 0 xaaf -1.53513
M xaaf 0 xabr -16.0665
M xacf 0 xabr -4.4848
M xacz 0 xabr -0.544507
M xaei 0 xabr -1.03155
M xaeo 0 xabr -5.68575
M xafa 0 xabr -21.1819
M xafn 0 xabr -11.8908
M xaga 0 xabr -4.39994
M xaha 0 xabr -5.67752
M xahk 0 xabr -6.72096
M xaht 0 xabr -2.59875
M xaig 0 xabr -9.8763
M xajc 0 xabr -4.0051
M xajx 1 xabr 1.26065
M xakm 0 xabr -19.9336
M xakw 0 xabr -2.95308
M xali 0 xabr -3.6243
M xalx 0 xabr -4.04809
M xanp 0 xabr -7.87268
M xaaf 0 xacf -6.56213
M xabr 0 xacf -2.14937
M xacz 0 xacf -1.37103
M xaei 0 xacf -1.12329
M xaeo 0 xacf -0.764417
M xafa 0 xacf -7.17319
M xafn 0 xacf -5.69575
M xaga 0 xacf -1.12862
M xaha 0 xacf -0.138562
M xahk 0 xacf -0.699324
M xaht 1 xacf 0.572184
M xaig 0 xacf -2.62636
M xajc 0 xacf -2.56374
M xajx 0 xacf -1.28075
M xakm 0 xacf -4.63953
M xakw 0 xacf -0.215687
M xali 0 xacf -0.376473
M xalx 0 xacf -3.80866
M xanp 0 xacf -3.01213
M xaaf 0 xacz -10.1588
M xabr 0 xacz -0.646836
M xacf 0 xacz -3.5568
M xaei 0 xacz -1.00018
M xaeo 0 xacz -4.03045
M xafa 0 xacz -17.5283
M xafn 0 xacz -9.61303
M xaga 0 xacz -2.89965
M xaha 0 xacz -2.44196
M xahk 0 xacz -3.54463
M xaht 0 xacz -1.50741
M xaig 0 xacz -8.42108
M xajc 0 xacz -4.79692
M xajx 1 xacz 0.00936913
M xakm 0 xacz -14.2713
M xakw 0 xacz -2.40546
M xali 0 xacz -3.05842
M xalx 0 xacz -4.37205
M xanp 0 xacz -6.42891
M xaaf 0 xaei -0.121948
M xabr 0 xaei -2.08612
M xacf 0 xaei -1.78874
M xacz 0 xaei -1.50771
M xaeo 0 xaei -0.0551015
M xafa 0 xaei -0.150674
M xafn 1 xaei 0.01694
M xaga 0 xaei -2.0536
M xaha 0 xaei -0.929428
M xahk 0 xaei -2.14521
M xaht 0 xaei -0.776917
M xaig 0 xaei -0.975928
M xajc 0 xaei -0.535308
M xajx 0 xaei -2.29846
M xakm 1 xaei 0.705456
M xakw 0 xaei -1.35044
M xali 0 xaei -1.55297
M xalx 0 xaei -2.04265
M xanp 0 xaei -1.79381
M xaaf 0 xaeo -6.60187
M xabr 0 xaeo -2.81644
M xacf 0 xaeo -0.470034
M xacz 0 xaeo -1.60052
M xaei 0 xaeo -0.443981
M xafa 0 xaeo -8.86283
M xafn 0 xaeo -4.93811
M xaga 0 xaeo -2.51272
M xaha 0 xaeo -0.694595
M xahk 0 xaeo -1.42677
M xaht 1 xaeo 0.85132
M xaig 0 xaeo -2.66569
M xajc 0 xaeo -1.94427
M xajx 0 xaeo -1.36283
M xakm 0 xaeo -3.93927
M xakw 0 xaeo -0.493492
M xali 0 xaeo -1.49878
M xalx 0 xaeo -4.2156
M xanp 0 xaeo -2.64645
M xaaf 1 xafa 0.0218088
M xabr 0 xafa -2.79939
M xacf 0 xafa -1.3311
M xacz 0 xafa -1.50911
M xaei 0 xafa -0.115319
M xaeo 0 xafa -0.844897
M xafn 1 xafa 0.686235
M xaga 0 xafa -2.39877
M xaha 0 xafa -0.852048
M xahk 0 xafa -2.42122
M xaht 0 xafa -1.14757
M xaig 0 xafa -1.48705
M xajc 0 xafa -0.596903
M xajx 0 xafa -2.94627
M xakm 0 xafa -0.0502639
M xakw 0 xafa -1.35038
M xali 0 xafa -1.88076
M xalx 0 xafa -2.11096
M xanp 0 xafa -0.927159
M xaaf 1 xafn 0.3808
M xabr 0 xafn -2.39942
M xacf 0 xafn -1.31742
M xacz 0 xafn -1.60648
M xaei 0 xafn -0.43193
M xaeo 0 xafn -0.870796
M xafa 1 xafn 0.226149
M xaga 0 xafn -2.34049
M xaha 0 xafn -1.52482
M xahk 0 xafn -2.8766
M xaht 0 xafn -1.16196
M xaig 0 xafn -1.57782
M xajc 1 xafn 0.149341
M xajx 0 xafn -2.28301
M xakm 0 xafn -0.257139
M xakw 0 xafn -1.90149
M xali 0 xafn -2.32244
M xalx 0 xafn -3.48313
M xanp 0 xafn -1.10472
M xaaf 0 xaga -15.4159
M xabr 0 xaga -3.21798
M xacf 0 xaga -1.97966
M xacz 0 xaga -1.85546
M xaei 0 xaga -0.990634
M xaeo 0 xaga -4.19817
M xafa 0 xaga -17.0949
M xafn 0 xaga -14.0768
M xaha 0 xaga -1.91527
M xahk 1 xaga 0.564289
M xaht 0 xaga -1.51147
M xaig 0 xaga -3.29987
M xajc 0 xaga -7.38646
M xajx 0 xaga -0.412921
M xakm 0 xaga -13.1974
M xakw 1 xaga 1.68717
M xali 0 xaga -2.35435
M xalx 0 xaga -2.1145
M xanp 0 xaga -9.84071
M xaaf 0 xaha -9.67491
M xabr 0 xaha -2.92989
M xacf 1 xaha 0.400852
M xacz 0 xaha -0.308867
M xaei 0 xaha -0.769308
M xaeo 0 xaha -0.407424
M xafa 0 xaha -12.6337
M xafn 0 xaha -9.29085
M xaga 0 xaha -0.623736
M xahk 1 xaha 1.50751
M xaht 1 xaha 0.520091
M xaig 0 xaha -2.24768
M xajc 0 xaha -4.56639
M xajx 0 xaha -1.58035
M xakm 0 xaha -7.30996
M xakw 1 xaha 1.75134
M xali 1 xaha 1.81115
M xalx 0 xaha -2.03255
M xanp 0 xaha -4.75505
M xaaf 0 xahk -15.2107
M xabr 0 xahk -4.1771
M xacf 0 xahk -0.306556
M xacz 0 xahk -1.41623
M xaei 0 xahk -0.94732
M xaeo 0 xahk -0.899871
M xafa 0 xahk -16.3234
M xafn 0 xahk -15.7671
M xaga 1 xahk 1.37238
M xaha 1 xahk 1.79962
M xaht 1 xahk 1.07541
M xaig 0 xahk -3.45413
M xajc 0 xahk -8.54992
M xajx 0 xahk -1.49393
M xakm 0 xahk -11.9482
M xakw 1 xahk 2.54713
M xali 1 xahk 1.66858
M xalx 1 xahk 0.0656691
M xanp 0 xahk -6.64397
M xaaf 0 xaht -8.36137
M xabr 0 xaht -1.96568
M xacf 0 xaht -0.438125
M xacz 0 xaht -0.984513
M xaei 0 xaht -0.846602
M xaeo 1 xaht 0.0632063
M xafa 0 xaht -11.8403
M xafn 0 xaht -7.66376
M xaga 0 xaht -1.95184
M xaha 0 xaht -0.978606
M xahk 0 xaht -0.665216
M xaig 0 xaht -5.70435
M xajc 0 xaht -2.80854
M xajx 0 xaht -0.584563
M xakm 0 xaht -7.51357
M xakw 0 xaht -0.408121
M xali 0 xaht -1.30129
M xalx 0 xaht -3.5744
M xanp 0 xaht -4.99778
M xaaf 0 xaig -10.4907
M xabr 0 xaig -3.04489
M xacf 0 xaig -0.0123156
M xacz 0 xaig -2.56278
M xaei 0 xaig -0.676213
M xaeo 0 xaig -0.219535
M xafa 0 xaig -13.5371
M xafn 0 xaig -6.85639
M xaga 1 xaig 0.663228
M xaha 1 xaig 0.399601
M xahk 0 xaig -0.564796
M xaht 0 xaig -2.10778
M xajc 0 xaig -2.78046
M xajx 0 xaig -0.811363
M xakm 0 xaig -6.03692
M xakw 1 xaig 0.683128
M xali 0 xaig -1.41715
M xalx 0 xaig -3.25978
M xanp 0 xaig -3.6427
M xaaf 0 xajc -3.9785
M xabr 0 xajc -0.943506
M xacf 0 xajc -1.29058
M xacz 0 xajc -1.43788
M xaei 0 xajc -0.470309
M xaeo 0 xajc -1.23671
M xafa 0 xajc -5.59503
M xafn 0 xajc -0.347634
M xaga 0 xajc -3.45569
M xaha 0 xajc -2.99652
M xahk 0 xajc -5.29455
M xaht 0 xajc -0.638915
M xaig 0 xajc -4.35839
M xajx 0 xajc -1.49035
M xakm 0 xajc -3.37952
M xakw 0 xajc -3.52044
M xali 0 xajc -3.91941
M xalx 0 xajc -7.94309
M xanp 0 xajc -0.779771
M xaaf 0 xajx -17.5126
M xabr 1 xajx 0.876816
M xacf 0 xajx -4.17099
M xacz 0 xajx -0.336023
M xaei 0 xajx -0.839385
M xaeo 0 xajx -3.68735
M xafa 0 xajx -18.3978
M xafn 0 xajx -13.6487
M xaga 0 xajx -2.2237
M xaha 0 xajx -4.71523
M xahk 0 xajx -4.50181
M xaht 0 xajx -1.44732
M xaig 0 xajx -6.77178
M xajc 0 xajx -5.7887
M xakm 0 xajx -19.0893
M xakw 0 xajx -1.74564
M xali 0 xajx -3.55799
M xalx 0 xajx -1.50926
M xanp 0 xajx -9.10282
M xaaf 0 xakm -0.352032
M xabr 0 xakm -2.56986
M xacf 0 xakm -0.894014
M xacz 0 xakm -1.72986
M xaei 1 xakm 0.110591
M xaeo 1 xakm 0.235433
M xafa 0 xakm -0.239801
M xafn 1 xakm 0.194479
M xaga 0 xakm -1.81041
M xaha 0 xakm -0.839216
M xahk 0 xakm -2.02209
M xaht 0 xakm -0.648387
M xaig 0 xakm -0.988251
M xajc 1 xakm 0.00647799
M xajx 0 xakm -2.74616
M xakw 0 xakm -1.36599
M xali 0 xakm -1.62535
M xalx 0 xakm -3.52449
M xanp 0 xakm -0.738181
M xaaf 0 xakw -14.2754
M xabr 0 xakw -2.24827
M xacf 0 xakw -0.81829
M xacz 0 xakw -1.38399
M xaei 0 xakw -0.946983
M xaeo 0 xakw -0.950865
M xafa 0 xakw -14.4529
M xafn 0 xakw -13.3211
M xaga 1 xakw 1.15823
M xaha 1 xakw 0.808913
M xahk 1 xakw 1.1635
M xaht 1 xakw 0.20739
M xaig 0 xakw -3.26476
M xajc 0 xakw -7.19545
M xajx 0 xakw -0.416646
M xakm 0 xakw -11.8199
M xali 0 xakw -0.215593
M xalx 0 xakw -0.530334
M xanp 0 xakw -8.79785
M xaaf 0 xali -14.6357
M xabr 0 xali -1.67269
M xacf 0 xali -0.170543
M xacz 0 xali -1.15314
M xaei 0 xali -0.853924
M xaeo 0 xali -1.88535
M xafa 0 xali -14.2827
M xafn 0 xali -13.8927
M xaga 0 xali -1.62165
M xaha 1 xali 1.67818
M xahk 1 xali 1.14408
M xaht 0 xali -0.139564
M xaig 0 xali -5.14598
M xajc 0 xali -6.69401
M xajx 0 xali -1.11515
M xakm 0 xali -12.0686
M xakw 1 xali 0.682858
M xalx 0 xali -0.901784
M xanp 0 xali -5.75866
M xaaf 0 xalx -14.9756
M xabr 0 xalx -0.0201721
M xacf 0 xalx -5.01745
M xacz 0 xalx -1.0391
M xaei 0 xalx -0.808245
M xaeo 0 xalx -4.65561
M xafa 0 xalx -14.8838
M xafn 0 xalx -14.6439
M xaga 1 xalx 0.792192
M xaha 0 xalx -1.02715
M xahk 1 xalx 2.93007
M xaht 0 xalx -1.16043
M xaig 0 xalx -7.54791
M xajc 0 xalx -14.4292
M xajx 1 xalx 4.11238
M xakm 0 xalx -18.2991
M xakw 1 xalx 3.8578
M xali 1 xalx 2.15447
M xanp 0 xalx -16.7272
M xaaf 0 xanp -5.56441
M xabr 0 xanp -2.70927
M xacf 0 xanp -0.869454
M xacz 0 xanp -1.66473
M xaei 0 xanp -1.19294
M xaeo 0 xanp -1.25716
M xafa 0 xanp -5.39065
M xafn 0 xanp -2.65239
M xaga 0 xanp -4.41482
M xaha 0 xanp -2.55741
M xahk 0 xanp -3.41013
M xaht 0 xanp -1.58529
M xaig 0 xanp -4.62802
M xajc 0 xanp -0.0491237
M xajx 0 xanp -2.67353
M xakm 0 xanp -3.34237
M xakw 0 xanp -3.80006
M xali 0 xanp -2.64165
M xalx 0 xanp -7.78796
