M spk01 1 xaod 1.60613
M spk02 0 xaod -11.0409
M spk03 0 xaod -3.50159
M spk04 0 xaod -14.5566
M spk05 0 xaod -3.516
M spk06 0 xaod -1.19322
M spk07 0 xaod -0.885503
M spk08 0 xaod -16.0597
M spk09 0 xaod -2.19524
M spk10 0 xaod -8.00134
M spk11 0 xaod -2.23092
M spk12 0 xaod -11.4978
M spk13 0 xaod -4.73358
M spk14 1 xaod 0.308489
M spk15 0 xaod -7.23693
M spk16 0 xaod -5.47353
M spk17 0 xaod -0.641232
M spk18 0 xaod -1.03665
M spk19 0 xaod -15.0603
M spk20 0 xaod -0.684006
M spk21 0 xaod -0.839844
M spk22 0 xaod -1.20883
M spk23 0 xaod -1.38402
M spk24 0 xaod -3.13607
M spk25 0 xaod -0.874995
M spk26 0 xaod -1.81908
M spk27 0 xaod -3.63111
M spk28 0 xaod -0.927826
M spk29 0 xaod -13.2573
M spk30 0 xaod -2.66254
M spk31 0 xaod -1.24144
M spk32 0 xaod -1.0706
M spk33 0 xaod -0.57808
M spk34 0 xaod -0.842194
M spk35 0 xaod -3.37345
M spk36 0 xaod -14.6387
M spk37 0 xaod -1.0224
M spk38 0 xaod -0.308507
M spk39 0 xaod -5.12923
M spk40 0 xaod -0.649652
M spk01 0 xaoh -1.65204
M spk02 1 xaoh 2.43637
M spk03 0 xaoh -0.331192
M spk04 0 xaoh -0.042941
M spk05 0 xaoh -0.370555
M spk06 0 xaoh -0.460994
M spk07 0 xaoh -0.514677
M spk08 0 xaoh -0.965935
M spk09 1 xaoh 0.103599
M spk10 1 xaoh 0.716335
M spk11 0 xaoh -2.06252
M spk12 1 xaoh 0.446548
M spk13 0 xaoh -0.789575
M spk14 0 xaoh -1.80078
M spk15 0 xaoh -1.197
M spk16 1 xaoh 0.31373
M spk17 0 xaoh -0.514859
M spk18 0 xaoh -0.357632
M spk19 0 xaoh -0.834087
M spk20 0 xaoh -2.33992
M spk21 0 xaoh -0.61477
M spk22 0 xaoh -2.82718
M spk23 0 xaoh -0.671944
M spk24 0 xaoh -1.04591
M spk25 0 xaoh -0.480352
M spk26 0 xaoh -1.68522
M spk27 0 xaoh -1.70389
M spk28 0 xaoh -0.377576
M spk29 1 xaoh 0.501654
M spk30 0 xaoh -0.871997
M spk31 0 xaoh -0.468656
M spk32 0 xaoh -0.529285
M spk33 0 xaoh -2.47994
M spk34 0 xaoh -1.36926
M spk35 0 xaoh -0.353332
M spk36 1 xaoh 0.874877
M spk37 0 xaoh -0.50216
M spk38 0 xaoh -1.78124
M spk39 0 xaoh -2.3544
M spk40 0 xaoh -1.19006
M spk01 0 xaom -0.498679
M spk02 0 xaom -2.53516
M spk03 1 xaom 3.58996
M spk04 0 xaom -6.55884
M spk05 0 xaom -0.206062
M spk06 0 xaom -1.26756
M spk07 0 xaom -1.21417
M spk08 0 xaom -6.98243
M spk09 0 xaom -0.670793
M spk10 0 xaom -2.60345
M spk11 0 xaom -3.33638
M spk12 0 xaom -4.76618
M spk13 0 xaom -3.14406
M spk14 0 xaom -0.90565
M spk15 0 xaom -3.29651
M spk16 0 xaom -1.67104
M spk17 0 xaom -0.926786
M spk18 0 xaom -1.12565
M spk19 0 xaom -9.10972
M spk20 0 xaom -0.762381
M spk21 0 xaom -0.694882
M spk22 0 xaom -2.15286
M spk23 0 xaom -2.3165
M spk24 0 xaom -2.71892
M spk25 0 xaom -0.850401
M spk26 0 xaom -1.89976
M spk27 0 xaom -5.38409
M spk28 0 xaom -1.03331
M spk29 0 xaom -4.93922
M spk30 1 xaom 0.0484969
M spk31 0 xaom -1.21323
M spk32 0 xaom -0.668389
M spk33 0 xaom -0.47715
M spk34 0 xaom -0.227922
M spk35 0 xaom -1.52821
M spk36 0 xaom -5.03781
M spk37 0 xaom -1.41982
M spk38 0 xaom -0.610927
M spk39 0 xaom -3.75993
M spk40 1 xaom 1.0905
M spk01 0 xaor -1.47821
M spk02 1 xaor 1.00463
M spk03 0 xaor -0.75306
M spk04 1 xaor 2.81971
M spk05 1 xaor 0.132895
M spk06 0 xaor -0.279937
M spk07 0 xaor -0.332007
M spk08 1 xaor 0.944813
M spk09 0 xaor -0.297855
M spk10 1 xaor 0.605575
M spk11 0 xaor -2.52014
M spk12 1 xaor 0.720361
M spk13 0 xaor -0.342416
M spk14 0 xaor -1.38662
M spk15 1 xaor 0.944625
M spk16 1 xaor 0.386231
M spk17 1 xaor 0.0120504
M spk18 0 xaor -0.157798
M spk19 1 xaor 1.30436
M spk20 0 xaor -2.11289
M spk21 0 xaor -0.668015
M spk22 0 xaor -2.81144
M spk23 0 xaor -0.460715
M spk24 0 xaor -1.04134
M spk25 0 xaor -0.358198
M spk26 0 xaor -1.80422
M spk27 0 xaor -1.37926
M spk28 0 xaor -0.326892
M spk29 1 xaor 1.59139
M spk30 0 xaor -0.0380471
M spk31 0 xaor -0.00298753
M spk32 0 xaor -0.393509
M spk33 0 xaor -2.92874
M spk34 0 xaor -1.46263
M spk35 0 xaor -1.08532
M spk36 1 xaor 0.950523
M spk37 0 xaor -0.402728
M spk38 0 xaor -2.12578
M spk39 0 xaor -2.3531
M spk40 0 xaor -0.823825
M spk01 1 xaqa 0.0779206
M spk02 0 xaqa -1.94444
M spk03 1 xaqa 0.371662
M spk04 0 xaqa -3.68437
M spk05 1 xaqa 3.69952
M spk06 0 xaqa -0.587256
M spk07 0 xaqa -0.640593
M spk08 0 xaqa -2.73636
M spk09 0 xaqa -0.972468
M spk10 0 xaqa -0.564778
M spk11 0 xaqa -4.13598
M spk12 0 xaqa -2.2923
M spk13 0 xaqa -0.323763
M spk14 0 xaqa -1.10542
M spk15 0 xaqa -0.216879
M spk16 0 xaqa -0.334317
M spk17 0 xaqa -0.521048
M spk18 0 xaqa -0.685033
M spk19 0 xaqa -4.1997
M spk20 0 xaqa -1.83829
M spk21 0 xaqa -0.60672
M spk22 0 xaqa -3.40584
M spk23 0 xaqa -0.344052
M spk24 0 xaqa -1.43018
M spk25 0 xaqa -0.508514
M spk26 0 xaqa -3.08573
M spk27 0 xaqa -4.63071
M spk28 0 xaqa -0.717044
M spk29 0 xaqa -2.27909
M spk30 0 xaqa -0.522631
M spk31 0 xaqa -0.75314
M spk32 0 xaqa -0.643854
M spk33 0 xaqa -2.08066
M spk34 0 xaqa -1.38295
M spk35 0 xaqa -0.322953
M spk36 0 xaqa -2.30243
M spk37 0 xaqa -0.999513
M spk38 0 xaqa -1.28419
M spk39 0 xaqa -2.25035
M spk40 1 xaqa 0.0103126
M spk01 0 xaqe -2.02105
M spk02 1 xaqe 0.215127
M spk03 0 xaqe -1.1945
M spk04 1 xaqe 0.354704
M spk05 0 xaqe -0.290244
M spk06 1 xaqe 1.99619
M spk07 1 xaqe 0.696129
M spk08 1 xaqe 0.390209
M spk09 0 xaqe -0.341469
M spk10 1 xaqe 0.598666
M spk11 0 xaqe -2.62367
M spk12 1 xaqe 0.240581
M spk13 0 xaqe -0.847048
M spk14 0 xaqe -1.84039
M spk15 0 xaqe -0.159802
M spk16 0 xaqe -0.1837
M spk17 1 xaqe 0.365937
M spk18 1 xaqe 0.710863
M spk19 1 xaqe 0.217772
M spk20 0 xaqe -2.48545
M spk21 1 xaqe 0.885414
M spk22 0 xaqe -2.23824
M spk23 0 xaqe -0.570015
M spk24 0 xaqe -0.742506
M spk25 1 xaqe 1.03106
M spk26 0 xaqe -1.57166
M spk27 0 xaqe -1.34221
M spk28 1 xaqe 0.626663
M spk29 1 xaqe 0.876167
M spk30 0 xaqe -1.61987
M spk31 1 xaqe 0.652808
M spk32 1 xaqe 1.22305
M spk33 0 xaqe -2.55435
M spk34 0 xaqe -2.2234
M spk35 0 xaqe -1.4185
M spk36 1 xaqe 0.83046
M spk37 0 xaqe -0.0120873
M spk38 0 xaqe -2.62673
M spk39 0 xaqe -2.12691
M spk40 0 xaqe -1.71078
M spk01 0 xaqh -1.98058
M spk02 1 xaqh 0.0916588
M spk03 0 xaqh -1.68506
M spk04 1 xaqh 0.194988
M spk05 0 xaqh -0.471046
M spk06 1 xaqh 0.711555
M spk07 1 xaqh 2.25913
M spk08 1 xaqh 0.00724687
M spk09 0 xaqh -0.575271
M spk10 1 xaqh 0.73404
M spk11 0 xaqh -2.75092
M spk12 1 xaqh 0.151952
M spk13 0 xaqh -0.745662
M spk14 0 xaqh -2.00984
M spk15 0 xaqh -0.0692724
M spk16 0 xaqh -0.422004
M spk17 1 xaqh 0.532974
M spk18 1 xaqh 0.498769
M spk19 0 xaqh -0.294463
M spk20 0 xaqh -2.71556
M spk21 1 xaqh 0.571431
M spk22 0 xaqh -2.35097
M spk23 0 xaqh -0.693833
M spk24 0 xaqh -1.29302
M spk25 1 xaqh 0.622298
M spk26 0 xaqh -1.67027
M spk27 0 xaqh -1.19879
M spk28 1 xaqh 0.460437
M spk29 1 xaqh 0.669595
M spk30 0 xaqh -1.3884
M spk31 1 xaqh 0.540045
M spk32 1 xaqh 0.471317
M spk33 0 xaqh -2.78669
M spk34 0 xaqh -2.40319
M spk35 0 xaqh -1.17704
M spk36 1 xaqh 0.348316
M spk37 1 xaqh 0.137577
M spk38 0 xaqh -2.51405
M spk39 0 xaqh -2.20459
M spk40 0 xaqh -1.70505
M spk01 0 xaqp -1.41567
M spk02 1 xaqp 0.488505
M spk03 0 xaqp -0.0655563
M spk04 1 xaqp 1.63111
M spk05 1 xaqp 1.06918
M spk06 0 xaqp -0.17882
M spk07 0 xaqp -0.452905
M spk08 1 xaqp 3.6503
M spk09 0 xaqp -0.333809
M spk10 1 xaqp 0.872985
M spk11 0 xaqp -3.41535
M spk12 1 xaqp 0.35513
M spk13 1 xaqp 0.087632
M spk14 0 xaqp -1.76986
M spk15 1 xaqp 0.979472
M spk16 1 xaqp 0.293486
M spk17 0 xaqp -0.359535
M spk18 1 xaqp 0.0437626
M spk19 1 xaqp 0.355983
M spk20 0 xaqp -2.26365
M spk21 0 xaqp -0.501989
M spk22 0 xaqp -2.75631
M spk23 0 xaqp -0.502344
M spk24 0 xaqp -1.22302
M spk25 0 xaqp -0.132894
M spk26 0 xaqp -2.3039
M spk27 0 xaqp -2.48395
M spk28 1 xaqp 0.0233805
M spk29 1 xaqp 1.46866
M spk30 0 xaqp -0.152969
M spk31 1 xaqp 0.545139
M spk32 0 xaqp -0.0456444
M spk33 0 xaqp -2.37455
M spk34 0 xaqp -1.41239
M spk35 0 xaqp -0.571017
M spk36 1 xaqp 1.29586
M spk37 0 xaqp -0.578717
M spk38 0 xaqp -1.94059
M spk39 0 xaqp -1.89388
M spk40 0 xaqp -0.294587
M spk01 0 xarm -1.30014
M spk02 0 xarm -3.73355
M spk03 0 xarm -2.3268
M spk04 0 xarm -6.84937
M spk05 0 xarm -3.30059
M spk06 0 xarm -0.698636
M spk07 0 xarm -0.779438
M spk08 0 xarm -7.34897
M spk09 1 xarm 2.12652
M spk10 0 xarm -3.85213
M spk11 0 xarm -0.361929
M spk12 0 xarm -3.47374
M spk13 0 xarm -4.7785
M spk14 0 xarm -1.2473
M spk15 0 xarm -5.6917
M spk16 0 xarm -2.89686
M spk17 0 xarm -0.604697
M spk18 0 xarm -0.690862
M spk19 0 xarm -7.50879
M spk20 0 xarm -2.23947
M spk21 0 xarm -0.897324
M spk22 0 xarm -2.43949
M spk23 0 xarm -1.13635
M spk24 0 xarm -1.15204
M spk25 0 xarm -0.713666
M spk26 1 xarm 0.0983362
M spk27 0 xarm -0.954294
M spk28 0 xarm -0.630853
M spk29 0 xarm -5.17761
M spk30 0 xarm -2.5019
M spk31 0 xarm -0.837854
M spk32 0 xarm -0.743308
M spk33 0 xarm -1.27333
M spk34 0 xarm -0.626186
M spk35 0 xarm -3.75456
M spk36 0 xarm -5.48155
M spk37 0 xarm -0.806529
M spk38 0 xarm -1.00753
M spk39 0 xarm -7.15671
M spk40 0 xarm -1.79074
M spk01 0 xarw -1.76455
M spk02 1 xarw 0.398419
M spk03 0 xarw -1.09118
M spk04 0 xarw -0.120497
M spk05 0 xarw -0.351831
M spk06 1 xarw 0.367707
M spk07 1 xarw 0.420969
M spk08 0 xarw -0.0520875
M spk09 0 xarw -0.464752
M spk10 1 xarw 1.63175
M spk11 0 xarw -2.56454
M spk12 1 xarw 0.260609
M spk13 0 xarw -0.569505
M spk14 0 xarw -1.80965
M spk15 0 xarw -0.701538
M spk16 0 xarw -0.121163
M spk17 1 xarw 0.131669
M spk18 1 xarw 0.602254
M spk19 0 xarw -0.236515
M spk20 0 xarw -2.61268
M spk21 1 xarw 0.246937
M spk22 0 xarw -2.43799
M spk23 0 xarw -0.463699
M spk24 0 xarw -1.07529
M spk25 1 xarw 0.307099
M spk26 0 xarw -1.71774
M spk27 0 xarw -1.32342
M spk28 1 xarw 0.453125
M spk29 1 xarw 0.686127
M spk30 0 xarw -1.14127
M spk31 1 xarw 0.158213
M spk32 1 xarw 0.352227
M spk33 0 xarw -2.53351
M spk34 0 xarw -2.09473
M spk35 0 xarw -0.820327
M spk36 1 xarw 0.749176
M spk37 0 xarw -0.171807
M spk38 0 xarw -2.21166
M spk39 0 xarw -1.71965
M spk40 0 xarw -1.54333
M spk01 0 xary -1.53612
M spk02 0 xary -14.343
M spk03 0 xary -8.32855
M spk04 0 xary -13.7613
M spk05 0 xary -11.1802
M spk06 0 xary -1.23166
M spk07 0 xary -0.856945
M spk08 0 xary -14.4127
M spk09 0 xary -0.063978
M spk10 0 xary -14.4218
M spk11 1 xary 4.20851
M spk12 0 xary -12.6053
M spk13 0 xary -13.4451
M spk14 1 xary 0.175469
M spk15 0 xary -15.4652
M spk16 0 xary -11.9379
M spk17 0 xary -0.639211
M spk18 0 xary -1.10103
M spk19 0 xary -16.4958
M spk20 0 xary -1.96464
M spk21 0 xary -0.795004
M spk22 1 xary 0.554291
M spk23 0 xary -1.97182
M spk24 0 xary -2.00429
M spk25 0 xary -0.814321
M spk26 1 xary 3.04654
M spk27 1 xary 2.12516
M spk28 0 xary -0.917381
M spk29 0 xary -14.4662
M spk30 0 xary -7.37527
M spk31 0 xary -1.36992
M spk32 0 xary -1.09768
M spk33 1 xary 0.47073
M spk34 0 xary -0.322861
M spk35 0 xary -6.73769
M spk36 0 xary -14.1786
M spk37 0 xary -0.946894
M spk38 0 xary -0.292322
M spk39 0 xary -14.0093
M spk40 0 xary -3.85412
M spk01 0 xatm -1.79834
M spk02 1 xatm 1.15486
M spk03 0 xatm -1.05319
M spk04 1 xatm 0.341254
M spk05 0 xatm -0.000740697
M spk06 1 xatm 0.013644
M spk07 0 xatm -0.183767
M spk08 0 xatm -0.427726
M spk09 1 xatm 0.31538
M spk10 1 xatm 0.657938
M spk11 0 xatm -1.66806
M spk12 1 xatm 3.44053
M spk13 0 xatm -1.74824
M spk14 0 xatm -1.86338
M spk15 0 xatm -0.732938
M spk16 0 xatm -0.397694
M spk17 1 xatm 0.183771
M spk18 0 xatm -0.0379433
M spk19 0 xatm -0.0354947
M spk20 0 xatm -2.57717
M spk21 0 xatm -0.623958
M spk22 0 xatm -2.95995
M spk23 0 xatm -0.258052
M spk24 0 xatm -0.55101
M spk25 1 xatm 0.0693887
M spk26 0 xatm -1.31719
M spk27 0 xatm -1.13651
M spk28 0 xatm -0.168098
M spk29 1 xatm 0.371827
M spk30 0 xatm -1.21865
M spk31 0 xatm -0.166404
M spk32 0 xatm -0.185629
M spk33 0 xatm -2.78669
M spk34 0 xatm -1.86448
M spk35 0 xatm -1.31151
M spk36 1 xatm 0.144496
M spk37 0 xatm -0.633499
M spk38 0 xatm -1.94987
M spk39 0 xatm -3.15163
M spk40 0 xatm -1.27786
M spk01 1 xaty 0.0325037
M spk02 0 xaty -1.8171
M spk03 0 xaty -1.24458
M spk04 0 xaty -2.5894
M spk05 1 xaty 0.158343
M spk06 0 xaty -1.06107
M spk07 0 xaty -0.933651
M spk08 0 xaty -2.92002
M spk09 0 xaty -1.02656
M spk10 0 xaty -0.0449254
M spk11 0 xaty -3.47225
M spk12 0 xaty -4.07095
M spk13 1 xaty 4.0596
M spk14 0 xaty -0.847039
M spk15 0 xaty -0.479211
M spk16 1 xaty 0.845534
M spk17 0 xaty -0.996273
M spk18 0 xaty -0.953706
M spk19 0 xaty -2.37698
M spk20 0 xaty -1.10105
M spk21 0 xaty -0.859947
M spk22 0 xaty -2.32522
M spk23 0 xaty -1.28709
M spk24 0 xaty -2.56478
M spk25 0 xaty -0.949204
M spk26 0 xaty -3.01766
M spk27 0 xaty -3.49456
M spk28 0 xaty -0.760276
M spk29 0 xaty -1.62713
M spk30 1 xaty 0.482165
M spk31 0 xaty -0.932698
M spk32 0 xaty -0.975428
M spk33 0 xaty -2.25923
M spk34 0 xaty -0.692626
M spk35 1 xaty 0.701663
M spk36 0 xaty -1.61278
M spk37 0 xaty -1.05238
M spk38 0 xaty -0.625974
M spk39 0 xaty -0.164471
M spk40 1 xaty 0.189582
M spk01 1 xawq 0.207806
M spk02 0 xawq -13.7771
M spk03 0 xawq -4.9394
M spk04 0 xawq -16.236
M spk05 0 xawq -6.04679
M spk06 0 xawq -1.46927
M spk07 0 xawq -1.14091
M spk08 0 xawq -17.6107
M spk09 0 xawq -2.89516
M spk10 0 xawq -10.6528
M spk11 0 xawq -1.12688
M spk12 0 xawq -14.3317
M spk13 0 xawq -7.52156
M spk14 1 xawq 2.19118
M spk15 0 xawq -8.96016
M spk16 0 xawq -8.49495
M spk17 0 xawq -0.851991
M spk18 0 xawq -1.33052
M spk19 0 xawq -17.8522
M spk20 0 xawq -1.07174
M spk21 0 xawq -0.920229
M spk22 0 xawq -0.811505
M spk23 0 xawq -1.95822
M spk24 0 xawq -3.35692
M spk25 0 xawq -0.96299
M spk26 0 xawq -0.442682
M spk27 0 xawq -3.45183
M spk28 0 xawq -1.15098
M spk29 0 xawq -17.4764
M spk30 0 xawq -2.50942
M spk31 0 xawq -1.5866
M spk32 0 xawq -1.20687
M spk33 1 xawq 0.381271
M spk34 0 xawq -0.137756
M spk35 0 xawq -4.20005
M spk36 0 xawq -16.8455
M spk37 0 xawq -1.01137
M spk38 1 xawq 0.0608871
M spk39 0 xawq -7.12323
M spk40 0 xawq -1.40307
M spk01 0 xaxq -0.390637
M spk02 0 xaxq -1.57966
M spk03 0 xaxq -0.367716
M spk04 1 xaxq 0.320367
M spk05 1 xaxq 1.42491
M spk06 0 xaxq -0.427237
M spk07 0 xaxq -0.275583
M spk08 0 xaxq -0.641572
M spk09 0 xaxq -1.09561
M spk10 1 xaxq 0.383842
M spk11 0 xaxq -4.14042
M spk12 0 xaxq -2.17533
M spk13 1 xaxq 0.623576
M spk14 0 xaxq -0.932777
M spk15 1 xaxq 4.94449
M spk16 0 xaxq -0.104568
M spk17 0 xaxq -0.359333
M spk18 0 xaxq -0.971162
M spk19 0 xaxq -0.250771
M spk20 0 xaxq -1.77469
M spk21 0 xaxq -0.598781
M spk22 0 xaxq -3.56203
M spk23 0 xaxq -0.644276
M spk24 0 xaxq -0.502263
M spk25 0 xaxq -0.366255
M spk26 0 xaxq -2.91493
M spk27 0 xaxq -3.50976
M spk28 0 xaxq -0.979347
M spk29 0 xaxq -0.374323
M spk30 1 xaxq 1.18601
M spk31 0 xaxq -0.725639
M spk32 0 xaxq -0.527776
M spk33 0 xaxq -2.96907
M spk34 0 xaxq -1.45741
M spk35 0 xaxq -0.850397
M spk36 0 xaxq -1.16844
M spk37 0 xaxq -1.2818
M spk38 0 xaxq -2.09914
M spk39 0 xaxq -3.49711
M spk40 1 xaxq 0.250805
M spk01 0 xbba -0.248828
M spk02 1 xbba 0.0794347
M spk03 0 xbba -0.0747469
M spk04 0 xbba -1.82024
M spk05 1 xbba 0.281598
M spk06 0 xbba -0.577388
M spk07 0 xbba -0.735281
M spk08 0 xbba -3.04505
M spk09 1 xbba 0.285652
M spk10 1 xbba 0.386815
M spk11 0 xbba -2.92337
M spk12 0 xbba -2.20107
M spk13 1 xbba 0.938247
M spk14 0 xbba -1.3121
M spk15 0 xbba -1.20081
M spk16 1 xbba 3.83921
M spk17 0 xbba -0.489334
M spk18 0 xbba -0.527376
M spk19 0 xbba -0.948619
M spk20 0 xbba -2.46556
M spk21 0 xbba -0.510263
M spk22 0 xbba -3.58161
M spk23 0 xbba -0.821938
M spk24 0 xbba -0.945435
M spk25 0 xbba -0.559327
M spk26 0 xbba -2.25708
M spk27 0 xbba -3.09348
M spk28 0 xbba -0.522298
M spk29 0 xbba -0.139515
M spk30 1 xbba 0.0648432
M spk31 0 xbba -0.73485
M spk32 0 xbba -0.455602
M spk33 0 xbba -2.38674
M spk34 0 xbba -1.12433
M spk35 0 xbba -1.04094
M spk36 0 xbba -0.311788
M spk37 0 xbba -0.852051
M spk38 0 xbba -0.763982
M spk39 0 xbba -1.61807
M spk40 0 xbba -0.79433
M spk01 0 xbey -1.77147
M spk02 0 xbey -0.0518702
M spk03 0 xbey -1.41936
M spk04 1 xbey 0.567412
M spk05 0 xbey -0.413839
M spk06 1 xbey 0.238739
M spk07 1 xbey 0.491967
M spk08 0 xbey -0.0799375
M spk09 0 xbey -0.522005
M spk10 1 xbey 0.194366
M spk11 0 xbey -2.09821
M spk12 1 xbey 0.394228
M spk13 0 xbey -1.10871
M spk14 0 xbey -1.38239
M spk15 0 xbey -0.25556
M spk16 0 xbey -0.37639
M spk17 1 xbey 1.95006
M spk18 1 xbey 0.43891
M spk19 0 xbey -0.355583
M spk20 0 xbey -2.04401
M spk21 0 xbey -0.0673056
M spk22 0 xbey -1.88696
M spk23 0 xbey -0.669046
M spk24 0 xbey -1.21991
M spk25 1 xbey 0.184622
M spk26 0 xbey -1.24586
M spk27 0 xbey -1.09193
M spk28 1 xbey 0.313708
M spk29 1 xbey 0.706523
M spk30 0 xbey -1.40262
M spk31 1 xbey 0.38348
M spk32 1 xbey 0.183312
M spk33 0 xbey -2.56561
M spk34 0 xbey -2.30368
M spk35 0 xbey -1.68701
M spk36 1 xbey 0.187664
M spk37 0 xbey -0.365247
M spk38 0 xbey -2.59728
M spk39 0 xbey -2.2614
M spk40 0 xbey -1.49014
M spk01 0 xbfu -1.79038
M spk02 1 xbfu 0.12229
M spk03 0 xbfu -1.17415
M spk04 1 xbfu 0.254509
M spk05 0 xbfu -0.422661
M spk06 1 xbfu 0.561692
M spk07 1 xbfu 0.325492
M spk08 1 xbfu 0.427236
M spk09 0 xbfu -0.440268
M spk10 1 xbfu 0.605517
M spk11 0 xbfu -2.43697
M spk12 1 xbfu 0.197881
M spk13 0 xbfu -0.682204
M spk14 0 xbfu -1.58738
M spk15 0 xbfu -0.664921
M spk16 0 xbfu -0.162069
M spk17 1 xbfu 0.360594
M spk18 1 xbfu 1.73901
M spk19 0 xbfu -0.246886
M spk20 0 xbfu -2.42378
M spk21 1 xbfu 0.251693
M spk22 0 xbfu -2.06385
M spk23 0 xbfu -0.589366
M spk24 0 xbfu -1.27464
M spk25 1 xbfu 0.657436
M spk26 0 xbfu -1.65582
M spk27 0 xbfu -1.17105
M spk28 1 xbfu 1.56404
M spk29 1 xbfu 0.871738
M spk30 0 xbfu -1.08194
M spk31 1 xbfu 0.925072
M spk32 1 xbfu 0.929462
M spk33 0 xbfu -2.48659
M spk34 0 xbfu -1.85302
M spk35 0 xbfu -1.02266
M spk36 1 xbfu 0.710671
M spk37 1 xbfu 0.210152
M spk38 0 xbfu -2.30599
M spk39 0 xbfu -1.74359
M spk40 0 xbfu -1.37579
M spk01 0 xbhg -1.10737
M spk02 1 xbhg 1.0309
M spk03 0 xbhg -1.04374
M spk04 1 xbhg 2.57412
M spk05 1 xbhg 0.635366
M spk06 0 xbhg -0.102309
M spk07 0 xbhg -0.582587
M spk08 0 xbhg -0.37092
M spk09 1 xbhg 0.0109237
M spk10 1 xbhg 1.40602
M spk11 0 xbhg -2.84151
M spk12 1 xbhg 0.90438
M spk13 1 xbhg 1.02288
M spk14 0 xbhg -1.54942
M spk15 1 xbhg 1.90706
M spk16 1 xbhg 2.12491
M spk17 0 xbhg -0.474326
M spk18 0 xbhg -0.505804
M spk19 1 xbhg 6.10928
M spk20 0 xbhg -2.63121
M spk21 0 xbhg -0.298676
M spk22 0 xbhg -3.85537
M spk23 1 xbhg 0.282519
M spk24 1 xbhg 0.856011
M spk25 0 xbhg -0.0560377
M spk26 0 xbhg -2.08907
M spk27 0 xbhg -2.46508
M spk28 0 xbhg -0.632735
M spk29 1 xbhg 1.89181
M spk30 1 xbhg 0.641263
M spk31 0 xbhg -0.788728
M spk32 0 xbhg -0.269708
M spk33 0 xbhg -3.38637
M spk34 0 xbhg -1.6672
M spk35 0 xbhg -1.14002
M spk36 1 xbhg 1.29503
M spk37 0 xbhg -0.894978
M spk38 0 xbhg -1.46027
M spk39 0 xbhg -3.58303
M spk40 0 xbhg -1.03727
M spk01 1 xbil 0.823953
M spk02 0 xbil -11.5449
M spk03 0 xbil -2.81803
M spk04 0 xbil -15.5067
M spk05 0 xbil -5.13884
M spk06 0 xbil -1.53483
M spk07 0 xbil -1.10527
M spk08 0 xbil -17.0711
M spk09 0 xbil -2.29295
M spk10 0 xbil -9.39078
M spk11 0 xbil -0.94626
M spk12 0 xbil -12.4766
M spk13 0 xbil -5.47305
M spk14 1 xbil 0.881821
M spk15 0 xbil -7.89954
M spk16 0 xbil -8.80189
M spk17 0 xbil -0.971059
M spk18 0 xbil -1.4634
M spk19 0 xbil -17.2265
M spk20 1 xbil 4.38018
M spk21 0 xbil -0.85473
M spk22 1 xbil 2.29836
M spk23 0 xbil -2.16886
M spk24 0 xbil -4.52532
M spk25 0 xbil -1.08949
M spk26 0 xbil -0.677087
M spk27 0 xbil -3.73103
M spk28 0 xbil -1.20716
M spk29 0 xbil -14.967
M spk30 0 xbil -1.71318
M spk31 0 xbil -1.63807
M spk32 0 xbil -1.13494
M spk33 1 xbil 0.986718
M spk34 1 xbil 0.051447
M spk35 0 xbil -2.94256
M spk36 0 xbil -15.9713
M spk37 0 xbil -1.36319
M spk38 1 xbil 1.21779
M spk39 0 xbil -7.18938
M spk40 1 xbil 1.27798
M spk01 0 xbjl -2.13882
M spk02 1 xbjl 0.197901
M spk03 0 xbjl -1.28469
M spk04 1 xbjl 0.143899
M spk05 0 xbjl -0.413722
M spk06 1 xbjl 1.08337
M spk07 1 xbjl 0.87645
M spk08 1 xbjl 0.0516926
M spk09 0 xbjl -0.749888
M spk10 1 xbjl 0.649933
M spk11 0 xbjl -2.83557
M spk12 0 xbjl -0.0971891
M spk13 0 xbjl -1.00314
M spk14 0 xbjl -1.92401
M spk15 0 xbjl -0.260153
M spk16 0 xbjl -0.153919
M spk17 1 xbjl 0.336903
M spk18 1 xbjl 0.643463
M spk19 1 xbjl 0.336429
M spk20 0 xbjl -2.55637
M spk21 1 xbjl 2.51057
M spk22 0 xbjl -2.12271
M spk23 0 xbjl -0.456254
M spk24 0 xbjl -0.902284
M spk25 1 xbjl 0.972295
M spk26 0 xbjl -1.74683
M spk27 0 xbjl -1.39288
M spk28 1 xbjl 0.51649
M spk29 1 xbjl 0.908677
M spk30 0 xbjl -1.62666
M spk31 1 xbjl 0.330888
M spk32 1 xbjl 0.905728
M spk33 0 xbjl -2.6357
M spk34 0 xbjl -2.28607
M spk35 0 xbjl -1.22352
M spk36 1 xbjl 1.08578
M spk37 1 xbjl 0.168646
M spk38 0 xbjl -2.84879
M spk39 0 xbjl -1.86681
M spk40 0 xbjl -1.91956
M spk01 1 xbkl 0.0112896
M spk02 0 xbkl -19.0246
M spk03 0 xbkl -6.55906
M spk04 0 xbkl -18.6025
M spk05 0 xbkl -10.2771
M spk06 0 xbkl -1.66192
M spk07 0 xbkl -1.01105
M spk08 0 xbkl -19.1391
M spk09 0 xbkl -3.43561
M spk10 0 xbkl -16.0158
M spk11 1 xbkl 0.853074
M spk12 0 xbkl -19.027
M spk13 0 xbkl -10.7813
M spk14 1 xbkl 0.802889
M spk15 0 xbkl -14.987
M spk16 0 xbkl -13.9431
M spk17 0 xbkl -1.05673
M spk18 0 xbkl -1.46971
M spk19 0 xbkl -22.4406
M spk20 1 xbkl 2.01983
M spk21 0 xbkl -0.852014
M spk22 1 xbkl 4.67618
M spk23 0 xbkl -3.48875
M spk24 0 xbkl -5.57557
M spk25 0 xbkl -1.06594
M spk26 1 xbkl 0.847269
M spk27 0 xbkl -1.87115
M spk28 0 xbkl -1.1045
M spk29 0 xbkl -20.225
M spk30 0 xbkl -6.03511
M spk31 0 xbkl -1.57471
M spk32 0 xbkl -1.15892
M spk33 1 xbkl 1.8305
M spk34 0 xbkl -0.0580332
M spk35 0 xbkl -4.44947
M spk36 0 xbkl -19.2322
M spk37 0 xbkl -1.09847
M spk38 1 xbkl 1.06691
M spk39 0 xbkl -10.2631
M spk40 0 xbkl -0.330313
M spk01 0 xbmn -0.244817
M spk02 0 xbmn -5.58692
M spk03 0 xbmn -3.49034
M spk04 0 xbmn -8.5329
M spk05 0 xbmn -2.50507
M spk06 0 xbmn -0.54885
M spk07 0 xbmn -0.536336
M spk08 0 xbmn -9.59194
M spk09 0 xbmn -0.690087
M spk10 0 xbmn -4.8192
M spk11 0 xbmn -1.43305
M spk12 0 xbmn -5.89363
M spk13 0 xbmn -4.6333
M spk14 0 xbmn -0.639558
M spk15 0 xbmn -5.16443
M spk16 0 xbmn -4.05147
M spk17 0 xbmn -0.491096
M spk18 0 xbmn -0.551043
M spk19 0 xbmn -7.90482
M spk20 0 xbmn -2.02458
M spk21 0 xbmn -0.339345
M spk22 0 xbmn -2.43301
M spk23 1 xbmn 2.28237
M spk24 0 xbmn -0.286422
M spk25 0 xbmn -0.20474
M spk26 0 xbmn -1.34509
M spk27 0 xbmn -2.05103
M spk28 0 xbmn -0.56567
M spk29 0 xbmn -7.77406
M spk30 0 xbmn -2.26667
M spk31 0 xbmn -0.708026
M spk32 0 xbmn -0.458954
M spk33 0 xbmn -0.965687
M spk34 0 xbmn -1.05371
M spk35 0 xbmn -2.44079
M spk36 0 xbmn -7.75287
M spk37 0 xbmn -0.646203
M spk38 0 xbmn -0.37123
M spk39 0 xbmn -5.07377
M spk40 0 xbmn -1.81801
M spk01 0 xbpa -1.02258
M spk02 0 xbpa -7.14936
M spk03 0 xbpa -3.89081
M spk04 0 xbpa -12.6726
M spk05 0 xbpa -3.9434
M spk06 0 xbpa -0.585848
M spk07 0 xbpa -0.665107
M spk08 0 xbpa -15.1362
M spk09 0 xbpa -0.0614786
M spk10 0 xbpa -6.86293
M spk11 0 xbpa -0.897638
M spk12 0 xbpa -5.81617
M spk13 0 xbpa -6.87404
M spk14 0 xbpa -0.96023
M spk15 0 xbpa -5.62024
M spk16 0 xbpa -4.45615
M spk17 0 xbpa -0.565769
M spk18 0 xbpa -0.883579
M spk19 0 xbpa -8.24576
M spk20 0 xbpa -3.41881
M spk21 0 xbpa -0.417409
M spk22 0 xbpa -3.25156
M spk23 1 xbpa 0.395766
M spk24 1 xbpa 3.21145
M spk25 0 xbpa -0.533808
M spk26 0 xbpa -0.510449
M spk27 0 xbpa -1.92719
M spk28 0 xbpa -0.890641
M spk29 0 xbpa -10.5855
M spk30 0 xbpa -2.69291
M spk31 0 xbpa -1.12045
M spk32 0 xbpa -0.628653
M spk33 0 xbpa -1.44313
M spk34 0 xbpa -1.84019
M spk35 0 xbpa -4.36077
M spk36 0 xbpa -11.054
M spk37 0 xbpa -1.09818
M spk38 0 xbpa -1.0955
M spk39 0 xbpa -10.3623
M spk40 0 xbpa -2.32665
M spk01 0 xbsk -1.83278
M spk02 1 xbsk 0.22377
M spk03 0 xbsk -1.38196
M spk04 1 xbsk 0.3638
M spk05 0 xbsk -0.219738
M spk06 1 xbsk 1.22879
M spk07 1 xbsk 0.769095
M spk08 1 xbsk 0.484407
M spk09 0 xbsk -0.517078
M spk10 1 xbsk 0.751009
M spk11 0 xbsk -2.59575
M spk12 1 xbsk 0.552357
M spk13 0 xbsk -1.02603
M spk14 0 xbsk -1.96882
M spk15 1 xbsk 0.00987382
M spk16 0 xbsk -0.321548
M spk17 1 xbsk 0.435934
M spk18 1 xbsk 0.99545
M spk19 1 xbsk 0.533379
M spk20 0 xbsk -2.88093
M spk21 1 xbsk 0.842772
M spk22 0 xbsk -2.41966
M spk23 1 xbsk 0.0392901
M spk24 0 xbsk -0.797104
M spk25 1 xbsk 2.11102
M spk26 0 xbsk -1.7611
M spk27 0 xbsk -1.0272
M spk28 1 xbsk 0.806895
M spk29 1 xbsk 0.669382
M spk30 0 xbsk -1.41129
M spk31 1 xbsk 0.79397
M spk32 1 xbsk 1.20612
M spk33 0 xbsk -2.61585
M spk34 0 xbsk -2.26786
M spk35 0 xbsk -1.24002
M spk36 1 xbsk 0.663884
M spk37 1 xbsk 0.301532
M spk38 0 xbsk -2.59624
M spk39 0 xbsk -2.09183
M spk40 0 xbsk -1.75496
M spk01 0 xbur -1.44287
M spk02 0 xbur -12.9991
M spk03 0 xbur -6.14367
M spk04 0 xbur -13.1551
M spk05 0 xbur -9.47852
M spk06 0 xbur -1.21802
M spk07 0 xbur -0.843725
M spk08 0 xbur -13.567
M spk09 1 xbur 0.246709
M spk10 0 xbur -12.3087
M spk11 1 xbur 2.87473
M spk12 0 xbur -11.6674
M spk13 0 xbur -12.631
M spk14 1 xbur 0.630012
M spk15 0 xbur -13.2392
M spk16 0 xbur -10.4529
M spk17 0 xbur -0.667636
M spk18 0 xbur -1.24666
M spk19 0 xbur -16.5412
M spk20 0 xbur -1.82646
M spk21 0 xbur -0.808846
M spk22 1 xbur 0.390192
M spk23 0 xbur -2.3643
M spk24 0 xbur -1.93078
M spk25 0 xbur -0.854772
M spk26 1 xbur 4.11238
M spk27 1 xbur 0.173846
M spk28 0 xbur -1.05942
M spk29 0 xbur -14.1605
M spk30 0 xbur -5.52481
M spk31 0 xbur -1.46955
M spk32 0 xbur -1.04796
M spk33 1 xbur 1.26975
M spk34 0 xbur -0.0419932
M spk35 0 xbur -6.78427
M spk36 0 xbur -13.6503
M spk37 0 xbur -1.04223
M spk38 1 xbur 0.23417
M spk39 0 xbur -12.9513
M spk40 0 xbur -2.83833
M spk01 0 xbws -1.26059
M spk02 0 xbws -10.8113
M spk03 0 xbws -8.22418
M spk04 0 xbws -8.93614
M spk05 0 xbws -8.89482
M spk06 0 xbws -0.946437
M spk07 0 xbws -0.610534
M spk08 0 xbws -9.70226
M spk09 1 xbws 0.561393
M spk10 0 xbws -10.693
M spk11 1 xbws 3.16939
M spk12 0 xbws -8.93395
M spk13 0 xbws -10.2127
M spk14 0 xbws -0.676023
M spk15 0 xbws -11.0558
M spk16 0 xbws -9.06687
M spk17 0 xbws -0.384793
M spk18 0 xbws -0.803374
M spk19 0 xbws -12.2708
M spk20 0 xbws -2.89252
M spk21 0 xbws -0.718582
M spk22 0 xbws -0.397771
M spk23 0 xbws -1.34984
M spk24 0 xbws -1.56559
M spk25 0 xbws -0.603833
M spk26 1 xbws 1.60284
M spk27 1 xbws 5.10314
M spk28 0 xbws -0.726458
M spk29 0 xbws -9.2788
M spk30 0 xbws -7.34407
M spk31 0 xbws -1.15265
M spk32 0 xbws -0.927566
M spk33 0 xbws -1.76456
M spk34 0 xbws -0.193596
M spk35 0 xbws -5.67119
M spk36 0 xbws -10.136
M spk37 0 xbws -0.627053
M spk38 0 xbws -2.10009
M spk39 0 xbws -12.7868
M spk40 0 xbws -3.79365
M spk01 0 xcem -1.82612
M spk02 1 xcem 0.127107
M spk03 0 xcem -1.25023
M spk04 1 xcem 0.191998
M spk05 0 xcem -0.522729
M spk06 1 xcem 0.528703
M spk07 1 xcem 0.307962
M spk08 1 xcem 0.45635
M spk09 0 xcem -0.423254
M spk10 1 xcem 0.582051
M spk11 0 xcem -2.51769
M spk12 1 xcem 0.0916518
M spk13 0 xcem -0.609387
M spk14 0 xcem -1.63708
M spk15 0 xcem -0.718787
M spk16 0 xcem -0.170452
M spk17 1 xcem 0.204628
M spk18 1 xcem 1.63571
M spk19 0 xcem -0.246382
M spk20 0 xcem -2.52628
M spk21 1 xcem 0.209903
M spk22 0 xcem -2.07127
M spk23 0 xcem -0.626442
M spk24 0 xcem -1.30691
M spk25 1 xcem 0.57069
M spk26 0 xcem -1.73106
M spk27 0 xcem -1.14518
M spk28 1 xcem 1.77955
M spk29 1 xcem 0.793361
M spk30 0 xcem -1.07129
M spk31 1 xcem 0.943583
M spk32 1 xcem 0.933352
M spk33 0 xcem -2.58006
M spk34 0 xcem -1.92369
M spk35 0 xcem -0.984574
M spk36 1 xcem 0.679792
M spk37 1 xcem 0.187026
M spk38 0 xcem -2.21073
M spk39 0 xcem -1.77634
M spk40 0 xcem -1.39362
M spk01 0 xcgs -1.63346
M spk02 1 xcgs 0.36199
M spk03 0 xcgs -1.15278
M spk04 1 xcgs 0.553224
M spk05 0 xcgs -0.453393
M spk06 1 xcgs 0.374604
M spk07 1 xcgs 0.220323
M spk08 1 xcgs 0.0757971
M spk09 0 xcgs -0.401421
M spk10 1 xcgs 0.562154
M spk11 0 xcgs -2.39825
M spk12 1 xcgs 0.0199734
M spk13 0 xcgs -0.545765
M spk14 0 xcgs -1.60325
M spk15 0 xcgs -0.504013
M spk16 1 xcgs 0.163832
M spk17 1 xcgs 0.303254
M spk18 1 xcgs 0.616056
M spk19 0 xcgs -0.053311
M spk20 0 xcgs -2.26842
M spk21 1 xcgs 0.199657
M spk22 0 xcgs -2.31179
M spk23 0 xcgs -0.756647
M spk24 0 xcgs -1.08962
M spk25 1 xcgs 0.135615
M spk26 0 xcgs -1.57629
M spk27 0 xcgs -1.1492
M spk28 1 xcgs 0.455556
M spk29 1 xcgs 1.48768
M spk30 0 xcgs -1.26613
M spk31 1 xcgs 0.224427
M spk32 1 xcgs 0.320772
M spk33 0 xcgs -2.56178
M spk34 0 xcgs -1.76877
M spk35 0 xcgs -1.22921
M spk36 1 xcgs 0.920344
M spk37 0 xcgs -0.194692
M spk38 0 xcgs -2.27267
M spk39 0 xcgs -1.68884
M spk40 0 xcgs -1.46233
M spk01 0 xcmm -0.265496
M spk02 0 xcmm -4.13715
M spk03 0 xcmm -0.494259
M spk04 0 xcmm -4.89914
M spk05 0 xcmm -1.74006
M spk06 0 xcmm -1.36676
M spk07 0 xcmm -1.18126
M spk08 0 xcmm -6.74913
M spk09 0 xcmm -1.07022
M spk10 0 xcmm -2.20402
M spk11 0 xcmm -2.78357
M spk12 0 xcmm -6.20455
M spk13 0 xcmm -1.30161
M spk14 1 xcmm 0.350501
M spk15 0 xcmm -1.5516
M spk16 0 xcmm -1.95341
M spk17 0 xcmm -0.926821
M spk18 0 xcmm -1.12896
M spk19 0 xcmm -6.05262
M spk20 0 xcmm -0.35311
M spk21 0 xcmm -1.02841
M spk22 0 xcmm -2.22633
M spk23 0 xcmm -1.3221
M spk24 0 xcmm -2.04807
M spk25 0 xcmm -1.05868
M spk26 0 xcmm -1.46696
M spk27 0 xcmm -4.72899
M spk28 0 xcmm -0.99739
M spk29 0 xcmm -4.87089
M spk30 1 xcmm 2.96086
M spk31 0 xcmm -1.04197
M spk32 0 xcmm -1.12718
M spk33 0 xcmm -0.386525
M spk34 0 xcmm -0.248544
M spk35 0 xcmm -1.19092
M spk36 0 xcmm -5.00321
M spk37 0 xcmm -1.1404
M spk38 1 xcmm 0.509943
M spk39 0 xcmm -2.8797
M spk40 1 xcmm 0.825768
M spk01 0 xcpw -1.984
M spk02 1 xcpw 0.108245
M spk03 0 xcpw -1.21292
M spk04 1 xcpw 0.427737
M spk05 0 xcpw -0.433144
M spk06 1 xcpw 0.50202
M spk07 1 xcpw 0.378628
M spk08 1 xcpw 0.837017
M spk09 0 xcpw -0.505734
M spk10 1 xcpw 0.279918
M spk11 0 xcpw -2.64255
M spk12 1 xcpw 0.143581
M spk13 0 xcpw -0.723347
M spk14 0 xcpw -1.68018
M spk15 0 xcpw -0.54165
M spk16 0 xcpw -0.364373
M spk17 1 xcpw 0.348878
M spk18 1 xcpw 0.908594
M spk19 0 xcpw -0.442443
M spk20 0 xcpw -2.52292
M spk21 1 xcpw 0.0544158
M spk22 0 xcpw -2.0767
M spk23 0 xcpw -0.708554
M spk24 0 xcpw -1.40978
M spk25 1 xcpw 0.41734
M spk26 0 xcpw -1.67702
M spk27 0 xcpw -1.33357
M spk28 1 xcpw 0.879659
M spk29 1 xcpw 0.524204
M spk30 0 xcpw -0.898731
M spk31 1 xcpw 1.94615
M spk32 1 xcpw 0.824434
M spk33 0 xcpw -2.38772
M spk34 0 xcpw -2.08732
M spk35 0 xcpw -1.04258
M spk36 1 xcpw 0.487287
M spk37 1 xcpw 0.0447248
M spk38 0 xcpw -2.25302
M spk39 0 xcpw -1.86957
M spk40 0 xcpw -1.06314
M spk01 0 xddo -2.14099
M spk02 1 xddo 0.126918
M spk03 0 xddo -0.844999
M spk04 1 xddo 0.233099
M spk05 0 xddo -0.462035
M spk06 1 xddo 1.21084
M spk07 1 xddo 0.568606
M spk08 1 xddo 0.537641
M spk09 0 xddo -0.586573
M spk10 1 xddo 0.566493
M spk11 0 xddo -2.78767
M spk12 1 xddo 0.181082
M spk13 0 xddo -0.863749
M spk14 0 xddo -1.79467
M spk15 0 xddo -0.307821
M spk16 0 xddo -0.234856
M spk17 1 xddo 0.393138
M spk18 1 xddo 1.15872
M spk19 0 xddo -0.0456168
M spk20 0 xddo -2.50487
M spk21 1 xddo 0.789813
M spk22 0 xddo -2.0346
M spk23 0 xddo -0.592947
M spk24 0 xddo -1.1042
M spk25 1 xddo 1.04303
M spk26 0 xddo -1.64194
M spk27 0 xddo -1.39335
M spk28 1 xddo 1.05954
M spk29 1 xddo 0.839382
M spk30 0 xddo -1.32533
M spk31 1 xddo 1.0981
M spk32 1 xddo 2.19987
M spk33 0 xddo -2.4519
M spk34 0 xddo -1.99291
M spk35 0 xddo -1.11379
M spk36 1 xddo 0.799868
M spk37 1 xddo 0.0220445
M spk38 0 xddo -2.60423
M spk39 0 xddo -1.81377
M spk40 0 xddo -1.54773
M spk01 0 xdhx -0.413886
M spk02 0 xdhx -15.6586
M spk03 0 xdhx -4.59868
M spk04 0 xdhx -16.4015
M spk05 0 xdhx -7.73212
M spk06 0 xdhx -1.46373
M spk07 0 xdhx -1.05962
M spk08 0 xdhx -15.8719
M spk09 0 xdhx -2.30972
M spk10 0 xdhx -13.352
M spk11 0 xdhx -0.204246
M spk12 0 xdhx -16.3508
M spk13 0 xdhx -11.2921
M spk14 1 xdhx 0.960434
M spk15 0 xdhx -13.066
M spk16 0 xdhx -11.0186
M spk17 0 xdhx -1.05878
M spk18 0 xdhx -1.40327
M spk19 0 xdhx -19.7098
M spk20 0 xdhx -0.706748
M spk21 0 xdhx -0.776818
M spk22 1 xdhx 0.656335
M spk23 0 xdhx -2.21667
M spk24 0 xdhx -3.77912
M spk25 0 xdhx -0.883954
M spk26 1 xdhx 0.663574
M spk27 0 xdhx -3.97793
M spk28 0 xdhx -1.12317
M spk29 0 xdhx -17.4615
M spk30 0 xdhx -4.14507
M spk31 0 xdhx -1.33033
M spk32 0 xdhx -1.04138
M spk33 1 xdhx 3.55427
M spk34 1 xdhx 0.000547767
M spk35 0 xdhx -4.93055
M spk36 0 xdhx -16.0105
M spk37 0 xdhx -1.17042
M spk38 1 xdhx 1.02363
M spk39 0 xdhx -7.95702
M spk40 0 xdhx -1.42772
M spk01 0 xdis -1.03792
M spk02 0 xdis -8.15209
M spk03 0 xdis -3.48597
M spk04 0 xdis -10.9025
M spk05 0 xdis -5.28939
M spk06 0 xdis -1.41663
M spk07 0 xdis -1.257
M spk08 0 xdis -11.2255
M spk09 0 xdis -1.24242
M spk10 0 xdis -6.79838
M spk11 0 xdis -0.797958
M spk12 0 xdis -8.93878
M spk13 0 xdis -5.95594
M spk14 1 xdis 0.170254
M spk15 0 xdis -7.8402
M spk16 0 xdis -6.58963
M spk17 0 xdis -1.05963
M spk18 0 xdis -1.27769
M spk19 0 xdis -13.4471
M spk20 0 xdis -1.28305
M spk21 0 xdis -0.868214
M spk22 0 xdis -1.02288
M spk23 0 xdis -2.3992
M spk24 0 xdis -3.8995
M spk25 0 xdis -0.928077
M spk26 0 xdis -0.335719
M spk27 0 xdis -2.59649
M spk28 0 xdis -1.15263
M spk29 0 xdis -9.94542
M spk30 0 xdis -3.05431
M spk31 0 xdis -1.54657
M spk32 0 xdis -1.10428
M spk33 1 xdis 0.160835
M spk34 1 xdis 2.22292
M spk35 0 xdis -2.49025
M spk36 0 xdis -10.1158
M spk37 0 xdis -0.790828
M spk38 0 xdis -0.737037
M spk39 0 xdis -5.51071
M spk40 0 xdis -1.32547
M spk01 0 xdmd -1.18812
M spk02 0 xdmd -3.87255
M spk03 0 xdmd -2.07958
M spk04 0 xdmd -10.7097
M spk05 0 xdmd -1.71588
M spk06 0 xdmd -1.20771
M spk07 0 xdmd -1.02006
M spk08 0 xdmd -11.8414
M spk09 0 xdmd -2.79457
M spk10 0 xdmd -2.66206
M spk11 0 xdmd -3.67782
M spk12 0 xdmd -7.04341
M spk13 0 xdmd -1.1281
M spk14 0 xdmd -1.30577
M spk15 0 xdmd -4.68328
M spk16 0 xdmd -3.72953
M spk17 0 xdmd -1.0165
M spk18 0 xdmd -0.971742
M spk19 0 xdmd -10.1458
M spk20 0 xdmd -1.95693
M spk21 0 xdmd -0.92903
M spk22 0 xdmd -2.19253
M spk23 0 xdmd -1.63532
M spk24 0 xdmd -3.64668
M spk25 0 xdmd -0.959998
M spk26 0 xdmd -3.43587
M spk27 0 xdmd -4.51967
M spk28 0 xdmd -0.968254
M spk29 0 xdmd -7.46874
M spk30 0 xdmd -1.3231
M spk31 0 xdmd -1.09409
M spk32 0 xdmd -0.92068
M spk33 0 xdmd -1.93397
M spk34 0 xdmd -0.376415
M spk35 1 xdmd 2.78285
M spk36 0 xdmd -6.00604
M spk37 0 xdmd -1.07444
M spk38 0 xdmd -0.912142
M spk39 0 xdmd -0.606664
M spk40 0 xdmd -0.589382
M spk01 0 xdsk -2.0518
M spk02 1 xdsk 0.505209
M spk03 0 xdsk -0.956509
M spk04 1 xdsk 0.100925
M spk05 0 xdsk -0.491511
M spk06 1 xdsk 0.38166
M spk07 1 xdsk 0.0789426
M spk08 0 xdsk -0.0914801
M spk09 0 xdsk -0.452249
M spk10 1 xdsk 0.714769
M spk11 0 xdsk -2.45508
M spk12 0 xdsk -0.125722
M spk13 0 xdsk -0.620263
M spk14 0 xdsk -1.60498
M spk15 0 xdsk -0.808165
M spk16 1 xdsk 0.112444
M spk17 0 xdsk -0.104323
M spk18 1 xdsk 0.427238
M spk19 0 xdsk -0.153186
M spk20 0 xdsk -2.24548
M spk21 1 xdsk 0.354473
M spk22 0 xdsk -2.05135
M spk23 0 xdsk -0.909981
M spk24 0 xdsk -1.14951
M spk25 1 xdsk 0.0719886
M spk26 0 xdsk -1.52712
M spk27 0 xdsk -1.43098
M spk28 1 xdsk 0.299229
M spk29 1 xdsk 0.921913
M spk30 0 xdsk -1.35557
M spk31 1 xdsk 0.0864264
M spk32 1 xdsk 0.329362
M spk33 0 xdsk -2.29483
M spk34 0 xdsk -1.71705
M spk35 0 xdsk -0.760538
M spk36 1 xdsk 1.55986
M spk37 1 xdsk 0.0626056
M spk38 0 xdsk -2.45001
M spk39 0 xdsk -1.51632
M spk40 0 xdsk -1.65597
M spk01 0 xdws -2.15634
M spk02 1 xdws 0.147951
M spk03 0 xdws -1.65885
M spk04 1 xdws 0.0697513
M spk05 0 xdws -0.77706
M spk06 1 xdws 0.115796
M spk07 1 xdws 0.306219
M spk08 0 xdws -0.121537
M spk09 0 xdws -0.498901
M spk10 1 xdws 0.285997
M spk11 0 xdws -2.51202
M spk12 0 xdws -0.187711
M spk13 0 xdws -0.797412
M spk14 0 xdws -1.5442
M spk15 0 xdws -1.34195
M spk16 0 xdws -0.533949
M spk17 0 xdws -0.131761
M spk18 1 xdws 0.468684
M spk19 0 xdws -0.608386
M spk20 0 xdws -2.78079
M spk21 1 xdws 0.00885297
M spk22 0 xdws -2.02762
M spk23 0 xdws -0.707231
M spk24 0 xdws -1.68554
M spk25 1 xdws 0.208767
M spk26 0 xdws -1.58066
M spk27 0 xdws -0.910397
M spk28 1 xdws 0.379905
M spk29 1 xdws 0.249749
M spk30 0 xdws -1.35106
M spk31 1 xdws 0.247693
M spk32 1 xdws 0.101941
M spk33 0 xdws -2.41916
M spk34 0 xdws -1.40683
M spk35 0 xdws -0.804813
M spk36 1 xdws 0.461839
M spk37 1 xdws 2.19887
M spk38 0 xdws -2.27062
M spk39 0 xdws -1.60849
M spk40 0 xdws -1.68445
M spk01 1 xfbq 0.0213751
M spk02 0 xfbq -9.25219
M spk03 0 xfbq -3.71305
M spk04 0 xfbq -11.7854
M spk05 0 xfbq -5.36136
M spk06 0 xfbq -1.45105
M spk07 0 xfbq -1.03461
M spk08 0 xfbq -12.1283
M spk09 0 xfbq -1.51786
M spk10 0 xfbq -8.42679
M spk11 0 xfbq -0.326537
M spk12 0 xfbq -10.8707
M spk13 0 xfbq -6.06146
M spk14 1 xfbq 0.735954
M spk15 0 xfbq -9.17227
M spk16 0 xfbq -6.03252
M spk17 0 xfbq -0.988379
M spk18 0 xfbq -1.27352
M spk19 0 xfbq -13.4865
M spk20 1 xfbq 0.105466
M spk21 0 xfbq -0.989553
M spk22 1 xfbq 0.234893
M spk23 0 xfbq -1.03071
M spk24 0 xfbq -2.63912
M spk25 0 xfbq -1.0439
M spk26 1 xfbq 0.280756
M spk27 0 xfbq -3.62787
M spk28 0 xfbq -0.997231
M spk29 0 xfbq -12.6969
M spk30 0 xfbq -1.9162
M spk31 0 xfbq -1.36192
M spk32 0 xfbq -1.27689
M spk33 1 xfbq 1.33915
M spk34 0 xfbq -0.48936
M spk35 0 xfbq -2.77263
M spk36 0 xfbq -11.8419
M spk37 0 xfbq -1.04441
M spk38 1 xfbq 3.53008
M spk39 0 xfbq -5.1617
M spk40 0 xfbq -0.369512
M spk01 1 xfdr 1.18451
M spk02 0 xfdr -7.91341
M spk03 0 xfdr -1.69322
M spk04 0 xfdr -12.9001
M spk05 0 xfdr -1.27241
M spk06 0 xfdr -1.39481
M spk07 0 xfdr -1.24066
M spk08 0 xfdr -14.2451
M spk09 0 xfdr -4.72817
M spk10 0 xfdr -4.17353
M spk11 0 xfdr -5.53518
M spk12 0 xfdr -13.1108
M spk13 1 xfdr 0.837059
M spk14 1 xfdr 0.336038
M spk15 0 xfdr -6.77203
M spk16 0 xfdr -2.57067
M spk17 0 xfdr -1.02598
M spk18 0 xfdr -1.13818
M spk19 0 xfdr -15.1982
M spk20 0 xfdr -1.62395
M spk21 0 xfdr -0.718328
M spk22 0 xfdr -2.03425
M spk23 0 xfdr -1.63543
M spk24 0 xfdr -6.64154
M spk25 0 xfdr -0.983952
M spk26 0 xfdr -5.04286
M spk27 0 xfdr -7.36592
M spk28 0 xfdr -1.05531
M spk29 0 xfdr -11.217
M spk30 0 xfdr -0.514584
M spk31 0 xfdr -1.25135
M spk32 0 xfdr -0.902155
M spk33 0 xfdr -0.140562
M spk34 1 xfdr 0.483146
M spk35 1 xfdr 3.45439
M spk36 0 xfdr -9.83496
M spk37 0 xfdr -0.977838
M spk38 1 xfdr 0.562851
M spk39 1 xfdr 8.64824
M spk40 0 xfdr -0.0923015
M spk01 1 xfvs 0.24246
M spk02 0 xfvs -7.15241
M spk03 0 xfvs -0.454549
M spk04 0 xfvs -10.2635
M spk05 0 xfvs -2.49588
M spk06 0 xfvs -1.22713
M spk07 0 xfvs -0.989003
M spk08 0 xfvs -11.3055
M spk09 0 xfvs -1.73795
M spk10 0 xfvs -5.39924
M spk11 0 xfvs -2.56404
M spk12 0 xfvs -7.95122
M spk13 0 xfvs -3.3108
M spk14 0 xfvs -0.0772403
M spk15 0 xfvs -4.50028
M spk16 0 xfvs -5.0713
M spk17 0 xfvs -0.815501
M spk18 0 xfvs -1.11263
M spk19 0 xfvs -11.8162
M spk20 1 xfvs 0.698816
M spk21 0 xfvs -0.896926
M spk22 0 xfvs -0.317918
M spk23 0 xfvs -2.17693
M spk24 0 xfvs -3.2826
M spk25 0 xfvs -0.972639
M spk26 0 xfvs -1.49324
M spk27 0 xfvs -4.55817
M spk28 0 xfvs -0.951529
M spk29 0 xfvs -9.23069
M spk30 0 xfvs -0.28167
M spk31 0 xfvs -0.959023
M spk32 0 xfvs -0.983072
M spk33 0 xfvs -0.072261
M spk34 0 xfvs -0.118861
M spk35 0 xfvs -1.65889
M spk36 0 xfvs -9.98206
M spk37 0 xfvs -1.06521
M spk38 1 xfvs 0.506107
M spk39 0 xfvs -4.67048
M spk40 1 xfvs 2.22492
