M spk01 0 xaaf -1.14511
M spk02 1 xaaf 0.558473
M spk03 0 xaaf -0.449024
M spk04 1 xaaf 0.171683
M spk05 1 xaaf 0.174966
M spk06 0 xaaf -1.14516
M spk07 0 xaaf -0.780838
M spk08 1 xaaf 0.105376
M spk09 0 xaaf -0.563987
M spk10 1 xaaf 0.707405
M spk11 0 xaaf -2.41588
M spk12 0 xaaf -0.582728
M spk13 1 xaaf 1.18322
M spk14 0 xaaf -1.3758
M spk15 0 xaaf -0.580994
M spk16 1 xaaf 0.49572
M spk17 0 xaaf -0.891801
M spk18 0 xaaf -0.335547
M spk19 0 xaaf -0.754356
M spk20 0 xaaf -1.60143
M spk21 0 xaaf -1.02479
M spk22 0 xaaf -2.23652
M spk23 0 xaaf -0.957224
M spk24 0 xaaf -2.15379
M spk25 0 xaaf -0.974
M spk26 0 xaaf -1.98364
M spk27 0 xaaf -2.09518
M spk28 0 xaaf -0.360579
M spk29 1 xaaf 0.242937
M spk30 1 xaaf 0.360469
M spk31 0 xaaf -0.374733
M spk32 0 xaaf -0.977269
M spk33 0 xaaf -2.02535
M spk34 0 xaaf -1.0593
M spk35 1 xaaf 0.328044
M spk36 1 xaaf 0.331712
M spk37 0 xaaf -0.678141
M spk38 0 xaaf -1.02098
M spk39 0 xaaf -0.582343
M spk40 0 xaaf -0.0398623
M spk01 0 xabr -0.0505184
M spk02 0 xabr -16.3732
M spk03 0 xabr -5.90795
M spk04 0 xabr -18.3765
M spk05 0 xabr -5.62876
M spk06 0 xabr -1.49747
M spk07 0 xabr -1.08982
M spk08 0 xabr -18.7786
M spk09 0 xabr -3.63446
M spk10 0 xabr -12.4201
M spk11 0 xabr -1.89518
M spk12 0 xabr -16.6928
M spk13 0 xabr -8.40055
M spk14 1 xabr 1.43235
M spk15 0 xabr -11.1956
M spk16 0 xabr -10.0521
M spk17 0 xabr -0.934862
M spk18 0 xabr -1.35088
M spk19 0 xabr -21.266
M spk20 0 xabr -1.38071
M spk21 0 xabr -0.794054
M spk22 0 xabr -0.371951
M spk23 0 xabr -2.78198
M spk24 0 xabr -3.85608
M spk25 0 xabr -0.960141
M spk26 0 xabr -1.10977
M spk27 0 xabr -4.74689
M spk28 0 xabr -1.11987
M spk29 0 xabr -19.6637
M spk30 0 xabr -3.61741
M spk31 0 xabr -1.5005
M spk32 0 xabr -1.00616
M spk33 1 xabr 1.01671
M spk34 0 xabr -0.352417
M spk35 0 xabr -3.19987
M spk36 0 xabr -17.8596
M spk37 0 xabr -1.08471
M spk38 0 xabr -0.397366
M spk39 0 xabr -6.35722
M spk40 0 xabr -2.19469
M spk01 0 xacf -1.92778
M spk02 0 xacf -3.23407
M spk03 0 xacf -2.4641
M spk04 0 xacf -6.6342
M spk05 0 xacf -3.31048
M spk06 0 xacf -0.920026
M spk07 0 xacf -1.06277
M spk08 0 xacf -7.25889
M spk09 1 xacf 0.859247
M spk10 0 xacf -4.33108
M spk11 0 xacf -0.362597
M spk12 0 xacf -3.78719
M spk13 0 xacf -5.11401
M spk14 0 xacf -1.15964
M spk15 0 xacf -5.01574
M spk16 0 xacf -3.26412
M spk17 0 xacf -0.943545
M spk18 0 xacf -1.25558
M spk19 0 xacf -6.21792
M spk20 0 xacf -2.3018
M spk21 0 xacf -0.705188
M spk22 0 xacf -2.77262
M spk23 0 xacf -2.05646
M spk24 0 xacf -0.664239
M spk25 0 xacf -0.710079
M spk26 1 xacf 0.207932
M spk27 0 xacf -1.70816
M spk28 0 xacf -1.21375
M spk29 0 xacf -4.89573
M spk30 0 xacf -2.97152
M spk31 0 xacf -1.22189
M spk32 0 xacf -0.857999
M spk33 0 xacf -1.00668
M spk34 1 xacf 0.0772449
M spk35 0 xacf -3.43044
M spk36 0 xacf -4.63471
M spk37 0 xacf -1.18384
M spk38 0 xacf -1.18636
M spk39 0 xacf -7.91892
M spk40 0 xacf -2.28761
M spk01 1 xacz 0.37136
M spk02 0 xacz -11.5462
M spk03 0 xacz -2.41475
M spk04 0 xacz -14.9361
M spk05 0 xacz -5.53955
M spk06 0 xacz -1.36286
M spk07 0 xacz -0.992231
M spk08 0 xacz -15.4999
M spk09 0 xacz -2.15272
M spk10 0 xacz -9.26072
M spk11 0 xacz -1.29968
M spk12 0 xacz -11.7178
M spk13 0 xacz -6.48173
M spk14 1 xacz 0.408264
M spk15 0 xacz -8.62308
M spk16 0 xacz -8.2559
M spk17 0 xacz -0.868985
M spk18 0 xacz -1.26801
M spk19 0 xacz -17.9049
M spk20 1 xacz 1.03015
M spk21 0 xacz -0.865281
M spk22 1 xacz 1.06409
M spk23 0 xacz -3.05578
M spk24 0 xacz -4.21082
M spk25 0 xacz -1.01951
M spk26 0 xacz -0.478452
M spk27 0 xacz -4.02956
M spk28 0 xacz -1.02109
M spk29 0 xacz -14.9506
M spk30 0 xacz -2.32128
M spk31 0 xacz -1.21511
M spk32 0 xacz -1.06122
M spk33 1 xacz 1.18504
M spk34 1 xacz 0.301729
M spk35 0 xacz -2.89917
M spk36 0 xacz -15.421
M spk37 0 xacz -1.1489
M spk38 1 xacz 0.897076
M spk39 0 xacz -6.05064
M spk40 1 xacz 1.50411
M spk01 0 xaei -1.75545
M spk02 1 xaei 0.213035
M spk03 0 xaei -1.4732
M spk04 1 xaei 0.143146
M spk05 0 xaei -0.511191
M spk06 1 xaei 0.560133
M spk07 1 xaei 0.436245
M spk08 0 xaei -0.0121119
M spk09 0 xaei -0.268246
M spk10 1 xaei 0.788021
M spk11 0 xaei -2.22818
M spk12 1 xaei 0.471917
M spk13 0 xaei -0.700266
M spk14 0 xaei -1.40446
M spk15 0 xaei -0.959066
M spk16 0 xaei -0.165235
M spk17 1 xaei 0.292826
M spk18 1 xaei 0.803287
M spk19 0 xaei -0.0277243
M spk20 0 xaei -2.43135
M spk21 1 xaei 0.263981
M spk22 0 xaei -1.98907
M spk23 0 xaei -0.452906
M spk24 0 xaei -1.27567
M spk25 1 xaei 0.488047
M spk26 0 xaei -1.52066
M spk27 0 xaei -1.09708
M spk28 1 xaei 0.655651
M spk29 1 xaei 0.592728
M spk30 0 xaei -1.26023
M spk31 1 xaei 0.463131
M spk32 1 xaei 0.343202
M spk33 0 xaei -2.31754
M spk34 0 xaei -1.91473
M spk35 0 xaei -0.98327
M spk36 1 xaei 0.60902
M spk37 1 xaei 0.467804
M spk38 0 xaei -2.28946
M spk39 0 xaei -1.55003
M spk40 0 xaei -1.54021
M spk01 0 xaeo -0.415266
M spk02 0 xaeo -3.36884
M spk03 0 xaeo -2.23642
M spk04 0 xaeo -6.7439
M spk05 0 xaeo -1.71041
M spk06 0 xaeo -0.231684
M spk07 0 xaeo -0.382806
M spk08 0 xaeo -8.73379
M spk09 1 xaeo 0.670982
M spk10 0 xaeo -3.25029
M spk11 0 xaeo -1.2598
M spk12 0 xaeo -2.59184
M spk13 0 xaeo -3.71128
M spk14 0 xaeo -1.64903
M spk15 0 xaeo -4.00828
M spk16 0 xaeo -1.56126
M spk17 0 xaeo -0.216686
M spk18 0 xaeo -0.552234
M spk19 0 xaeo -6.0863
M spk20 0 xaeo -2.65707
M spk21 0 xaeo -0.39756
M spk22 0 xaeo -3.00217
M spk23 0 xaeo -0.191179
M spk24 1 xaeo 0.571745
M spk25 0 xaeo -0.333301
M spk26 0 xaeo -1.28294
M spk27 0 xaeo -0.832169
M spk28 0 xaeo -0.54878
M spk29 0 xaeo -4.698
M spk30 0 xaeo -2.89309
M spk31 0 xaeo -0.781142
M spk32 0 xaeo -0.491145
M spk33 0 xaeo -2.1975
M spk34 0 xaeo -1.69198
M spk35 0 xaeo -3.19502
M spk36 0 xaeo -5.73885
M spk37 0 xaeo -0.794428
M spk38 0 xaeo -1.59771
M spk39 0 xaeo -6.63575
M spk40 0 xaeo -1.62852
M spk01 0 xafa -2.29839
M spk02 1 xafa 0.246496
M spk03 0 xafa -1.37448
M spk04 1 xafa 0.5569
M spk05 0 xafa -0.674123
M spk06 0 xafa -0.0732137
M spk07 0 xafa -0.0705392
M spk08 1 xafa 0.472284
M spk09 0 xafa -0.655813
M spk10 1 xafa 0.249556
M spk11 0 xafa -2.53324
M spk12 1 xafa 0.519081
M spk13 0 xafa -1.29717
M spk14 0 xafa -1.70763
M spk15 0 xafa -0.366871
M spk16 0 xafa -0.586416
M spk17 0 xafa -0.0196133
M spk18 1 xafa 0.459963
M spk19 0 xafa -0.270792
M spk20 0 xafa -2.70465
M spk21 0 xafa -0.245734
M spk22 0 xafa -2.28969
M spk23 0 xafa -0.629746
M spk24 0 xafa -1.61744
M spk25 1 xafa 0.193255
M spk26 0 xafa -1.65356
M spk27 0 xafa -1.32806
M spk28 1 xafa 0.374259
M spk29 1 xafa 0.309055
M spk30 0 xafa -1.03864
M spk31 1 xafa 0.670109
M spk32 1 xafa 0.339733
M spk33 0 xafa -2.67823
M spk34 0 xafa -2.14139
M spk35 0 xafa -1.0379
M spk36 1 xafa 0.469627
M spk37 0 xafa -0.254819
M spk38 0 xafa -2.72693
M spk39 0 xafa -2.00269
M spk40 0 xafa -1.54062
M spk01 0 xafn -1.45872
M spk02 1 xafn 0.365051
M spk03 0 xafn -0.789806
M spk04 0 xafn -0.0437315
M spk05 1 xafn 0.175702
M spk06 0 xafn -0.643614
M spk07 0 xafn -0.359422
M spk08 1 xafn 0.254469
M spk09 0 xafn -0.744008
M spk10 1 xafn 0.562507
M spk11 0 xafn -2.79216
M spk12 0 xafn -0.561201
M spk13 0 xafn -0.174657
M spk14 0 xafn -1.61149
M spk15 0 xafn -0.198641
M spk16 0 xafn -0.171917
M spk17 0 xafn -0.631117
M spk18 0 xafn -0.18703
M spk19 0 xafn -0.968114
M spk20 0 xafn -2.62578
M spk21 0 xafn -0.575611
M spk22 0 xafn -2.83251
M spk23 0 xafn -0.602426
M spk24 0 xafn -1.59612
M spk25 0 xafn -0.300695
M spk26 0 xafn -2.04479
M spk27 0 xafn -2.0059
M spk28 0 xafn -0.212009
M spk29 1 xafn 0.139824
M spk30 0 xafn -0.54588
M spk31 0 xafn -0.230111
M spk32 0 xafn -0.53031
M spk33 0 xafn -2.32126
M spk34 0 xafn -1.36415
M spk35 0 xafn -0.176296
M spk36 1 xafn 0.421996
M spk37 0 xafn -0.357542
M spk38 0 xafn -2.11184
M spk39 0 xafn -1.16393
M spk40 0 xafn -1.02907
M spk01 0 xaga -1.49059
M spk02 0 xaga -11.4071
M spk03 0 xaga -6.33095
M spk04 0 xaga -14.3001
M spk05 0 xaga -9.993
M spk06 0 xaga -1.32392
M spk07 0 xaga -0.968584
M spk08 0 xaga -15.229
M spk09 0 xaga -0.603156
M spk10 0 xaga -12.0835
M spk11 1 xaga 1.09926
M spk12 0 xaga -13.5682
M spk13 0 xaga -10.1924
M spk14 0 xaga -0.980584
M spk15 0 xaga -16.4692
M spk16 0 xaga -7.71515
M spk17 0 xaga -0.919667
M spk18 0 xaga -1.15538
M spk19 0 xaga -17.7231
M spk20 0 xaga -3.57911
M spk21 0 xaga -0.804322
M spk22 0 xaga -1.42655
M spk23 0 xaga -0.930043
M spk24 0 xaga -3.58871
M spk25 0 xaga -0.877054
M spk26 1 xaga 0.84211
M spk27 0 xaga -1.90604
M spk28 0 xaga -1.01102
M spk29 0 xaga -15.1849
M spk30 0 xaga -6.2379
M spk31 0 xaga -1.45699
M spk32 0 xaga -1.01947
M spk33 1 xaga 0.0945404
M spk34 1 xaga 0.362966
M spk35 0 xaga -4.92757
M spk36 0 xaga -13.4483
M spk37 0 xaga -0.833993
M spk38 1 xaga 0.402078
M spk39 0 xaga -7.59088
M spk40 0 xaga -4.30954
M spk01 0 xaha -1.44167
M spk02 0 xaha -6.69771
M spk03 0 xaha -4.82318
M spk04 0 xaha -10.2562
M spk05 0 xaha -6.14947
M spk06 0 xaha -0.948415
M spk07 0 xaha -0.829255
M spk08 0 xaha -11.1899
M spk09 1 xaha 0.976251
M spk10 0 xaha -7.72606
M spk11 1 xaha 1.92637
M spk12 0 xaha -3.94667
M spk13 0 xaha -7.67217
M spk14 0 xaha -1.32892
M spk15 0 xaha -8.58882
M spk16 0 xaha -7.20005
M spk17 0 xaha -0.722808
M spk18 0 xaha -0.902982
M spk19 0 xaha -9.93949
M spk20 0 xaha -0.866673
M spk21 0 xaha -0.81269
M spk22 0 xaha -0.312371
M spk23 0 xaha -0.807882
M spk24 0 xaha -0.272627
M spk25 0 xaha -0.668422
M spk26 1 xaha 1.29298
M spk27 1 xaha 0.756909
M spk28 0 xaha -0.796895
M spk29 0 xaha -10.2198
M spk30 0 xaha -4.61853
M spk31 0 xaha -1.11168
M spk32 0 xaha -0.862993
M spk33 0 xaha -1.2921
M spk34 1 xaha 0.0591955
M spk35 0 xaha -4.13244
M spk36 0 xaha -11.0982
M spk37 0 xaha -0.780937
M spk38 0 xaha -0.268419
M spk39 0 xaha -11.2147
M spk40 0 xaha -1.43086
M spk01 0 xahk -1.72985
M spk02 0 xahk -10.6777
M spk03 0 xahk -6.34088
M spk04 0 xahk -13.3815
M spk05 0 xahk -9.51285
M spk06 0 xahk -1.17657
M spk07 0 xahk -0.909815
M spk08 0 xahk -14.6806
M spk09 1 xahk 1.56075
M spk10 0 xahk -12.0517
M spk11 1 xahk 3.27661
M spk12 0 xahk -8.2272
M spk13 0 xahk -10.8073
M spk14 0 xahk -0.81319
M spk15 0 xahk -14.7655
M spk16 0 xahk -7.43618
M spk17 0 xahk -0.589487
M spk18 0 xahk -1.23603
M spk19 0 xahk -15.3393
M spk20 0 xahk -2.58592
M spk21 0 xahk -0.970644
M spk22 0 xahk -0.698263
M spk23 0 xahk -1.46455
M spk24 0 xahk -1.25779
M spk25 0 xahk -0.967513
M spk26 1 xahk 2.85425
M spk27 1 xahk 1.89749
M spk28 0 xahk -1.11605
M spk29 0 xahk -14.6841
M spk30 0 xahk -6.65136
M spk31 0 xahk -1.40869
M spk32 0 xahk -1.25513
M spk33 0 xahk -0.98758
M spk34 0 xahk -0.44326
M spk35 0 xahk -7.15629
M spk36 0 xahk -14.2322
M spk37 0 xahk -1.04206
M spk38 1 xahk 0.167005
M spk39 0 xahk -14.0569
M spk40 0 xahk -3.12032
M spk01 0 xaht -0.21343
M spk02 0 xaht -6.1347
M spk03 0 xaht -2.69175
M spk04 0 xaht -9.19267
M spk05 0 xaht -2.5011
M spk06 0 xaht -0.971378
M spk07 0 xaht -0.95251
M spk08 0 xaht -10.2206
M spk09 1 xaht 0.248136
M spk10 0 xaht -6.19212
M spk11 0 xaht -0.298714
M spk12 0 xaht -5.16306
M spk13 0 xaht -4.93869
M spk14 0 xaht -0.500913
M spk15 0 xaht -6.901
M spk16 0 xaht -3.97733
M spk17 0 xaht -0.638146
M spk18 0 xaht -1.12996
M spk19 0 xaht -10.3427
M spk20 0 xaht -1.70917
M spk21 0 xaht -0.832685
M spk22 0 xaht -2.10585
M spk23 0 xaht -1.28002
M spk24 0 xaht -1.43967
M spk25 0 xaht -0.795814
M spk26 0 xaht -0.774526
M spk27 0 xaht -1.03996
M spk28 0 xaht -1.02389
M spk29 0 xaht -8.23606
M spk30 0 xaht -4.20805
M spk31 0 xaht -1.21548
M spk32 0 xaht -0.998366
M spk33 0 xaht -1.35367
M spk34 0 xaht -0.549308
M spk35 0 xaht -3.79873
M spk36 0 xaht -9.12283
M spk37 0 xaht -1.02467
M spk38 0 xaht -1.01612
M spk39 0 xaht -7.03029
M spk40 0 xaht -1.6448
M spk01 0 xaig -2.17876
M spk02 0 xaig -6.13105
M spk03 0 xaig -5.01467
M spk04 0 xaig -10.2217
M spk05 0 xaig -5.10216
M spk06 0 xaig -0.630833
M spk07 0 xaig -0.724235
M spk08 0 xaig -10.848
M spk09 1 xaig 0.158169
M spk10 0 xaig -5.66974
M spk11 0 xaig -0.691857
M spk12 0 xaig -6.0414
M spk13 0 xaig -6.33719
M spk14 0 xaig -2.06414
M spk15 0 xaig -7.05781
M spk16 0 xaig -3.87436
M spk17 0 xaig -0.776449
M spk18 0 xaig -0.662909
M spk19 0 xaig -5.86337
M spk20 0 xaig -4.77777
M spk21 0 xaig -0.336677
M spk22 0 xaig -3.04003
M spk23 1 xaig 1.11654
M spk24 1 xaig 1.6162
M spk25 0 xaig -0.491956
M spk26 0 xaig -0.244943
M spk27 0 xaig -1.73259
M spk28 0 xaig -0.703214
M spk29 0 xaig -9.99864
M spk30 0 xaig -3.74759
M spk31 0 xaig -0.928387
M spk32 0 xaig -0.370248
M spk33 0 xaig -1.2358
M spk34 0 xaig -1.18475
M spk35 0 xaig -3.12824
M spk36 0 xaig -8.31984
M spk37 0 xaig -0.702335
M spk38 0 xaig -0.407379
M spk39 0 xaig -8.16625
M spk40 0 xaig -3.25588
M spk01 0 xajc -0.109042
M spk02 0 xajc -3.36353
M spk03 0 xajc -0.40605
M spk04 0 xajc -4.38715
M spk05 1 xajc 1.46236
M spk06 0 xajc -0.655291
M spk07 0 xajc -0.857982
M spk08 0 xajc -4.82045
M spk09 0 xajc -1.46612
M spk10 0 xajc -1.81902
M spk11 0 xajc -4.06028
M spk12 0 xajc -3.39238
M spk13 0 xajc -1.62213
M spk14 0 xajc -0.705021
M spk15 0 xajc -0.363704
M spk16 0 xajc -1.86522
M spk17 0 xajc -0.625206
M spk18 0 xajc -0.61316
M spk19 0 xajc -4.16881
M spk20 0 xajc -2.30004
M spk21 0 xajc -0.42412
M spk22 0 xajc -3.86603
M spk23 1 xajc 0.0730605
M spk24 0 xajc -0.676002
M spk25 0 xajc -0.420798
M spk26 0 xajc -2.96649
M spk27 0 xajc -4.85348
M spk28 0 xajc -0.660242
M spk29 0 xajc -3.66401
M spk30 0 xajc -0.0185455
M spk31 0 xajc -0.870229
M spk32 0 xajc -0.436923
M spk33 0 xajc -2.03935
M spk34 0 xajc -0.692621
M spk35 0 xajc -0.854866
M spk36 0 xajc -4.17629
M spk37 0 xajc -0.796838
M spk38 0 xajc -1.63803
M spk39 0 xajc -2.878
M spk40 0 xajc -0.333023
M spk01 1 xajx 0.344335
M spk02 0 xajx -17.1258
M spk03 0 xajx -7.09124
M spk04 0 xajx -15.9702
M spk05 0 xajx -7.28376
M spk06 0 xajx -1.33911
M spk07 0 xajx -0.943309
M spk08 0 xajx -16.0978
M spk09 0 xajx -2.76466
M spk10 0 xajx -13.9935
M spk11 0 xajx -0.148899
M spk12 0 xajx -17.0852
M spk13 0 xajx -10.2745
M spk14 1 xajx 1.30368
M spk15 0 xajx -12.272
M spk16 0 xajx -10.746
M spk17 0 xajx -0.799515
M spk18 0 xajx -1.21042
M spk19 0 xajx -19.2365
M spk20 0 xajx -2.22859
M spk21 0 xajx -0.759456
M spk22 0 xajx -0.146032
M spk23 0 xajx -1.54897
M spk24 0 xajx -2.77072
M spk25 0 xajx -0.836401
M spk26 0 xajx -0.0763634
M spk27 0 xajx -2.29384
M spk28 0 xajx -1.02952
M spk29 0 xajx -17.0387
M spk30 0 xajx -5.61743
M spk31 0 xajx -1.4169
M spk32 0 xajx -1.04311
M spk33 1 xajx 1.8716
M spk34 0 xajx -0.643309
M spk35 0 xajx -4.71874
M spk36 0 xajx -15.6862
M spk37 0 xajx -0.821978
M spk38 1 xajx 0.0919353
M spk39 0 xajx -7.11693
M spk40 0 xajx -2.7863
M spk01 0 xakm -1.81059
M spk02 1 xakm 1.57205
M spk03 0 xakm -0.473528
M spk04 1 xakm 0.339438
M spk05 0 xakm -0.224291
M spk06 1 xakm 0.187504
M spk07 0 xakm -0.1164
M spk08 0 xakm -0.591767
M spk09 0 xakm -0.190297
M spk10 1 xakm 0.950073
M spk11 0 xakm -2.33143
M spk12 1 xakm 1.08096
M spk13 0 xakm -1.12043
M spk14 0 xakm -1.86839
M spk15 0 xakm -0.880852
M spk16 1 xakm 0.117531
M spk17 1 xakm 0.00757794
M spk18 1 xakm 0.172784
M spk19 0 xakm -0.0961361
M spk20 0 xakm -2.45456
M spk21 1 xakm 0.0736438
M spk22 0 xakm -2.84418
M spk23 0 xakm -0.293116
M spk24 0 xakm -0.547175
M spk25 1 xakm 0.0568634
M spk26 0 xakm -1.69784
M spk27 0 xakm -1.70433
M spk28 0 xakm -0.00423376
M spk29 1 xakm 0.890337
M spk30 0 xakm -1.21326
M spk31 0 xakm -0.313107
M spk32 1 xakm 0.0578361
M spk33 0 xakm -2.66082
M spk34 0 xakm -1.46124
M spk35 0 xakm -0.759308
M spk36 1 xakm 1.11229
M spk37 0 xakm -0.182189
M spk38 0 xakm -2.32614
M spk39 0 xakm -2.16756
M spk40 0 xakm -1.43357
M spk01 0 xakw -1.24786
M spk02 0 xakw -9.59025
M spk03 0 xakw -6.76733
M spk04 0 xakw -12.7746
M spk05 0 xakw -7.92249
M spk06 0 xakw -1.09094
M spk07 0 xakw -0.86707
M spk08 0 xakw -13.2188
M spk09 1 xakw 0.0989149
M spk10 0 xakw -11.0326
M spk11 1 xakw 2.21208
M spk12 0 xakw -9.04584
M spk13 0 xakw -9.49393
M spk14 0 xakw -1.02534
M spk15 0 xakw -14.0027
M spk16 0 xakw -6.97601
M spk17 0 xakw -0.924375
M spk18 0 xakw -1.12942
M spk19 0 xakw -15.3248
M spk20 0 xakw -2.43765
M spk21 0 xakw -0.717946
M spk22 0 xakw -0.713667
M spk23 0 xakw -0.95687
M spk24 0 xakw -1.13112
M spk25 0 xakw -0.792549
M spk26 1 xakw 1.03795
M spk27 1 xakw 0.210534
M spk28 0 xakw -0.99147
M spk29 0 xakw -13.0862
M spk30 0 xakw -6.60677
M spk31 0 xakw -1.31685
M spk32 0 xakw -0.998719
M spk33 0 xakw -0.564756
M spk34 0 xakw -0.575186
M spk35 0 xakw -4.4445
M spk36 0 xakw -12.4255
M spk37 0 xakw -0.924503
M spk38 1 xakw 0.455274
M spk39 0 xakw -10.1521
M spk40 0 xakw -3.60482
M spk01 0 xali -2.03669
M spk02 0 xali -10.9226
M spk03 0 xali -6.40762
M spk04 0 xali -11.9691
M spk05 0 xali -8.51244
M spk06 0 xali -0.891979
M spk07 0 xali -0.649617
M spk08 0 xali -12.9085
M spk09 1 xali 1.16582
M spk10 0 xali -10.1352
M spk11 1 xali 3.08735
M spk12 0 xali -7.14876
M spk13 0 xali -11.1081
M spk14 0 xali -0.58464
M spk15 0 xali -11.9466
M spk16 0 xali -10.2635
M spk17 0 xali -0.552731
M spk18 0 xali -0.950174
M spk19 0 xali -14.8617
M spk20 0 xali -2.09675
M spk21 0 xali -0.795013
M spk22 0 xali -0.505066
M spk23 0 xali -2.9025
M spk24 0 xali -1.2071
M spk25 0 xali -0.715529
M spk26 1 xali 3.00424
M spk27 1 xali 1.49556
M spk28 0 xali -0.863973
M spk29 0 xali -12.9303
M spk30 0 xali -5.48723
M spk31 0 xali -1.23103
M spk32 0 xali -0.963111
M spk33 0 xali -1.02437
M spk34 0 xali -0.49442
M spk35 0 xali -6.29893
M spk36 0 xali -12.6356
M spk37 0 xali -0.968883
M spk38 0 xali -1.57267
M spk39 0 xali -14.4522
M spk40 0 xali -2.95189
M spk01 0 xalx -1.81578
M spk02 0 xalx -17.5448
M spk03 0 xalx -14.5552
M spk04 0 xalx -15.5157
M spk05 0 xalx -14.5645
M spk06 0 xalx -1.35988
M spk07 0 xalx -0.65411
M spk08 0 xalx -14.0072
M spk09 0 xalx -2.28224
M spk10 0 xalx -16.6673
M spk11 1 xalx 7.3086
M spk12 0 xalx -13.6854
M spk13 0 xalx -20.3033
M spk14 1 xalx 1.10998
M spk15 0 xalx -14.2592
M spk16 0 xalx -14.6316
M spk17 0 xalx -0.807924
M spk18 0 xalx -1.27579
M spk19 0 xalx -15.2776
M spk20 0 xalx -3.15968
M spk21 0 xalx -0.721609
M spk22 1 xalx 3.83403
M spk23 0 xalx -3.30778
M spk24 0 xalx -2.62083
M spk25 0 xalx -0.750535
M spk26 1 xalx 5.39062
M spk27 1 xalx 4.30982
M spk28 0 xalx -0.816755
M spk29 0 xalx -14.9005
M spk30 0 xalx -13.4168
M spk31 0 xalx -1.28142
M spk32 0 xalx -1.06332
M spk33 1 xalx 3.6491
M spk34 0 xalx -1.75135
M spk35 0 xalx -11.149
M spk36 0 xalx -15.7664
M spk37 0 xalx -0.679195
M spk38 1 xalx 0.556406
M spk39 0 xalx -19.3009
M spk40 0 xalx -6.77004
M spk01 0 xanp -1.4175
M spk02 0 xanp -3.01851
M spk03 0 xanp -0.227887
M spk04 0 xanp -3.7235
M spk05 0 xanp -1.32706
M spk06 0 xanp -0.867466
M spk07 0 xanp -0.821672
M spk08 0 xanp -7.45952
M spk09 0 xanp -0.0522313
M spk10 0 xanp -2.32044
M spk11 0 xanp -2.96733
M spk12 0 xanp -3.33709
M spk13 0 xanp -3.70367
M spk14 0 xanp -0.584934
M spk15 1 xanp 0.764532
M spk16 0 xanp -2.22963
M spk17 0 xanp -0.585022
M spk18 0 xanp -1.17936
M spk19 0 xanp -5.12263
M spk20 0 xanp -2.55531
M spk21 0 xanp -0.83879
M spk22 0 xanp -3.60696
M spk23 0 xanp -0.739756
M spk24 0 xanp -0.04636
M spk25 0 xanp -0.80109
M spk26 0 xanp -1.23095
M spk27 0 xanp -3.07664
M spk28 0 xanp -1.15491
M spk29 0 xanp -4.30762
M spk30 1 xanp 0.671801
M spk31 0 xanp -1.12617
M spk32 0 xanp -0.824211
M spk33 0 xanp -2.37363
M spk34 0 xanp -0.522357
M spk35 0 xanp -2.44516
M spk36 0 xanp -5.08215
M spk37 0 xanp -1.33113
M spk38 0 xanp -1.97174
M spk39 0 xanp -7.39816
M spk40 0 xanp -0.340505
