M xaaf 0 xaod -10.8521
M xabr 0 xaod -0.904953
M xacf 0 xaod -3.86347
M xacz 0 xaod -0.064426
M xaei 0 xaod -0.830157
M xaeo 0 xaod -2.40217
M xafa 0 xaod -18.2589
M xafn 0 xaod -8.34448
M xaga 0 xaod -2.92342
M xaha 0 xaod -3.91345
M xahk 0 xaod -4.28104
M xaht 0 xaod -0.786718
M xaig 0 xaod -8.16619
M xajc 0 xaod -3.15808
M xajx 0 xaod -0.015707
M xakm 0 xaod -13.7265
M xakw 0 xaod -2.55165
M xali 0 xaod -4.25076
M xalx 0 xaod -5.58264
M xanp 0 xaod -6.0982
M xaaf 0 xaoh -0.00313002
M xabr 0 xaoh -2.64394
M xacf 0 xaoh -0.495161
M xacz 0 xaoh -1.66474
M xaei 0 xaoh -0.464742
M xaeo 0 xaoh -0.0627102
M xafa 0 xaoh -0.236483
M xafn 1 xaoh 0.360678
M xaga 0 xaoh -1.84237
M xaha 0 xaoh -0.86574
M xahk 0 xaoh -2.02837
M xaht 0 xaoh -0.446974
M xaig 0 xaoh -1.48326
M xajc 0 xaoh -0.507097
M xajx 0 xaoh -2.59371
M xakm 1 xaoh 1.28841
M xakw 0 xaoh -1.15267
M xali 0 xaoh -1.81118
M xalx 0 xaoh -3.82595
M xanp 0 xaoh -0.984198
M xaaf 0 xaom -3.74545
M xabr 0 xaom -1.96677
M xacf 0 xaom -1.21069
M xacz 1 xaom 0.184893
M xaei 0 xaom -1.18405
M xaeo 0 xaom -1.93652
M xafa 0 xaom -6.39179
M xafn 0 xaom -2.66174
M xaga 0 xaom -2.81801
M xaha 0 xaom -3.36237
M xahk 0 xaom -3.95214
M xaht 0 xaom -0.478552
M xaig 0 xaom -6.74883
M xajc 0 xaom -0.596713
M xajx 0 xaom -2.08804
M xakm 0 xaom -4.29309
M xakw 0 xaom -3.32463
M xali 0 xaom -3.97184
M xalx 0 xaom -6.99729
M xanp 0 xaom -1.25639
M xaaf 1 xaor 0.630199
M xabr 0 xaor -2.76503
M xacf 0 xaor -0.679983
M xacz 0 xaor -1.57936
M xaei 0 xaor -0.377541
M xaeo 0 xaor -0.0603861
M xafa 1 xaor 1.16243
M xafn 1 xaor 0.954352
M xaga 0 xaor -2.48144
M xaha 0 xaor -0.813927
M xahk 0 xaor -2.0874
M xaht 0 xaor -0.526843
M xaig 0 xaor -1.47793
M xajc 1 xaor 0.274649
M xajx 0 xaor -2.6355
M xakm 1 xaor 0.850955
M xakw 0 xaor -1.68492
M xali 0 xaor -1.81627
M xalx 0 xaor -3.88536
M xanp 1 xaor 0.283186
M xaaf 0 xaqa -1.73816
M xabr 0 xaqa -1.45375
M xacf 0 xaqa -1.37304
M xacz 0 xaqa -1.20946
M xaei 0 xaqa -0.704248
M xaeo 0 xaqa -0.338453
M xafa 0 xaqa -4.08745
M xafn 1 xaqa 0.24483
M xaga 0 xaqa -3.97422
M xaha 0 xaqa -3.18884
M xahk 0 xaqa -4.47003
M xaht 1 xaqa 0.114146
M xaig 0 xaqa -4.79989
M xajc 1 xaqa 1.69339
M xajx 0 xaqa -1.76594
M xakm 0 xaqa -3.18094
M xakw 0 xaqa -2.96531
M xali 0 xaqa -3.81252
M xalx 0 xaqa -7.19972
M xanp 0 xaqa -1.23824
M xaaf 0 xaqe -0.868993
M xabr 0 xaqe -2.49812
M xacf 0 xaqe -1.10975
M xacz 0 xaqe -1.71165
M xaei 1 xaqe 0.501531
M xaeo 1 xaqe 0.11718
M xafa 1 xaqe 0.0199617
M xafn 0 xaqe -0.0634561
M xaga 0 xaqe -2.37337
M xaha 0 xaqe -1.04047
M xahk 0 xaqe -2.33532
M xaht 0 xaqe -0.88557
M xaig 0 xaqe -0.914429
M xajc 0 xaqe -0.525789
M xajx 0 xaqe -2.85068
M xakm 1 xaqe 0.697974
M xakw 0 xaqe -1.38155
M xali 0 xaqe -1.54005
M xalx 0 xaqe -2.24262
M xanp 0 xaqe -1.01531
M xaaf 0 xaqh -0.516397
M xabr 0 xaqh -2.8426
M xacf 0 xaqh -1.49435
M xacz 0 xaqh -1.88475
M xaei 1 xaqh 0.409343
M xaeo 0 xaqh -0.136374
M xafa 0 xaqh -0.121599
M xafn 1 xaqh 0.23586
M xaga 0 xaqh -2.51474
M xaha 0 xaqh -1.15438
M xahk 0 xaqh -2.53378
M xaht 0 xaqh -1.16814
M xaig 0 xaqh -1.32892
M xajc 0 xaqh -1.02462
M xajx 0 xaqh -2.99285
M xakm 1 xaqh 0.192571
M xakw 0 xaqh -1.56144
M xali 0 xaqh -1.66651
M xalx 0 xaqh -2.35697
M xanp 0 xaqh -1.255
M xaaf 1 xaqp 1.25815
M xabr 0 xaqp -2.5404
M xacf 0 xaqp -0.651211
M xacz 0 xaqp -1.15841
M xaei 0 xaqp -0.348608
M xaeo 0 xaqp -0.428942
M xafa 1 xaqp 1.62251
M xafn 1 xaqp 1.97531
M xaga 0 xaqp -2.92501
M xaha 0 xaqp -1.23136
M xahk 0 xaqp -2.98042
M xaht 0 xaqp -0.874031
M xaig 0 xaqp -1.3672
M xajc 1 xaqp 0.672103
M xajx 0 xaqp -2.70193
M xakm 1 xaqp 0.234798
M xakw 0 xaqp -2.20147
M xali 0 xaqp -2.579
M xalx 0 xaqp -4.03591
M xanp 0 xaqp -0.252868
M xaaf 0 xarm -6.4531
M xabr 0 xarm -2.46955
M xacf 0 xarm -0.0218722
M xacz 0 xarm -1.2696
M xaei 0 xarm -0.663941
M xaeo 0 xarm -0.202669
M xafa 0 xarm -7.56682
M xafn 0 xarm -5.67156
M xaga 0 xarm -1.23939
M xaha 0 xarm -0.472806
M xahk 0 xarm -0.474695
M xaht 1 xarm 0.306627
M xaig 0 xarm -2.98226
M xajc 0 xarm -3.12201
M xajx 0 xarm -1.44268
M xakm 0 xarm -5.18282
M xakw 0 xarm -0.527536
M xali 0 xarm -0.343566
M xalx 0 xarm -3.69259
M xanp 0 xarm -2.72232
M xaaf 0 xarw -0.0756829
M xabr 0 xarw -2.56166
M xacf 0 xarw -1.42365
M xacz 0 xarw -1.6413
M xaei 1 xarw 0.483916
M xaeo 0 xarw -0.167809
M xafa 0 xarw -0.158659
M xafn 1 xarw 0.333103
M xaga 0 xarw -2.27979
M xaha 0 xarw -1.05553
M xahk 0 xarw -2.64889
M xaht 0 xarw -1.03371
M xaig 0 xarw -0.940923
M xajc 0 xarw -0.531469
M xajx 0 xarw -2.72904
M xakm 1 xarw 0.516531
M xakw 0 xarw -1.51998
M xali 0 xarw -1.71628
M xalx 0 xarw -2.54854
M xanp 0 xarw -1.61665
M xaaf 0 xary -15.5693
M xabr 0 xary -1.74527
M xacf 0 xary -1.82329
M xacz 0 xary -1.00502
M xaei 0 xary -0.881851
M xaeo 0 xary -2.74192
M xafa 0 xary -15.5897
M xafn 0 xary -16.072
M xaga 1 xary 0.012431
M xaha 1 xary 0.486698
M xahk 1 xary 1.57763
M xaht 0 xary -0.378651
M xaig 0 xary -5.59337
M xajc 0 xary -9.16321
M xajx 1 xary 0.538459
M xakm 0 xary -14.9279
M xakw 1 xary 1.85373
M xali 1 xary 1.95483
M xalx 1 xary 1.53903
M xanp 0 xary -8.59489
M xaaf 0 xatm -0.569342
M xabr 0 xatm -2.86794
M xacf 0 xatm -0.513017
M xacz 0 xatm -1.61626
M xaei 1 xatm 0.0391986
M xaeo 1 xatm 0.498321
M xafa 1 xatm 0.222678
M xafn 0 xatm -0.0305305
M xaga 0 xatm -2.26686
M xaha 0 xatm -0.0614457
M xahk 0 xatm -1.37147
M xaht 0 xatm -0.091441
M xaig 0 xatm -1.35618
M xajc 0 xatm -0.139192
M xajx 0 xatm -2.67841
M xakm 1 xatm 1.51173
M xakw 0 xatm -0.935756
M xali 0 xatm -0.635549
M xalx 0 xatm -3.27111
M xanp 0 xatm -0.608504
M xaaf 1 xaty 0.806703
M xabr 0 xaty -1.71466
M xacf 0 xaty -1.7949
M xacz 0 xaty -0.746053
M xaei 0 xaty -0.818129
M xaeo 0 xaty -1.46059
M xafa 0 xaty -3.66253
M xafn 0 xaty -0.310909
M xaga 0 xaty -2.65568
M xaha 0 xaty -2.754
M xahk 0 xaty -3.66331
M xaht 0 xaty -0.415065
M xaig 0 xaty -3.73581
M xajc 0 xaty -0.321441
M xajx 0 xaty -1.87327
M xakm 0 xaty -3.62663
M xakw 0 xaty -2.46064
M xali 0 xaty -3.6761
M xalx 0 xaty -5.66474
M xanp 0 xaty -2.48505
M xaaf 0 xawq -13.7803
M xabr 1 xawq 0.252299
M xacf 0 xawq -3.97802
M xacz 0 xawq -0.29958
M xaei 0 xawq -0.95929
M xaeo 0 xawq -4.75079
M xafa 0 xawq -19.6553
M xafn 0 xawq -11.2239
M xaga 0 xawq -3.14885
M xaha 0 xawq -4.55668
M xahk 0 xawq -4.16494
M xaht 0 xawq -1.79042
M xaig 0 xawq -8.67233
M xajc 0 xawq -4.39402
M xajx 1 xawq 0.674005
M xakm 0 xawq -16.4987
M xakw 0 xawq -2.82974
M xali 0 xawq -3.41939
M xalx 0 xawq -4.1085
M xanp 0 xawq -5.63915
M xaaf 0 xaxq -0.520178
M xabr 0 xaxq -2.56081
M xacf 0 xaxq -0.83427
M xacz 0 xaxq -1.32802
M xaei 0 xaxq -0.946653
M xaeo 0 xaxq -0.498285
M xafa 0 xaxq -1.21752
M xafn 1 xaxq 1.01196
M xaga 0 xaxq -4.85032
M xaha 0 xaxq -2.7336
M xahk 0 xaxq -4.75644
M xaht 0 xaxq -1.14035
M xaig 0 xaxq -3.85438
M xajc 1 xaxq 1.53126
M xajx 0 xaxq -2.34174
M xakm 0 xaxq -2.40937
M xakw 0 xaxq -3.84495
M xali 0 xaxq -3.4249
M xalx 0 xaxq -7.51121
M xanp 1 xaxq 2.25625
M xaaf 0 xbba -0.700817
M xabr 0 xbba -2.33371
M xacf 0 xbba -0.46515
M xacz 0 xbba -1.53443
M xaei 0 xbba -0.535632
M xaeo 1 xbba 0.478664
M xafa 0 xbba -2.85034
M xafn 0 xbba -0.791021
M xaga 0 xbba -1.54033
M xaha 0 xbba -2.42842
M xahk 0 xbba -2.10531
M xaht 1 xbba 0.142639
M xaig 0 xbba -2.54559
M xajc 0 xbba -0.330916
M xajx 0 xbba -1.97468
M xakm 0 xbba -1.22702
M xakw 0 xbba -1.382
M xali 0 xbba -3.37376
M xalx 0 xbba -5.46456
M xanp 0 xbba -1.21983
M xaaf 0 xbey -0.779877
M xabr 0 xbey -2.15053
M xacf 0 xbey -1.77619
M xacz 0 xbey -1.30537
M xaei 1 xbey 0.11766
M xaeo 0 xbey -0.0628067
M xafa 0 xbey -0.0943117
M xafn 0 xbey -0.287811
M xaga 0 xbey -2.41767
M xaha 0 xbey -1.09469
M xahk 0 xbey -1.79577
M xaht 0 xbey -0.75505
M xaig 0 xbey -1.4183
M xajc 0 xbey -0.831439
M xajx 0 xbey -2.50128
M xakm 1 xbey 0.347513
M xakw 0 xbey -1.57386
M xali 0 xbey -1.47808
M xalx 0 xbey -2.19779
M xanp 0 xbey -0.951108
M xaaf 0 xbfu -0.0961043
M xabr 0 xbfu -2.32447
M xacf 0 xbfu -1.57041
M xacz 0 xbfu -1.51622
M xaei 1 xbfu 0.575536
M xaeo 0 xbfu -0.36815
M xafa 1 xbfu 0.315097
M xafn 1 xbfu 0.263151
M xaga 0 xbfu -2.08886
M xaha 0 xbfu -0.916522
M xahk 0 xbfu -2.21704
M xaht 0 xbfu -1.06797
M xaig 0 xbfu -0.914922
M xajc 0 xbfu -0.510139
M xajx 0 xbfu -2.63581
M xakm 1 xbfu 0.443814
M xakw 0 xbfu -1.43576
M xali 0 xbfu -1.56375
M xalx 0 xbfu -2.06435
M xanp 0 xbfu -1.35396
M xaaf 1 xbhg 0.285229
M xabr 0 xbhg -2.81677
M xacf 1 xbhg 0.673385
M xacz 0 xbhg -2.25101
M xaei 0 xbhg -0.432288
M xaeo 1 xbhg 0.598947
M xafa 1 xbhg 0.105418
M xafn 1 xbhg 0.324398
M xaga 0 xbhg -2.10942
M xaha 0 xbhg -0.568444
M xahk 0 xbhg -1.91183
M xaht 0 xbhg -0.427642
M xaig 0 xbhg -0.336142
M xajc 1 xbhg 1.50116
M xajx 0 xbhg -2.88395
M xakm 1 xbhg 1.24287
M xakw 0 xbhg -1.44278
M xali 0 xbhg -1.87318
M xalx 0 xbhg -5.81633
M xanp 1 xbhg 0.602785
M xaaf 0 xbil -9.87413
M xabr 0 xbil -0.184937
M xacf 0 xbil -3.59059
M xacz 1 xbil 2.02948
M xaei 0 xbil -1.15131
M xaeo 0 xbil -4.44447
M xafa 0 xbil -18.682
M xafn 0 xbil -10.441
M xaga 0 xbil -3.35638
M xaha 0 xbil -1.91557
M xahk 0 xbil -3.51518
M xaht 0 xbil -1.1335
M xaig 0 xbil -10.1912
M xajc 0 xbil -4.91707
M xajx 0 xbil -0.535582
M xakm 0 xbil -15.2978
M xakw 0 xbil -2.21525
M xali 0 xbil -2.84103
M xalx 0 xbil -4.63049
M xanp 0 xbil -6.52271
M xaaf 0 xbjl -0.916017
M xabr 0 xbjl -2.4653
M xacf 0 xbjl -1.19985
M xacz 0 xbjl -1.79995
M xaei 1 xbjl 0.564068
M xaeo 0 xbjl -0.0784301
M xafa 0 xbjl -0.0596563
M xafn 1 xbjl 0.124621
M xaga 0 xbjl -2.33199
M xaha 0 xbjl -1.27138
M xahk 0 xbjl -2.5988
M xaht 0 xbjl -1.15284
M xaig 0 xbjl -0.947012
M xajc 0 xbjl -0.48426
M xajx 0 xbjl -2.84316
M xakm 1 xbjl 0.89257
M xakw 0 xbjl -1.4499
M xali 0 xbjl -2.03877
M xalx 0 xbjl -2.15994
M xanp 0 xbjl -1.22329
M xaaf 0 xbkl -18.487
M xabr 1 xbkl 0.0378072
M xacf 0 xbkl -5.56749
M xacz 1 xbkl 1.95108
M xaei 0 xbkl -1.12917
M xaeo 0 xbkl -6.02492
M xafa 0 xbkl -21.2874
M xafn 0 xbkl -16.9935
M xaga 0 xbkl -2.56843
M xaha 0 xbkl -2.08405
M xahk 0 xbkl -2.61728
M xaht 0 xbkl -2.3994
M xaig 0 xbkl -10.2685
M xajc 0 xbkl -9.26027
M xajx 1 xbkl 0.869209
M xakm 0 xbkl -22.2208
M xakw 0 xbkl -1.31656
M xali 0 xbkl -2.10606
M xalx 0 xbkl -0.741193
M xanp 0 xbkl -10.1884
M xaaf 0 xbmn -7.73066
M xabr 0 xbmn -1.78227
M xacf 0 xbmn -2.24814
M xacz 0 xbmn -1.72009
M xaei 0 xbmn -0.422105
M xaeo 0 xbmn -0.76251
M xafa 0 xbmn -10.1397
M xafn 0 xbmn -5.13569
M xaga 0 xbmn -1.31766
M xaha 0 xbmn -1.47741
M xahk 0 xbmn -2.56653
M xaht 0 xbmn -0.658991
M xaig 0 xbmn -2.42062
M xajc 0 xbmn -1.35655
M xajx 0 xbmn -0.652181
M xakm 0 xbmn -6.32696
M xakw 0 xbmn -1.0254
M xali 0 xbmn -3.00268
M xalx 0 xbmn -4.59825
M xanp 0 xbmn -3.10569
M xaaf 0 xbpa -11.9491
M xabr 0 xbpa -2.02344
M xacf 0 xbpa -0.309326
M xacz 0 xbpa -2.1905
M xaei 0 xbpa -0.810063
M xaeo 1 xbpa 0.996023
M xafa 0 xbpa -15.4372
M xafn 0 xbpa -8.59663
M xaga 0 xbpa -2.67762
M xaha 0 xbpa -0.695071
M xahk 0 xbpa -1.92724
M xaht 0 xbpa -0.326741
M xaig 0 xbpa -1.78344
M xajc 0 xbpa -1.93828
M xajx 0 xbpa -0.789708
M xakm 0 xbpa -6.97955
M xakw 0 xbpa -0.542147
M xali 0 xbpa -1.49349
M xalx 0 xbpa -4.16759
M xanp 0 xbpa -2.01773
M xaaf 0 xbsk -0.714463
M xabr 0 xbsk -2.77202
M xacf 0 xbsk -1.14702
M xacz 0 xbsk -1.96951
M xaei 1 xbsk 0.698531
M xaeo 1 xbsk 0.0958287
M xafa 1 xbsk 0.346487
M xafn 1 xbsk 0.366342
M xaga 0 xbsk -2.34158
M xaha 0 xbsk -0.96566
M xahk 0 xbsk -2.57554
M xaht 0 xbsk -1.03263
M xaig 0 xbsk -1.11046
M xajc 0 xbsk -0.315994
M xajx 0 xbsk -2.82841
M xakm 1 xbsk 0.643304
M xakw 0 xbsk -1.43652
M xali 0 xbsk -1.62243
M xalx 0 xbsk -2.33818
M xanp 0 xbsk -1.0497
M xaaf 0 xbur -15.6074
M xabr 0 xbur -1.01433
M xacf 0 xbur -1.42618
M xacz 0 xbur -0.432356
M xaei 0 xbur -0.933407
M xaeo 0 xbur -3.47134
M xafa 0 xbur -15.2847
M xafn 0 xbur -14.8807
M xaga 0 xbur -0.338035
M xaha 0 xbur -0.467222
M xahk 1 xbur 0.904244
M xaht 0 xbur -1.19277
M xaig 0 xbur -5.04631
M xajc 0 xbur -7.6445
M xajx 1 xbur 0.499322
M xakm 0 xbur -14.8017
M xakw 1 xbur 0.352459
M xali 1 xbur 1.66699
M xalx 1 xbur 0.232276
M xanp 0 xbur -6.14104
M xaaf 0 xbws -11.8691
M xabr 0 xbws -3.29743
M xacf 0 xbws -1.5852
M xacz 0 xbws -1.78722
M xaei 0 xbws -0.715234
M xaeo 0 xbws -0.639539
M xafa 0 xbws -10.5639
M xafn 0 xbws -11.9937
M xaga 0 xbws -1.42914
M xaha 1 xbws 0.876149
M xahk 1 xbws 1.10645
M xaht 1 xbws 0.428676
M xaig 0 xbws -4.93041
M xajc 0 xbws -7.62491
M xajx 0 xbws -0.242684
M xakm 0 xbws -11.0539
M xakw 1 xbws 1.21538
M xali 1 xbws 1.42902
M xalx 1 xbws 0.107238
M xanp 0 xbws -6.1623
M xaaf 0 xcem -0.0433035
M xabr 0 xcem -2.47275
M xacf 0 xcem -1.59337
M xacz 0 xcem -1.58566
M xaei 1 xcem 0.495014
M xaeo 0 xcem -0.400441
M xafa 1 xcem 0.318782
M xafn 1 xcem 0.235584
M xaga 0 xcem -2.17024
M xaha 0 xcem -0.902674
M xahk 0 xcem -2.27683
M xaht 0 xcem -1.12356
M xaig 0 xcem -0.933893
M xajc 0 xcem -0.607998
M xajx 0 xcem -2.66007
M xakm 1 xcem 0.285125
M xakw 0 xcem -1.42987
M xali 0 xcem -1.6293
M xalx 0 xcem -1.9195
M xanp 0 xcem -1.41999
M xaaf 0 xcgs -0.213066
M xabr 0 xcgs -2.24817
M xacf 0 xcgs -1.18688
M xacz 0 xcgs -1.50856
M xaei 1 xcgs 0.0942518
M xaeo 0 xcgs -0.105217
M xafa 0 xcgs -0.105778
M xafn 1 xcgs 0.224897
M xaga 0 xcgs -2.07411
M xaha 0 xcgs -1.03674
M xahk 0 xcgs -2.17477
M xaht 0 xcgs -0.891464
M xaig 0 xcgs -0.906971
M xajc 0 xcgs -0.518344
M xajx 0 xcgs -2.42261
M xakm 1 xcgs 0.547379
M xakw 0 xcgs -1.45401
M xali 0 xcgs -1.68538
M xalx 0 xcgs -2.42315
M xanp 0 xcgs -1.271
M xaaf 0 xcmm -2.81665
M xabr 0 xcmm -0.918371
M xacf 0 xcmm -1.96438
M xacz 1 xcmm 0.0616737
M xaei 0 xcmm -0.964856
M xaeo 0 xcmm -2.93603
M xafa 0 xcmm -5.44157
M xafn 0 xcmm -2.57551
M xaga 0 xcmm -2.83159
M xaha 0 xcmm -3.25983
M xahk 0 xcmm -4.08932
M xaht 0 xcmm -1.75159
M xaig 0 xcmm -5.26508
M xajc 0 xcmm -0.549273
M xajx 0 xcmm -1.1246
M xakm 0 xcmm -5.92034
M xakw 0 xcmm -3.27955
M xali 0 xcmm -3.24859
M xalx 0 xcmm -6.4492
M xanp 0 xcmm -0.821162
M xaaf 0 xcpw -0.127683
M xabr 0 xcpw -2.56671
M xacf 0 xcpw -1.35301
M xacz 0 xcpw -1.39298
M xaei 1 xcpw 0.275826
M xaeo 0 xcpw -0.546384
M xafa 1 xcpw 0.593451
M xafn 1 xcpw 0.230947
M xaga 0 xcpw -2.38652
M xaha 0 xcpw -1.09041
M xahk 0 xcpw -2.25843
M xaht 0 xcpw -1.04733
M xaig 0 xcpw -1.14242
M xajc 0 xcpw -0.778386
M xajx 0 xcpw -2.74314
M xakm 1 xcpw 0.0121233
M xakw 0 xcpw -1.4747
M xali 0 xcpw -1.75787
M xalx 0 xcpw -1.77002
M xanp 0 xcpw -1.15151
M xaaf 0 xddo -0.599399
M xabr 0 xddo -2.46066
M xacf 0 xddo -1.19548
M xacz 0 xddo -1.63579
M xaei 1 xddo 0.303393
M xaeo 0 xddo -0.393902
M xafa 1 xddo 0.461076
M xafn 1 xddo 0.114381
M xaga 0 xddo -2.27834
M xaha 0 xddo -1.06472
M xahk 0 xddo -2.52762
M xaht 0 xddo -1.16365
M xaig 0 xddo -0.892354
M xajc 0 xddo -0.479893
M xajx 0 xddo -2.8245
M xakm 1 xddo 0.560727
M xakw 0 xddo -1.46656
M xali 0 xddo -1.87818
M xalx 0 xddo -1.90318
M xanp 0 xddo -1.05616
M xaaf 0 xdhx -16.5637
M xabr 1 xdhx 0.519567
M xacf 0 xdhx -3.86814
M xacz 1 xdhx 0.78037
M xaei 0 xdhx -1.03883
M xaeo 0 xdhx -5.24668
M xafa 0 xdhx -18.3027
M xafn 0 xdhx -13.397
M xaga 0 xdhx -1.76542
M xaha 0 xdhx -4.24793
M xahk 0 xdhx -3.85457
M xaht 0 xdhx -2.30351
M xaig 0 xdhx -7.42252
M xajc 0 xdhx -6.5967
M xajx 1 xdhx 1.78864
M xakm 0 xdhx -18.9401
M xakw 0 xdhx -1.94613
M xali 0 xdhx -3.4198
M xalx 0 xdhx -1.75151
M xanp 0 xdhx -8.40934
M xaaf 0 xdis -8.46561
M xabr 0 xdis -0.970303
M xacf 0 xdis -1.43916
M xacz 0 xdis -0.0700762
M xaei 0 xdis -0.9946
M xaeo 0 xdis -4.22016
M xafa 0 xdis -12.0326
M xafn 0 xdis -7.12936
M xaga 0 xdis -1.16912
M xaha 0 xdis -2.02395
M xahk 0 xdis -2.6781
M xaht 0 xdis -0.970047
M xaig 0 xdis -5.80997
M xajc 0 xdis -3.74804
M xajx 0 xdis -0.49639
M xakm 0 xdis -9.6639
M xakw 0 xdis -1.78924
M xali 0 xdis -2.42752
M xalx 0 xdis -4.55892
M xanp 0 xdis -4.81147
M xaaf 0 xdmd -3.7697
M xabr 0 xdmd -1.55019
M xacf 0 xdmd -2.90865
M xacz 0 xdmd -0.934791
M xaei 0 xdmd -0.948327
M xaeo 0 xdmd -3.40611
M xafa 0 xdmd -9.84179
M xafn 0 xdmd -2.27025
M xaga 0 xdmd -3.02325
M xaha 0 xdmd -3.56252
M xahk 0 xdmd -5.48964
M xaht 0 xdmd -2.19355
M xaig 0 xdmd -5.77796
M xajc 0 xdmd -1.5552
M xajx 0 xdmd -2.01437
M xakm 0 xdmd -5.9315
M xakw 0 xdmd -2.58472
M xali 0 xdmd -4.79425
M xalx 0 xdmd -6.97012
M xanp 0 xdmd -4.02101
M xaaf 0 xdsk -0.179064
M xabr 0 xdsk -2.09955
M xacf 0 xdsk -0.990767
M xacz 0 xdsk -1.48813
M xaei 1 xdsk 0.204152
M xaeo 0 xdsk -0.373624
M xafa 1 xdsk 0.00916777
M xafn 1 xdsk 0.31938
M xaga 0 xdsk -1.93269
M xaha 0 xdsk -1.07032
M xahk 0 xdsk -2.15823
M xaht 0 xdsk -0.958107
M xaig 0 xdsk -0.691581
M xajc 0 xdsk -0.503861
M xajx 0 xdsk -2.43358
M xakm 1 xdsk 0.685125
M xakw 0 xdsk -1.29271
M xali 0 xdsk -1.83217
M xalx 0 xdsk -2.18967
M xanp 0 xdsk -1.45222
M xaaf 0 xdws -0.330373
M xabr 0 xdws -2.34842
M xacf 0 xdws -1.58485
M xacz 0 xdws -1.76748
M xaei 1 xdws 0.514903
M xaeo 0 xdws -0.464584
M xafa 0 xdws -0.187125
M xafn 1 xdws 0.294006
M xaga 0 xdws -1.94366
M xaha 0 xdws -0.968981
M xahk 0 xdws -2.39929
M xaht 0 xdws -1.04724
M xaig 0 xdws -0.977526
M xajc 0 xdws -0.901611
M xajx 0 xdws -2.47093
M xakm 1 xdws 0.211144
M xakw 0 xdws -1.39844
M xali 0 xdws -1.82776
M xalx 0 xdws -1.91783
M xanp 0 xdws -1.91207
M xaaf 0 xfbq -9.82735
M xabr 0 xfbq -0.32945
M xacf 0 xfbq -2.97465
M xacz 1 xfbq 0.750543
M xaei 0 xfbq -1.02551
M xaeo 0 xfbq -3.54411
M xafa 0 xfbq -14.2177
M xafn 0 xfbq -9.3671
M xaga 0 xfbq -0.718994
M xaha 0 xfbq -2.20858
M xahk 0 xfbq -1.67362
M xaht 0 xfbq -1.33853
M xaig 0 xfbq -4.87002
M xajc 0 xfbq -4.85247
M xajx 1 xfbq 0.614173
M xakm 0 xfbq -12.0072
M xakw 0 xfbq -0.448714
M xali 0 xfbq -2.8841
M xalx 0 xfbq -2.85341
M xanp 0 xfbq -6.36508
M xaaf 0 xfdr -4.75335
M xabr 1 xfdr 0.616078
M xacf 0 xfdr -6.49184
M xacz 1 xfdr 0.201395
M xaei 0 xfdr -0.898721
M xaeo 0 xfdr -5.66258
M xafa 0 xfdr -14.6851
M xafn 0 xfdr -2.08044
M xaga 0 xfdr -1.44123
M xaha 0 xfdr -8.25673
M xahk 0 xfdr -8.18718
M xaht 0 xfdr -2.57943
M xaig 0 xfdr -8.82222
M xajc 0 xfdr -1.00861
M xajx 1 xfdr 0.514056
M xakm 0 xfdr -10.8246
M xakw 0 xfdr -3.89325
M xali 0 xfdr -8.91703
M xalx 0 xfdr -8.33544
M xanp 0 xfdr -7.59584
M xaaf 0 xfvs -5.58056
M xabr 0 xfvs -1.33273
M xacf 0 xfvs -2.99134
M xacz 1 xfvs 1.77788
M xaei 0 xfvs -0.953518
M xaeo 0 xfvs -2.94574
M xafa 0 xfvs -10.7417
M xafn 0 xfvs -5.38489
M xaga 0 xfvs -3.52578
M xaha 0 xfvs -2.50262
M xahk 0 xfvs -3.73408
M xaht 0 xfvs -1.17661
M xaig 0 xfvs -7.38535
M xajc 0 xfvs -2.22471
M xajx 0 xfvs -1.14562
M xakm 0 xfvs -9.20332
M xakw 0 xfvs -3.18221
M xali 0 xfvs -3.44979
M xalx 0 xfvs -6.25436
M xanp 0 xfvs -3.33623
