{
  "data": {
    "name": {
      "value": "function_1"
    },
    "triggers": {
      "list": [
        {
          "actions": [
            {
              "__OBJ_TYPE": "Action_ExecScript",
              "components": [
                {
                  "__OBJ_TYPE": "Component_Script",
                  "children": [
                    {
                      "param_name": "parameter_1"
                    }
                  ],
                  "script_name": "ScriptableNode"
                }
              ],
              "id": {
                "value": "9ae5c78e-d173-4886-b316-c95213f2889a"
              },
              "pos": {
                "x": 691,
                "y": 339
              }
            }
          ],
          "custom_trigger_data": {
            "name": {
              "value": "36b1c743-262f-47f7-81d8-be23e058edca"
            },
            "type": "Function_Called"
          },
          "func_name": "function_1",
          "root": {
            "components": [
              {
                "__OBJ_TYPE": "Component_Sequence",
                "children": [
                  {
                    "action": "9ae5c78e-d173-4886-b316-c95213f2889a"
                  }
                ]
              }
            ],
            "id": {
              "value": "60066aef-9dfa-4290-aeee-7bf58de148f6"
            }
          },
          "type": "Function_Called"
        }
      ]
    }
  },
  "meta": {
    "EXPORT": {
      "setting.json": "01bcf3a8f59b824f9c279b89da701e7f",
      "triggers.bts": "c2669ae8e0da4c3281d23f90866af3aa"
    },
    "VERSION": "0.22"
  }
}