{
  "data": {
    "box": {
      "base": {
        "__OBJ_TYPE": "SkyBoxStatic",
        "back": {
          "selector": "editor/BlockEmpty/asset/Texture/SkyBox/Common2/Sky03_back.png"
        },
        "bottom": {
          "selector": "editor/BlockEmpty/asset/Texture/SkyBox/Common2/Sky03_bottom.png"
        },
        "front": {
          "selector": "editor/BlockEmpty/asset/Texture/SkyBox/Common2/Sky03_front.png"
        },
        "left": {
          "selector": "editor/BlockEmpty/asset/Texture/SkyBox/Common2/Sky03_left.png"
        },
        "right": {
          "selector": "editor/BlockEmpty/asset/Texture/SkyBox/Common2/Sky03_right.png"
        },
        "top": {
          "selector": "editor/BlockEmpty/asset/Texture/SkyBox/Common2/Sky03_top.png"
        }
      }
    },
    "instances": [
      {
        "__OBJ_TYPE": "Instance_Entity",
        "config": "myplugin/3ee17aad-7cf4-49b4-8d2c-350c78baae5f",
        "id": "8730801724195504129",
        "name": "Ground",
        "position": {
          "x": 31.652341842651,
          "y": 51.124076843262,
          "z": 30.902481079102
        },
        "scale": {
          "x": 2,
          "y": 2,
          "z": 2
        },
        "size": {
          "x": 2,
          "y": 2,
          "z": 2
        }
      },
      {
        "__OBJ_TYPE": "Instance_Entity",
        "config": "myplugin/b8ee603c-cca7-496a-b53e-388cd69e0ed4",
        "id": "8730805544858550273",
        "name": "Builds",
        "position": {
          "x": 25.309410095215,
          "y": 53.000003814697,
          "z": 20.328552246094
        }
      },
      {
        "__OBJ_TYPE": "Instance_Entity",
        "config": "myplugin/b8ee603c-cca7-496a-b53e-388cd69e0ed4",
        "id": "8730805929161113601",
        "name": "Builds",
        "position": {
          "x": 39.289451599121,
          "y": 53,
          "z": 50.608047485352
        },
        "rotation": {
          "y": 90
        }
      },
      {
        "__OBJ_TYPE": "Instance_RegionPart",
        "cfgName": "myplugin/0ca52c00-6154-479b-b71b-70248dce14d4",
        "id": "8732302613143896065",
        "position": {
          "x": 31.965097427368,
          "y": 54.5,
          "z": 28.112844467163
        },
        "scale": {
          "x": 11.954,
          "y": 0.99999,
          "z": 17.5618
        },
        "size": {
          "x": 11.953954696655,
          "y": 0.99999022483826,
          "z": 17.561769485474
        }
      }
    ],
    "name": {
      "value": "map_map001"
    },
    "touch_pos": {
      "up": 600
    }
  },
  "meta": {
    "EXPORT": {
      "DataSet": [],
      "setting.json": "67d402a0004003f8d1c283729a0fa647"
    },
    "VERSION": "0.22"
  }
}