{
  "project_info": {
    "project_number": "215396972997",
    "firebase_url": "https://truequex-a5d21.firebaseio.com",
    "project_id": "truequex-a5d21",
    "storage_bucket": "truequex-a5d21.appspot.com"
  },
  "client": [
    {
      "client_info": {
        "mobilesdk_app_id": "1:215396972997:android:90fff2c652df6f43b133ac",
        "android_client_info": {
          "package_name": "com.example.holograms"
        }
      },
      "oauth_client": [
        {
          "client_id": "215396972997-vo73s7huud8vkn5t1na85g050h3cepg4.apps.googleusercontent.com",
          "client_type": 1,
          "android_info": {
            "package_name": "com.example.holograms",
            "certificate_hash": "cd8675ec18867ebf06c998be4dbb4d7848ed1bc1"
          }
        },
        {
          "client_id": "215396972997-mro7tcv16snuc87vk5qdphn29d23ltn0.apps.googleusercontent.com",
          "client_type": 3
        }
      ],
      "api_key": [
        {
          "current_key": "AIzaSyDgbe227SLe-8SnPbe0Wv0DSgg2mqK8T5o"
        }
      ],
      "services": {
        "appinvite_service": {
          "other_platform_oauth_client": [
            {
              "client_id": "215396972997-mro7tcv16snuc87vk5qdphn29d23ltn0.apps.googleusercontent.com",
              "client_type": 3
            }
          ]
        }
      }
    }
  ],
  "configuration_version": "1"
}