{
    "prepare_queue": {
        "installed": [],
        "uninstalled": []
    },
    "config_munge": {
        "files": {}
    },
    "installed_plugins": {
        "call-number": {
            "PACKAGE_NAME": "com.MGA.apptuiuv"
        },
        "cordova-plugin-app-version": {
            "PACKAGE_NAME": "com.MGA.apptuiuv"
        },
        "cordova-plugin-appavailability": {
            "PACKAGE_NAME": "com.MGA.apptuiuv"
        },
        "cordova-plugin-background-mode": {
            "PACKAGE_NAME": "com.MGA.apptuiuv"
        },
        "cordova-plugin-console": {
            "PACKAGE_NAME": "com.MGA.apptuiuv"
        },
        "cordova-plugin-device": {
            "PACKAGE_NAME": "com.MGA.apptuiuv"
        },
        "cordova-plugin-dialogs": {
            "PACKAGE_NAME": "com.MGA.apptuiuv"
        },
        "cordova-plugin-geolocation": {
            "PACKAGE_NAME": "com.MGA.apptuiuv"
        },
        "cordova-plugin-google-analytics": {
            "PACKAGE_NAME": "com.MGA.apptuiuv"
        },
        "cordova-plugin-inappbrowser": {
            "PACKAGE_NAME": "com.MGA.apptuiuv"
        },
        "cordova-plugin-market": {
            "PACKAGE_NAME": "com.MGA.apptuiuv"
        },
        "cordova-plugin-splashscreen": {
            "PACKAGE_NAME": "com.MGA.apptuiuv"
        },
        "cordova-plugin-statusbar": {
            "PACKAGE_NAME": "com.MGA.apptuiuv"
        },
        "ionic-plugin-keyboard": {
            "PACKAGE_NAME": "com.MGA.apptuiuv"
        },
        "uk.co.workingedge.phonegap.plugin.launchnavigator": {
            "PACKAGE_NAME": "com.MGA.apptuiuv"
        },
        "cordova-plugin-whitelist": {
            "PACKAGE_NAME": "com.MGA.apptuiuv"
        },
        "onesignal-cordova-plugin": {
            "PACKAGE_NAME": "com.MGA.apptuiuv"
        }
    },
    "dependent_plugins": {
        "cordova-plugin-actionsheet": {
            "PACKAGE_NAME": "com.MGA.apptuiuv"
        },
        "cordova-plugin-compat": {
            "PACKAGE_NAME": "com.MGA.apptuiuv"
        }
    }
}