<svg width="40" height="40" viewBox="0 0 34 38" fill="none" xmlns="http://www.w3.org/2000/svg">
<path d="M17 18.9999C21.6024 18.9999 25.3334 15.269 25.3334 10.6666C25.3334 6.06421 21.6024 2.33325 17 2.33325C12.3976 2.33325 8.66669 6.06421 8.66669 10.6666C8.66669 15.269 12.3976 18.9999 17 18.9999Z" stroke="white" stroke-width="4.16667"/>
<path d="M25.3334 22.3333H25.92C27.1385 22.3336 28.3149 22.7789 29.2282 23.5854C30.1415 24.3919 30.7289 25.5042 30.88 26.7133L31.5317 31.9199C31.5903 32.389 31.5485 32.8651 31.409 33.3168C31.2695 33.7684 31.0356 34.1852 30.7227 34.5396C30.4099 34.8939 30.0252 35.1776 29.5943 35.3719C29.1634 35.5663 28.696 35.6667 28.2234 35.6666H5.77669C5.30399 35.6667 4.83668 35.5663 4.40576 35.3719C3.97485 35.1776 3.59019 34.8939 3.27731 34.5396C2.96444 34.1852 2.7305 33.7684 2.59103 33.3168C2.45156 32.8651 2.40974 32.389 2.46835 31.9199L3.11835 26.7133C3.26951 25.5036 3.85738 24.3909 4.77141 23.5843C5.68543 22.7777 6.86265 22.3328 8.08169 22.3333H8.66669" stroke="white" stroke-width="4.16667" stroke-linecap="round" stroke-linejoin="round"/>
</svg>
