<svg width="1920" height="1080" viewBox="0 0 1920 1080" fill="none" xmlns="http://www.w3.org/2000/svg">
<g clip-path="url(#clip0_55279_2117)">
<rect width="1920" height="1080" fill="#023D4F"/>
<rect x="965" y="-52" width="860" height="950" rx="50" fill="#002935"/>
<path fill-rule="evenodd" clip-rule="evenodd" d="M1731 508H1566C1553.85 508 1544 517.85 1544 530V640C1544 652.15 1553.85 662 1566 662H1731C1743.15 662 1753 652.15 1753 640V530C1753 517.85 1743.15 508 1731 508ZM1566 398C1493.1 398 1434 457.098 1434 530V589.969C1422.56 586.732 1410.48 585 1398 585H1233C1225.5 585 1218.15 585.625 1211 586.825V398H1101V717V728V827C1101 899.902 1160.1 959 1233 959H1398C1470.9 959 1530 899.902 1530 827V767.031C1541.44 770.268 1553.52 772 1566 772H1731C1803.9 772 1863 712.902 1863 640V530C1863 457.098 1803.9 398 1731 398H1566ZM1211 728V827C1211 839.15 1220.85 849 1233 849H1398C1410.15 849 1420 839.15 1420 827V717C1420 704.85 1410.15 695 1398 695H1233C1220.85 695 1211 704.85 1211 717V728Z" fill="#023D4F"/>
</g>
<defs>
<clipPath id="clip0_55279_2117">
<rect width="1920" height="1080" fill="white"/>
</clipPath>
</defs>
</svg>
