<?xml version="1.0" encoding="UTF-8"?>
<svg width="223px" height="164px" viewBox="0 0 223 164" version="1.1" xmlns="http://www.w3.org/2000/svg" xmlns:xlink="http://www.w3.org/1999/xlink">
    <!-- Generator: Sketch 52.2 (67145) - http://www.bohemiancoding.com/sketch -->
    <title>Group 3</title>
    <desc>Created with Sketch.</desc>
    <defs>
        <circle id="path-1" cx="32.5912689" cy="32.5912689" r="32.5912689"></circle>
        <filter x="-23.8%" y="-19.2%" width="153.7%" height="153.7%" filterUnits="objectBoundingBox" id="filter-2">
            <feMorphology radius="0.5" operator="erode" in="SourceAlpha" result="shadowSpreadOuter1"></feMorphology>
            <feOffset dx="2" dy="5" in="shadowSpreadOuter1" result="shadowOffsetOuter1"></feOffset>
            <feGaussianBlur stdDeviation="5.5" in="shadowOffsetOuter1" result="shadowBlurOuter1"></feGaussianBlur>
            <feColorMatrix values="0 0 0 0 0.590657394   0 0 0 0 0.616652663   0 0 0 0 0.629650298  0 0 0 1 0" type="matrix" in="shadowBlurOuter1"></feColorMatrix>
        </filter>
    </defs>
    <g id="Page-1" stroke="none" stroke-width="1" fill="none" fill-rule="evenodd">
        <g id="Mobile-Copy-3" transform="translate(-56.000000, -300.000000)">
            <g id="Group-3" transform="translate(56.000000, 300.000000)">
                <g id="pantalla-5">
                    <g id="pantalla-4">
                        <g id="desktop" fill-rule="nonzero">
                            <path d="M10.5995303,0.000919656976 L185.206406,0.000919656976 C190.942602,0.000919656976 195.636773,4.69898732 195.636773,10.439946 L195.636773,118.088554 L0.1714608,118.088554 L0.1714608,10.4390263 C0.1714608,4.69806766 4.86563123,0 10.6018276,0 L10.5995303,0.000919656976 Z" id="Shape" fill="#56707C"></path>
                            <path d="M7.2013536,111.0513 L188.60688,111.0513 L188.60688,10.3922488 C188.60688,8.56170764 187.086161,7.03725394 185.258356,7.03725394 L10.5521765,7.03725394 C8.72391163,7.03725394 7.20365215,8.55940623 7.20365215,10.3922488 L7.20365215,111.0513 L7.2013536,111.0513 Z" id="Shape" fill="#D5DFE3"></path>
                            <path d="M195.678614,118.156455 L195.678614,129.580298 C195.678614,135.327652 190.502566,140.026769 184.176489,140.026769 L11.6322041,140.026769 C5.3056677,140.026769 0.130079179,135.327652 0.130079179,129.580298 L0.130079179,118.156455 L195.678614,118.156455 Z" id="Shape" fill="#F4F5F5"></path>
                            <ellipse id="Oval" fill="#BDC2C6" cx="97.9041168" cy="128.558615" rx="3.6006768" ry="3.60444714"></ellipse>
                            <polygon id="Shape" fill="#BDC2C6" points="120.562474 156.352848 137.16864 161.6852 58.8110544 161.6852 72.2083328 156.352848 72.2083328 139.886877 120.562474 139.886877"></polygon>
                            <polygon id="Shape" fill="#ECF0F1" points="72.2102397 156.36435 120.562961 156.36435 137.16864 161.642384 137.16864 163.916525 97.9909973 163.916525 58.8110544 163.916525 58.8110544 161.642384 72.2079395 156.36435"></polygon>
                        </g>
                        <g id="navegador" transform="translate(26.062042, 4.369075)">
                            <g id="pestaña" transform="translate(0.000000, 17.920829)">
                                <polygon id="Rectangle-6" fill="#F5F7F8" points="0 19.0990172 144.027072 19.0990172 144.027072 88.6749577 0 88.6749577"></polygon>
                                <rect id="Rectangle-7" fill="#528ED6" x="7.10542736e-14" y="18.9284903" width="144.027072" height="47.3237459"></rect>
                                <path d="M0,0 L144.027072,0 L144.027072,7.74636864 C144.027072,9.02475363 142.990736,10.0610894 141.712351,10.0610894 L2.3147208,10.0610894 C1.0363358,10.0610894 3.26518148e-15,9.02475363 3.10862447e-15,7.74636864 L0,0 Z" id="Rectangle-3" fill="#4A4A4A"></path>
                                <polygon id="header" fill="#FFFFFF" points="0 6.13896983 144.027072 6.13896983 144.027072 19.0990172 0 19.0990172"></polygon>
                                <g id="texto" transform="translate(51.834802, 34.322795)" fill-rule="nonzero">
                                    <path d="M9.77600733,2.04632328 C9.19961151,2.04632328 8.7318,1.58794037 8.7318,1.02316164 C8.7318,0.458382904 9.19961151,0 9.77600733,0 L23.3501111,0 C23.926507,0 24.3943185,0.458382904 24.3943185,1.02316164 C24.3942002,1.58794037 23.9263887,2.04632328 23.3501111,2.04632328 L9.77600733,2.04632328 Z" id="Shape" fill="#A7C5EA"></path>
                                    <path d="M38.1557307,2.04632328 L27.6573828,2.04632328 C27.0778544,2.04632328 26.6075004,1.58794037 26.6075004,1.02316164 C26.6075004,0.458382904 27.0778544,0 27.6573828,0 L38.1557307,0 C38.7352591,0 39.2056131,0.458382904 39.2056131,1.02316164 C39.2054942,1.58794037 38.7352591,2.04632328 38.1557307,2.04632328" id="Shape" fill="#A7C5EA"></path>
                                    <path d="M45.465336,6.13896983 L33.7971141,6.13896983 C33.2115581,6.13896983 32.736312,5.68058692 32.736312,5.11580819 C32.736312,4.55102945 33.2115581,4.09264655 33.7971141,4.09264655 L45.465336,4.09264655 C46.050892,4.09264655 46.526138,4.55102945 46.526138,5.11580819 C46.526138,5.68058692 46.050892,6.13896983 45.465336,6.13896983" id="Shape" fill="#A7C5EA"></path>
                                    <path d="M29.8101853,6.13896983 L15.062822,6.13896983 C14.481333,6.13896983 14.0093877,5.68058692 14.0093877,5.11580819 C14.0093877,4.55102945 14.481333,4.09264655 15.062822,4.09264655 L29.8101853,4.09264655 C30.3916744,4.09264655 30.8636196,4.55102945 30.8636196,5.11580819 C30.8636196,5.68058692 30.3916744,6.13896983 29.8101853,6.13896983" id="Shape" fill="#A7C5EA"></path>
                                    <path d="M10.8882337,6.13896983 L9.81001685,6.13896983 C9.21484799,6.13896983 8.7318,5.68058692 8.7318,5.11580819 C8.7318,4.55102945 9.21484799,4.09264655 9.81001685,4.09264655 L10.8882337,4.09264655 C11.4834026,4.09264655 11.9664506,4.55102945 11.9664506,5.11580819 C11.9664506,5.68058692 11.4832804,6.13896983 10.8882337,6.13896983" id="Shape" fill="#A7C5EA"></path>
                                    <path d="M19.1012112,10.4021433 L9.76878811,10.4021433 C9.19637725,10.4021433 8.7318,9.94376041 8.7318,9.37898168 C8.7318,8.81420294 9.19637725,8.35582004 9.76878811,8.35582004 L19.1012112,8.35582004 C19.6736221,8.35582004 20.1381993,8.81420294 20.1381993,9.37898168 C20.1381993,9.94376041 19.6736221,10.4021433 19.1012112,10.4021433" id="Shape" fill="#A7C5EA"></path>
                                    <path d="M25.5860029,10.4021433 L23.5431236,10.4021433 C22.9792634,10.4021433 22.521626,9.94376041 22.521626,9.37898168 C22.521626,8.81420294 22.9792634,8.35582004 23.5431236,8.35582004 L25.5860029,8.35582004 C26.1498631,8.35582004 26.6075004,8.81420294 26.6075004,9.37898168 C26.6073847,9.94376041 26.1498631,10.4021433 25.5860029,10.4021433" id="Shape" fill="#A7C5EA"></path>
                                    <path d="M43.2687488,10.4021433 L29.6946449,10.4021433 C29.1182491,10.4021433 28.6504376,9.94376041 28.6504376,9.37898168 C28.6504376,8.81420294 29.1182491,8.35582004 29.6946449,8.35582004 L43.2687488,8.35582004 C43.8451446,8.35582004 44.3129561,8.81420294 44.3129561,9.37898168 C44.3128378,9.94376041 43.8450263,10.4021433 43.2687488,10.4021433" id="Shape" fill="#A7C5EA"></path>
                                    <path d="M23.3501111,14.6653168 L9.77600733,14.6653168 C9.19961151,14.6653168 8.7318,14.2069339 8.7318,13.6421552 C8.7318,13.0773764 9.19961151,12.6189935 9.77600733,12.6189935 L23.3501111,12.6189935 C23.926507,12.6189935 24.3943185,13.0773764 24.3943185,13.6421552 C24.3942002,14.2069339 23.9263887,14.6653168 23.3501111,14.6653168" id="Shape" fill="#A7C5EA"></path>
                                    <path d="M37.1638769,41.1029696 L25.495655,41.1029696 C24.910099,41.1029696 24.4348529,40.6445867 24.4348529,40.079808 C24.4348529,39.5150292 24.910099,39.0566463 25.495655,39.0566463 L37.1638769,39.0566463 C37.7494329,39.0566463 38.224679,39.5150292 38.224679,40.079808 C38.224679,40.6445867 37.7494329,41.1029696 37.1638769,41.1029696" id="Shape" fill="#546E7A" opacity="0.170120018"></path>
                                    <path d="M21.5087263,41.1029696 L6.76136292,41.1029696 C6.1798739,41.1029696 5.70792868,40.6445867 5.70792868,40.079808 C5.70792868,39.5150292 6.1798739,39.0566463 6.76136292,39.0566463 L21.5087263,39.0566463 C22.0902153,39.0566463 22.5621605,39.5150292 22.5621605,40.079808 C22.5621605,40.6445867 22.0902153,41.1029696 21.5087263,41.1029696" id="Shape" fill="#546E7A" opacity="0.170120018"></path>
                                    <path d="M2.58677464,41.1029696 L1.50855779,41.1029696 C0.913388925,41.1029696 0.430340936,40.6445867 0.430340936,40.079808 C0.430340936,39.5150292 0.913388925,39.0566463 1.50855779,39.0566463 L2.58677464,39.0566463 C3.1819435,39.0566463 3.66499149,39.5150292 3.66499149,40.079808 C3.66499149,40.6445867 3.18182136,41.1029696 2.58677464,41.1029696" id="Shape" fill="#546E7A" opacity="0.170120018"></path>
                                </g>
                                <g id="articulos" transform="translate(10.973491, 81.939211)">
                                    <path d="M4.82184955,0.0782695945 L54.2676766,0.0782695945 C56.7856457,0.0782695945 58.8268628,2.11948678 58.8268628,4.63745579 L58.8268628,6.81524199 L0.262663353,6.81524199 L0.262663353,4.63745579 C0.262663353,2.11948678 2.30388054,0.0782695945 4.82184955,0.0782695945 Z" id="Rectangle-5" fill="#98C799"></path>
                                    <path d="M66.7909444,0.0782695945 L116.236771,0.0782695945 C118.75474,0.0782695945 120.795958,2.11948678 120.795958,4.63745579 L120.795958,6.81524199 L62.2317582,6.81524199 L62.2317582,4.63745579 C62.2317582,2.11948678 64.2729754,0.0782695945 66.7909444,0.0782695945 Z" id="Rectangle-5" fill="#F46D75"></path>
                                </g>
                                <g id="botones" transform="translate(95.166824, 10.402143)">
                                    <rect id="Rectangle-2" fill="#02A94A" x="0" y="0" width="17.8154192" height="4.43370043" rx="1.714608"></rect>
                                    <path d="M21.5232821,0 L35.9094853,2.22044605e-16 C36.8564371,1.73021677e-15 37.6240933,0.76765615 37.6240933,1.714608 L37.6240933,2.71909243 C37.6240933,3.66604428 36.8564371,4.43370043 35.9094853,4.43370043 L21.0680046,4.43370043 C20.3724955,4.43370043 19.8086741,3.86987897 19.8086741,3.17436994 L19.8086741,1.714608 C19.8086741,0.76765615 20.5763302,3.95996838e-16 21.5232821,2.22044605e-16 Z" id="Rectangle-2" fill="#007CC6"></path>
                                </g>
                                <g id="menu" transform="translate(44.774373, 12.107413)" fill="#BBC5CA" opacity="0.43970788">
                                    <path d="M0.937898168,0 L7.36548315,-1.11022302e-16 C7.88347,-2.06174944e-16 8.30338132,0.419911313 8.30338132,0.937898168 L8.30338132,0.937898168 C8.30338132,1.45588502 7.88347,1.87579634 7.36548315,1.87579634 L0.937898168,1.87579634 C0.419911313,1.87579634 6.34350944e-17,1.45588502 0,0.937898168 L0,0.937898168 C-6.34350944e-17,0.419911313 0.419911313,9.51526416e-17 0.937898168,0 Z" id="Rectangle-4"></path>
                                    <path d="M20.895148,0 L27.322733,0 C27.8407198,-9.51526416e-17 28.2606311,0.419911313 28.2606311,0.937898168 L28.2606311,0.937898168 C28.2606311,1.45588502 27.8407198,1.87579634 27.322733,1.87579634 L20.895148,1.87579634 C20.3771611,1.87579634 19.9572498,1.45588502 19.9572498,0.937898168 L19.9572498,0.937898168 C19.9572498,0.419911313 20.3771611,2.06174944e-16 20.895148,1.11022302e-16 Z" id="Rectangle-4"></path>
                                    <path d="M31.0712217,0 L37.4988067,-1.11022302e-16 C38.0167936,-2.06174944e-16 38.4367049,0.419911313 38.4367049,0.937898168 L38.4367049,0.937898168 C38.4367049,1.45588502 38.0167936,1.87579634 37.4988067,1.87579634 L31.0712217,1.87579634 C30.5532349,1.87579634 30.1333236,1.45588502 30.1333236,0.937898168 L30.1333236,0.937898168 C30.1333236,0.419911313 30.5532349,9.51526416e-17 31.0712217,0 Z" id="Rectangle-4"></path>
                                    <path d="M11.1350331,0 L17.5626181,-9.99200722e-16 C18.080605,-6.34288617e-16 18.5005163,0.419911313 18.5005163,0.937898168 L18.5005163,0.937898168 C18.5005163,1.45588502 18.080605,1.87579634 17.5626181,1.87579634 L11.1350331,1.87579634 C10.6170463,1.87579634 10.197135,1.45588502 10.197135,0.937898168 L10.197135,0.937898168 C10.197135,0.419911313 10.6170463,9.51526416e-17 11.1350331,0 Z" id="Rectangle-4"></path>
                                </g>
                            </g>
                            <g transform="translate(0.000000, 7.633181)">
                                <path d="M3.46087239,0 L140.394739,0 C142.299414,0 143.855611,1.56787048 143.855611,3.48683278 L143.855611,10.4591088 L0,10.4591088 L0,3.48683278 C0,1.56833366 1.55619727,0 3.46087239,0 Z" id="Shape" fill="#546E7A" fill-rule="nonzero"></path>
                                <rect id="Rectangle-19" fill="#FFFFFF" x="37.0355328" y="2.4004512" width="103.390862" height="5.4867456" rx="2.3147208"></rect>
                                <text id="http://www.bci.cl" font-family="OpenSans-SemiBold, Open Sans" font-size="3.429216" font-weight="500">
                                    <tspan x="39.6074448" y="6.7433728" fill="#999999">http://</tspan>
                                    <tspan x="50.2350004" y="6.7433728" fill="#4A4A4A">www.bci.cl</tspan>
                                </text>
                                <path d="M8.14529771,2.9148336 C9.2333124,2.9148336 10.1161872,3.79766084 10.1161872,4.8866328 C10.1161872,5.97560476 9.23376726,6.858432 8.14529771,6.858432 C7.05500874,6.858432 6.1725888,5.97560476 6.1725888,4.8866328 C6.1725888,3.79538552 7.0554636,2.9148336 8.14529771,2.9148336 Z" id="Shape" fill="#9BA7AF" fill-rule="nonzero"></path>
                                <path d="M16.0315848,2.9148336 C17.122377,2.9148336 18.003384,3.79766084 18.003384,4.8866328 C18.003384,5.97560476 17.1205568,6.858432 16.0315848,6.858432 C14.9426128,6.858432 14.0597856,5.97560476 14.0597856,4.8866328 C14.0602407,3.79538552 14.9430679,2.9148336 16.0315848,2.9148336 Z" id="Shape" fill="#9BA7AF" fill-rule="nonzero"></path>
                                <path d="M23.7484578,2.9148336 C24.836347,2.9148336 25.71912,3.79766084 25.71912,4.8866328 C25.71912,5.97560476 24.8368018,6.858432 23.7484578,6.858432 C22.6582946,6.858432 21.7755216,5.97560476 21.7755216,4.8866328 C21.7759764,3.79538552 22.6582946,2.9148336 23.7484578,2.9148336 Z" id="Shape" fill="#9BA7AF" fill-rule="nonzero"></path>
                            </g>
                            <g id="zoom" transform="translate(120.657600, 0.000000)">
                                <g id="Oval">
                                    <use fill="black" fill-opacity="1" filter="url(#filter-2)" xlink:href="#path-1"></use>
                                    <use fill="#FFFFFF" fill-rule="evenodd" xlink:href="#path-1"></use>
                                </g>
                                <path d="M6.56351942,49.5658881 L58.6190183,49.5658881 C53.0043924,57.953703 43.442754,63.4761933 32.5912689,63.4761933 C21.7397837,63.4761933 12.1781453,57.953703 6.56351942,49.5658881 Z" id="Combined-Shape" fill="#EFEFEF"></path>
                                <path d="M6.33719117,1.58429779 L58.39269,1.58429779 C52.7780642,9.97211271 43.2164258,15.4946031 32.3649406,15.4946031 C21.5134555,15.4946031 11.951817,9.97211271 6.33719117,1.58429779 Z" id="Combined-Shape" fill="#525253" transform="translate(32.364941, 8.539450) rotate(-180.000000) translate(-32.364941, -8.539450) "></path>
                                <g id="boton-verde" transform="translate(1.357970, 23.311810)" fill="#02A94A">
                                    <path d="M1.81500634,-1.28652719e-14 L12.1821812,2.22044605e-16 C12.8071694,1.21743823e-15 13.3138225,0.506653059 13.3138225,1.13164128 L13.3138225,18.3211318 C13.3138225,18.9461201 12.8071694,19.4527731 12.1821812,19.4527731 L1.81500634,19.4527731 C0.745251688,16.2106443 0.210374364,12.9685154 0.210374364,9.72638656 C0.210374364,6.48425771 0.745251688,3.24212885 1.81500634,-1.28652719e-14 Z" id="Rectangle-2"></path>
                                </g>
                                <g id="boton-azul" transform="translate(18.106260, 23.085482)">
                                    <path d="M44.0141244,0.226328256 C44.9744615,3.29969464 45.4919795,6.56863256 45.4919795,9.95844326 C45.4919795,13.4315954 44.9487015,16.7778581 43.9424903,19.9168865 L1.57658313,19.9168865 C0.830857956,19.9168865 0.226328256,19.3127115 0.226328256,18.5674238 L0.226328256,1.57579094 C0.226328256,0.83050328 0.830857956,0.226328256 1.57658313,0.226328256 L44.0141244,0.226328256 Z" id="Combined-Shape" fill="#007CC6"></path>
                                    <path d="M0.226328256,18.7852452 L44.2596619,18.7852452 L43.9532125,19.9168865 L0.792148896,19.9168865 C0.479654785,19.9168865 0.226328256,19.66356 0.226328256,19.3510659 L0.226328256,18.7852452 Z" id="Rectangle-13" fill="#05639F"></path>
                                    <text id="Banco-en-Lí" font-family="OpenSans-Regular, Open Sans" font-size="6.78984768" font-weight="normal" fill="#FFFFFF">
                                        <tspan x="8.14781722" y="12.2055499">Banco en Lí</tspan>
                                    </text>
                                </g>
                            </g>
                            <g id="clicker" transform="translate(142.754281, 29.327521)">
                                <path d="M11.6124499,4.78715283 C11.3924115,4.78715283 11.1829086,4.83290293 10.9926419,4.91510688 C10.7613343,4.33268092 10.1939414,3.91978103 9.53188689,3.91978103 C9.28595548,3.91978103 9.05302299,3.97681197 8.84556423,4.07823515 C8.58301724,3.57388727 8.05682255,3.22851578 7.45142872,3.22851578 C7.27347963,3.22851578 7.10260656,3.25875472 6.94295032,3.31374885 L6.94295032,1.57728178 C6.94300274,0.707612027 6.23775824,0 5.37081331,0 C4.50397321,0 3.79878112,0.707612027 3.79878112,1.57728178 L3.79878112,7.82577435 L2.66651121,6.53505742 C2.34484005,6.21282211 1.94915883,6.04846644 1.52800391,6.04642962 C1.09982536,6.04642962 0.70645041,6.20806953 0.411615753,6.5020505 C-0.108236714,7.02018607 -0.137012576,7.78926827 0.332888348,8.61240453 C0.941165005,9.67729561 1.60238086,10.6813955 2.18581279,11.567412 C2.6121568,12.2149117 3.01491405,12.8264799 3.30932938,13.3321334 C3.56464309,13.7709375 4.24236969,15.1940477 4.24928848,15.2084099 C4.33724093,15.3933426 4.52431025,15.511217 4.72956758,15.511217 L11.4528461,15.511217 C11.6838392,15.511217 11.8883103,15.3627381 11.959123,15.1438061 C12.0844998,14.7552958 13.1845345,11.3105116 13.1845345,9.98015502 L13.1845345,6.36459129 C13.1844297,5.49471263 12.47929,4.78715283 11.6124499,4.78715283 Z" id="Shape" fill="#546E7A" fill-rule="nonzero"></path>
                                <path d="M11.6124499,5.84666461 C11.8929228,5.84666461 12.1210331,6.0789665 12.1210331,6.36453906 L12.1210331,9.9801028 C12.1210331,10.864187 11.4391133,13.2409466 11.0628257,14.4516008 L5.06486666,14.4516008 C4.84440896,13.9945176 4.43122112,13.1478273 4.2291611,12.8005757 C3.92006955,12.2695403 3.50950246,11.6461168 3.07487687,10.9860306 C2.50009343,10.1133317 1.8487316,9.12406407 1.25707051,8.08841963 C1.10265577,7.81783597 0.961135139,7.45303636 1.16377172,7.25113008 C1.25827606,7.15675744 1.3855398,7.10745596 1.52286723,7.10599363 C1.65689251,7.10667257 1.78295071,7.15701857 1.87955165,7.24810097 L3.93023807,9.58548205 C4.07595191,9.75171787 4.31014235,9.81036783 4.51739146,9.732812 C4.72485023,9.65520395 4.86223008,9.457528 4.86223008,9.23682031 L4.86223008,1.57728178 C4.86223008,1.29176145 5.09039279,1.05956401 5.37086572,1.05956401 C5.65139107,1.05956401 5.8796062,1.29176145 5.8796062,1.57728178 L5.8796062,6.52367212 C5.8796062,6.81624298 6.11772777,7.05345413 6.41130447,7.05345413 C6.70488116,7.05345413 6.94300274,6.81624298 6.94300274,6.52367212 L6.94300274,4.80564088 C6.94300274,4.52027723 7.17111303,4.28813202 7.45148114,4.28813202 C7.73195407,4.28813202 7.96006437,4.52027723 7.96006437,4.80564088 L7.96006437,7.21467624 C7.96006437,7.50740377 8.19813353,7.74451047 8.49171022,7.74451047 C8.78533933,7.74451047 9.02346091,7.507456 9.02346091,7.21467624 L9.02346091,5.49706281 C9.02346091,5.21154248 9.2515712,4.97929281 9.53193931,4.97929281 C9.81246465,4.97929281 10.0406798,5.21154248 10.0406798,5.49706281 L10.0406798,7.90625484 C10.0406798,8.19877347 10.2787489,8.43608907 10.5723781,8.43608907 C10.8660596,8.43608907 11.1041287,8.19877347 11.1041287,7.90625484 L11.1041287,6.36453906 C11.1040239,6.0789665 11.3321342,5.84666461 11.6124499,5.84666461 Z" id="Path" fill="#FFFFFF"></path>
                            </g>
                        </g>
                    </g>
                </g>
                <g id="Group-11" transform="translate(51.597000, 50.009400)">
                    <g id="Artboard-1">
                        <path d="M15.1650367,25.5195172 C15.1650367,25.5195172 15.4210087,29.3234749 15.5880486,29.6146003 C16.0608265,30.438611 16.7995794,30.6572984 16.9566163,31.2875916 C17.0810316,31.786992 16.6492111,32.0117222 15.7124638,32.0117222 C13.9208843,32.0117222 13.1864859,31.8514896 13.273925,31.3375317 C13.4481063,30.3137609 14.1324897,30.1651393 14.3190131,29.4398102 C14.5180775,28.6657396 14.6424927,27.0676584 14.2443639,26.0189175 C14.1560789,25.7863468 13.9457673,25.0700568 14.4931944,24.9202367 C15.2385413,24.7162566 15.1650367,25.5195172 15.1650367,25.5195172" id="Fill-1" fill="#FDE000"></path>
                        <path d="M6.18338921,1.05859227 C6.18338921,1.05859227 5.08236287,1.60144634 5.08236287,1.92464228 C5.08236287,2.14010623 5.86967811,3.01654416 7.44430859,4.55395606 L8.03834279,4.40208762 L7.02416413,1.41314704 C6.46364752,1.17677719 6.18338921,1.05859227 6.18338921,1.05859227 Z" id="Path-3" fill="#FFEC5A"></path>
                        <path d="M14.4683114,25.3946671 C14.4683114,25.3946671 14.7899497,26.4886785 14.8166741,27.5420887 C14.8398402,28.4549427 14.6208942,29.2561307 14.5927266,29.4398102 C14.4931944,30.0890307 13.7973897,30.0872329 13.7218199,31.2626216 C13.6720538,32.0366922 16.6492111,32.0117222 15.7124638,32.0117222 C13.9208843,32.0117222 13.1864859,31.8514896 13.273925,31.3375317 C13.4481063,30.3137609 14.1324897,30.1651393 14.3190131,29.4398102 C14.5180775,28.6657396 14.6424927,27.0676584 14.2443639,26.0189175 C14.1560789,25.7863468 13.9457673,25.0700568 14.4931944,24.9202367 C15.2385413,24.7162566 14.4683114,25.3946671 14.4683114,25.3946671" id="Fill-3" fill="#F1CF03"></path>
                        <path d="M9.63011342,25.5195172 C9.63011342,25.5195172 9.37414149,29.3234749 9.20710157,29.6146003 C8.73432363,30.438611 7.99557078,30.6572984 7.83853385,31.2875916 C7.7141186,31.786992 8.14593904,32.0117222 9.08268633,32.0117222 C10.8742659,32.0117222 11.6086642,31.8514896 11.5212252,31.3375317 C11.3470438,30.3137609 10.6626853,30.1651393 10.4761371,29.4398102 C10.2770727,28.6657396 10.1526575,27.0676584 10.5507862,26.0189175 C10.6390713,25.7863468 10.8493828,25.0700568 10.3019558,24.9202367 C9.55660889,24.7162566 9.63011342,25.5195172 9.63011342,25.5195172" id="Fill-5" fill="#FDE000"></path>
                        <path d="M10.3268388,25.3946671 C10.3268388,25.3946671 10.0052254,26.4886785 9.97847611,27.5420887 C9.95530999,28.4549427 10.1742808,29.2561307 10.2024236,29.4398102 C10.3019558,30.0890307 10.9977605,30.0872329 11.0733303,31.2626216 C11.1230964,32.0366922 8.14593904,32.0117222 9.08268633,32.0117222 C10.8742659,32.0117222 11.6086642,31.8514896 11.5212252,31.3375317 C11.3470438,30.3137609 10.6626853,30.1651393 10.4761371,29.4398102 C10.2770727,28.6657396 10.1526575,27.0676584 10.5507862,26.0189175 C10.6390713,25.7863468 10.8493828,25.0700568 10.3019558,24.9202367 C9.55660889,24.7162566 10.3268388,25.3946671 10.3268388,25.3946671" id="Fill-7" fill="#F1CF03"></path>
                        <path d="M20.0669975,25.4446071 C19.5444535,26.643168 18.8548197,26.933045 18.3998332,26.543288 C17.3796282,25.6693373 19.2209738,25.0450868 19.1712077,24.5956264 C19.1214416,24.1461661 20.6064123,24.2073676 20.0669975,25.4446071" id="Fill-9" fill="#E3B609"></path>
                        <path d="M19.0716755,15.6313895 L20.3904771,22.722875 C20.3904771,22.722875 20.6064123,24.6068879 20.0669975,25.8441274 C19.5444535,27.0426883 18.8548197,27.3325653 18.3998332,26.9428083 C17.3796282,26.0688576 19.2209738,25.4446071 19.1712077,24.9951467 C19.1214416,24.5456864 18.8726111,24.4208363 18.8726111,24.4208363 C18.8726111,24.4208363 18.8356349,25.8417303 17.80264,25.269817 C17.0810316,24.8702967 18.3041081,23.3076229 18.6486637,23.0724553 C18.8993355,22.9013357 19.4449213,23.1973053 19.4946874,22.797785 C19.5510226,22.3456529 18.300301,17.7788111 18.300301,17.7788111 C18.300301,17.7788111 17.1059146,14.8573189 18.0514705,14.5826487 C18.9970264,14.3079784 19.0716755,15.6313895 19.0716755,15.6313895" id="Fill-11" fill="#FDE000"></path>
                        <path d="M18.4744823,15.8561196 C18.4744823,15.8561196 20.0227803,20.9564209 19.7435179,22.8726951 C19.6790708,23.3149141 19.0219094,23.1692141 18.8726111,23.1973053 C18.6096968,23.246771 18.3941599,23.5849399 18.325184,23.6967057 C18.2891036,23.7551855 17.3440454,24.9648082 17.9519383,25.269817 C18.7481959,25.6693373 18.7504105,24.1358784 18.8477281,24.1461661 C19.320506,24.1961061 19.6969368,24.8701468 19.5444535,25.2198769 C19.2761893,25.8352381 19.115619,26.2341591 18.8477281,26.4683779 C18.5938463,26.6903614 18.0763535,26.6931081 18.0934482,26.3620306 C18.1234323,25.7808534 19.2091544,25.3379851 19.1712077,24.9951467 C19.1214416,24.5456864 18.8726111,24.4208363 18.8726111,24.4208363 C18.8726111,24.4208363 18.8356349,25.8417303 17.80264,25.269817 C17.0810316,24.8702967 18.3041081,23.3076229 18.6486637,23.0724553 C18.8993355,22.9013357 19.4449213,23.1973053 19.4946874,22.797785 C19.5510226,22.3456529 18.300301,17.7788111 18.300301,17.7788111 C18.300301,17.7788111 17.1059146,14.8573189 18.0514705,14.5826487 C18.9970264,14.3079784 18.4744823,15.8561196 18.4744823,15.8561196" id="Fill-13" fill="#F1CF03"></path>
                        <path d="M4.78172089,25.4446071 C5.30426493,26.643168 5.99389864,26.933045 6.44888521,26.543288 C7.46909024,25.6693373 5.62774457,25.0450868 5.67751067,24.5956264 C5.72727677,24.1461661 4.24230614,24.2073676 4.78172089,25.4446071" id="Fill-15" fill="#E3B609"></path>
                        <path d="M5.77704287,15.6313895 L4.45824124,22.722875 C4.45824124,22.722875 4.24230614,24.6068879 4.78172089,25.8441274 C5.30426493,27.0426883 5.99389864,27.3325653 6.44888521,26.9428083 C7.46909024,26.0688576 5.62774457,25.4446071 5.67751067,24.9951467 C5.72727677,24.5456864 5.97610726,24.4208363 5.97610726,24.4208363 C5.97610726,24.4208363 6.01308348,25.8417303 7.04607839,25.269817 C7.76768683,24.8702967 6.54458541,23.3076229 6.20005471,23.0724553 C5.94935799,22.9013357 5.40379712,23.1973053 5.35403103,22.797785 C5.2976958,22.3456529 6.5484174,17.7788111 6.5484174,17.7788111 C6.5484174,17.7788111 7.74280378,14.8573189 6.7972479,14.5826487 C5.85169202,14.3079784 5.77704287,15.6313895 5.77704287,15.6313895" id="Fill-17" fill="#FDE000"></path>
                        <path d="M6.37423606,15.8561196 C6.37423606,15.8561196 4.82593807,20.9564209 5.10520053,22.8726951 C5.16964763,23.3149141 5.82680897,23.1692141 5.97610726,23.1973053 C6.23902157,23.246771 6.45455854,23.5849399 6.52353435,23.6967057 C6.55961478,23.7551855 7.50464811,24.9648082 6.8967801,25.269817 C6.10052251,25.6693373 6.09830792,24.1358784 6.00099031,24.1461661 C5.52821237,24.1961061 5.1517816,24.8701468 5.30426493,25.2198769 C5.57252908,25.8352381 5.73312429,26.2341591 6.00099031,26.4683779 C6.25487207,26.6903614 6.77236485,26.6931081 6.75527019,26.3620306 C6.72528612,25.7808534 5.63953914,25.3379851 5.67751067,24.9951467 C5.72727677,24.5456864 5.97610726,24.4208363 5.97610726,24.4208363 C5.97610726,24.4208363 6.01308348,25.8417303 7.04607839,25.269817 C7.76768683,24.8702967 6.54458541,23.3076229 6.20005471,23.0724553 C5.94935799,22.9013357 5.40379712,23.1973053 5.35403103,22.797785 C5.2976958,22.3456529 6.5484174,17.7788111 6.5484174,17.7788111 C6.5484174,17.7788111 7.74280378,14.8573189 6.7972479,14.5826487 C5.85169202,14.3079784 6.37423606,15.8561196 6.37423606,15.8561196" id="Fill-19" fill="#F1CF03"></path>
                        <path d="M9.36732161,5.14382543 C9.44896844,5.14365684 9.46277913,5.15832395 9.46271273,5.21773416 C9.46030029,7.24037871 9.46038882,8.0145223 9.46224795,10.0371837 C9.46231434,10.0966782 9.45330641,10.119977 9.3611245,10.1198927 C6.69468808,10.1175156 4.02825166,10.1177011 1.36181524,10.1193869 C1.28955259,10.1194375 0.229856965,7.06810564 0.229945495,7.00786935 C0.232712059,4.97961083 1.2722671,5.99524949 1.26903576,3.96699098 C1.26894723,3.90132617 1.29453241,3.89574593 1.36801235,3.89584708 C2.69937142,3.89756667 4.03075264,3.89709463 5.36213385,3.89709463 C6.69718906,3.89709463 8.0322664,5.14632053 9.36732161,5.14382543 Z" id="Fill-21" fill="#FDFDFD"></path>
                        <path d="M15.5299492,2.79309144 C15.5297999,2.70602098 16.1558077,4.57679456 16.2571564,4.57691941 C19.2466557,4.58044018 19.835229,3.45523645 22.8247283,3.45211519 C22.9165219,3.45201531 24.6019109,4.96641019 24.6018114,5.05437956 C24.5990991,8.05020758 24.4210252,6.16142926 24.4231154,9.15723231 C24.42319,9.24535151 22.6839133,10.6384522 22.5803003,10.6383274 C19.5907761,10.6348066 18.6227878,11.8906433 15.6332636,11.8931154 C15.5520204,11.8931903 15.5290783,11.8822284 15.5293022,11.7929856 C15.5329849,10.290939 15.5319149,8.78886753 15.5319149,7.28679601 C15.5319149,5.78889449 15.5326863,4.29099296 15.5299492,2.79309144 Z" id="Fill-23" fill="#FDFDFD"></path>
                        <path d="M4.47555487,6.85540397 C4.47555487,7.45758096 4.96201849,7.94576981 5.56212299,7.94576981 C6.16220262,7.94576981 6.64866623,7.45758096 6.64866623,6.85540397 C6.64866623,6.25320201 6.16220262,5.76503813 5.56212299,5.76503813 C4.96201849,5.76503813 4.47555487,6.25320201 4.47555487,6.85540397" id="Fill-25" fill="#030303"></path>
                        <path d="M20.5085248,6.88167742 C20.5085248,7.4884489 20.0183536,7.98035828 19.4136706,7.98035828 C18.8090125,7.98035828 18.3188165,7.4884489 18.3188165,6.88167742 C18.3188165,6.27488098 18.8090125,5.78299657 19.4136706,5.78299657 C20.0183536,5.78299657 20.5085248,6.27488098 20.5085248,6.88167742" id="Fill-27" fill="#030303"></path>
                        <path d="M18.12458,1.13350233 C18.12458,1.13350233 17.0235537,1.6763564 17.0235537,1.99955234 C17.0235537,2.21501629 17.8108689,3.09145422 19.3854994,4.62886612 L19.9795336,4.47699768 L18.9653549,1.48805709 C18.4048383,1.25168725 18.12458,1.13350233 18.12458,1.13350233 Z" id="Path-3" fill="#FFEC5A" transform="translate(18.501544, 2.881184) scale(-1, 1) translate(-18.501544, -2.881184) "></path>
                        <path d="M5.18693388,2.47218923 L4.241378,2.47218923 C4.16297151,2.48839478 4.0851871,2.50899504 4.006059,2.5201067 C3.08600824,2.64947637 2.28736189,3.0208305 1.64739474,3.70900424 C1.13706827,4.25782029 0.809159446,4.90988738 0.587974019,5.61933557 C0.409587437,6.19152357 0.297563948,6.77754495 0.258099431,7.37665063 C0.34914651,7.26500967 0.875821136,4.33979687 3.53830744,3.96524657 C6.31674875,3.57439086 8.91672883,6.71794152 9.3239897,6.975732 C9.36793316,7.0035486 9.41904295,7.01997887 9.4668184,7.04170279 L9.4668184,6.96679273 C9.45024629,6.92194657 9.42847362,6.87832395 9.41792321,6.83207947 C9.25981631,6.14138377 9.0431596,5.47188761 8.70679054,4.84558958 C8.40665119,4.28678551 7.68738177,4.78348914 7.24588182,4.41470692 C6.71022441,3.96731909 6.41754998,2.70123922 5.65433709,2.55985897 C5.49846966,2.53099363 5.34272666,2.50142913 5.18693388,2.47218923" id="Fill-29" fill="#F1CF03"></path>
                        <path d="M19.587852,2.45235305 L20.5334079,2.45235305 C20.6118144,2.46855859 20.6895988,2.48915886 20.7687269,2.50027052 C21.6888025,2.62964019 22.487424,3.00099432 23.1273911,3.68916805 C23.6377425,4.23798411 23.9656513,4.8900512 24.1868119,5.59949939 C24.3651984,6.17168738 24.4772219,6.75770877 24.5166864,7.35681444 C24.4256642,7.24517349 23.8989896,4.31996068 21.2365033,3.94541039 C18.458062,3.55455468 15.858057,6.69810533 15.4507962,6.95589581 C15.4068776,6.98371241 15.3557429,7.00014269 15.3079675,7.0218666 L15.3079675,6.94695655 C15.3245396,6.90211039 15.3463123,6.85848777 15.3568875,6.81224329 C15.5149944,6.12154758 15.7316263,5.45205142 16.0680202,4.8257534 C16.3681347,4.26694933 17.087429,4.76365296 17.5289289,4.39487074 C18.0645615,3.9474829 18.3572359,2.68140304 19.1204737,2.54002279 C19.2763162,2.51115745 19.4320592,2.48159294 19.587852,2.45235305" id="Fill-31" fill="#F1CF03"></path>
                        <path d="M0.651863737,6.92198653 C0.686476059,7.47679539 0.808452768,8.00006711 1.20058475,8.4225099 C1.51164775,8.75763253 1.90706429,8.95239868 2.33278838,9.09332947 C2.84318949,9.26225166 3.37120781,9.34218069 3.90410319,9.38687702 C4.93324124,9.47324832 5.94854431,9.39529192 6.94040755,9.09297989 C7.58010099,8.89801398 8.17627397,8.61682659 8.68572953,8.17143636 C9.02471131,7.8750672 9.28391804,7.52179136 9.45140584,7.09974809 C9.47255643,7.58129492 9.41445451,8.05195481 9.27754798,8.51075395 C8.91136902,9.73793053 8.11871948,10.610358 7.01488252,11.2157062 C6.31176218,11.6012933 5.55690999,11.8210544 4.758612,11.8910703 C4.73285804,11.8933426 4.70812429,11.9074257 4.68291776,11.9159904 L4.16037372,11.9159904 C4.14347813,11.9074756 4.12720462,11.8932178 4.10958742,11.8912201 C3.25092314,11.793862 2.53424155,11.4037554 1.9290609,10.8024025 C1.0553175,9.93419488 0.59020354,8.86133302 0.402635113,7.65533103 C0.378846917,7.50228978 0.353192493,7.34954817 0.328384093,7.19665674 L0.328384093,6.99689658 C0.386436248,6.97192656 0.444513285,6.94695655 0.50256544,6.92198653 L0.651863737,6.92198653 Z" id="Fill-33" fill="#F1CF03"></path>
                        <path d="M20.2845774,11.9159904 C20.1320941,11.8910953 19.9793619,11.8676235 19.8271523,11.8411053 C18.442112,11.6000198 17.2570319,11.0018879 16.3897829,9.86220631 C15.7790036,9.05957001 15.5229321,8.13567929 15.531691,7.13243385 C15.5317905,7.12197141 15.5357718,7.11150897 15.5393301,7.09435457 C16.0166118,8.22454759 16.9670199,8.75076578 18.0525678,9.09075756 C19.0742907,9.41077333 20.1238578,9.47931603 21.1869612,9.3755656 C21.7283168,9.32275401 22.2605901,9.23191308 22.7770627,9.05330253 C23.7890563,8.70334771 24.3012739,7.98840612 24.3405145,6.92198653 L24.4898128,6.92198653 C24.5478898,6.94695655 24.6059419,6.97192656 24.6639941,6.99689658 L24.6639941,7.19665674 C24.6399571,7.34125812 24.6134069,7.48548495 24.5922811,7.63051083 C24.4485069,8.6183997 24.1042499,9.52511105 23.491878,10.3179092 C22.9149645,11.0647874 22.194227,11.6054632 21.2619587,11.8260983 C21.1116651,11.8616806 20.9588085,11.8863011 20.8071214,11.9159904 L20.2845774,11.9159904 Z" id="Fill-35" fill="#F1CF03"></path>
                        <path d="M20.1642927,8.98829309 C21.2892056,9.50092759 22.735284,10.3669877 23.4289239,9.99803073 C24.9634118,9.18178577 24.7137602,3.72583653 21.8676619,3.03708848 C21.1049218,2.85248513 19.3887876,3.00959649 18.4440031,4.74998187 C17.8048073,5.92744314 17.8709216,7.28406429 18.078496,7.66500691 C18.3008509,8.07306697 18.9630884,8.44087535 20.1642927,8.98829309 M12.5005872,-3.99520311e-05 C16.4978749,-3.99520311e-05 18.3003035,0.624410294 19.1712102,1.29860082 C19.1958693,1.31770288 18.4177764,1.7487853 18.0017069,2.44722171 C17.5269632,3.24416485 17.4045137,4.31997317 17.4045137,4.31997317 C17.4045137,4.31997317 18.1820095,2.22111819 19.5942221,1.62321107 C20.9188961,1.06235946 22.3811236,1.59824105 23.0289787,2.11936536 C24.3426046,3.1759967 24.9585596,5.51783494 24.9625907,6.19786845 C24.9689608,7.26643546 25.1210211,8.45822952 24.0482879,10.2878078 C23.2033342,11.7289025 22.033806,12.4609985 21.7092813,12.6849297 C20.8930675,13.2481534 18.6545883,16.3369448 17.4791628,19.6265951 C16.3275753,22.8496003 16.8073205,26.2668224 12.5015576,26.280456 C8.34708366,26.2935903 6.72961079,-3.99520311e-05 12.5005872,-3.99520311e-05" id="Fill-37" fill="#FDE000"></path>
                        <path d="M6.89493377,7.66500441 C7.10250817,7.2840618 7.16864732,5.92746561 6.52945154,4.74997937 C5.58464215,3.00959399 3.86853288,2.85248263 3.10576787,3.03708598 C0.259669552,3.72583403 0.0100179157,9.18178327 1.54450581,9.99802824 C2.2381457,10.3669852 3.68424901,9.50092509 4.80913703,8.98829059 C6.01036625,8.44087285 6.67257884,8.07306447 6.89493377,7.66500441 M12.4718721,26.2804535 C8.16613413,26.2668199 8.64587932,22.8495978 7.49426691,19.6265926 C6.3188663,16.3369423 4.08038716,13.2481509 3.26414848,12.6849272 C2.93964864,12.460996 1.77012042,11.7289 0.925141829,10.2878053 C-0.14759132,8.45822702 0.0044689957,7.26643296 0.0108390564,6.19786595 C0.0148949935,5.51783244 0.630850002,3.17601917 1.94445107,2.11936286 C2.59230615,1.59823855 4.05453367,1.06235697 5.3792077,1.62320857 C6.79142029,2.22111569 7.56891605,4.31997067 7.56891605,4.31997067 C7.56891605,4.31997067 7.44649145,3.24418732 6.97172287,2.44721921 C6.55567828,1.7487828 5.77756044,1.31770039 5.80221954,1.29859832 C6.67312627,0.624407797 8.47555485,-4.2449033e-05 12.4728675,-4.2449033e-05 C18.0487856,-4.2449033e-05 16.6263461,26.2935878 12.4718721,26.2804535" id="Fill-40" fill="#FDE000"></path>
                        <path d="M18.7182342,16.8552875 C18.2558574,17.7234201 17.8222205,18.6664379 17.4791579,19.6265851 C16.3275703,22.8496153 16.8073155,26.2668124 12.5015775,26.280446 C8.34707869,26.2935803 8.64649642,23.6340235 7.87430074,20.850116 C7.20245841,18.4280242 6.66690053,17.7721866 6.18225338,16.7300628 C6.01822431,16.3773363 7.20245841,17.8287437 8.24754649,20.3257456 C9.31405887,22.8739611 8.59590918,25.7442398 12.502548,25.6443598 C16.458928,25.5432312 15.8632029,22.1209402 17.056146,19.551675 C17.9172986,17.6970019 18.9557429,16.4093978 18.7182342,16.8552875" id="Fill-43" fill="#F1CF03"></path>
                        <path d="M6.65686769,10.0350213 C6.825525,10.4115193 7.94259974,8.72651739 12.4588235,8.71982543 C17.2239523,8.71278388 17.9333432,10.2429966 18.2607544,10.111929 C18.4370756,10.0413138 17.9340648,7.37144438 12.5708221,7.37144438 C7.41174476,7.37144438 6.52827209,9.74791604 6.65686769,10.0350213" id="Fill-45" fill="#FDEE7D"></path>
                        <path d="M19.7700034,11.6905661 C19.8785184,11.707321 20.0993554,11.336641 19.9853911,11.0166752 C19.857741,10.6583804 19.3842415,10.3340947 19.3141459,10.3428842 C19.2478077,10.3511992 19.4147978,13.3642565 12.5015651,13.3642565 C5.67823477,13.3642565 5.71331987,10.3250056 5.67823477,10.3428842 C4.61654969,10.8838846 5.05476508,11.6400267 5.19647404,11.690616 C5.33815813,11.7412053 5.33106646,11.3842838 5.50052003,11.3962694 C5.58462473,11.4022373 6.37172536,13.5140766 12.5015651,13.5140766 C18.3188239,13.5140766 19.4615531,11.4034108 19.4854657,11.3988913 C19.6127425,11.37497 19.7116029,11.6815519 19.7700034,11.6905661" id="Fill-47" fill="#E3C202"></path>
                    </g>
                </g>
                <g id="Logo--Copy" transform="translate(32.545800, 30.958200)" fill-rule="nonzero">
                    <g id="logo">
                        <g id="Group">
                            <g transform="translate(0.000000, 1.014121)" id="Shape">
                                <path d="M0.00765593909,5.2383241 C0.0191398477,5.58156499 0.271785838,5.87409984 0.608647157,5.92870635 C0.654582792,5.93650728 0.700518426,5.94040774 0.746454061,5.93650728 C0.937852538,5.92870635 1.11393914,5.84679659 1.24026213,5.70637986 C1.3704131,5.56596313 1.43548858,5.37874083 1.42783264,5.18761805 C1.42783264,4.66495578 1.72258629,4.3100135 2.1245231,3.90826563 C2.54559975,3.59232799 3.14659096,3.20618199 3.99257223,2.72642483 C5.04526386,2.15695698 5.73047041,1.48217659 5.87976122,0.932211064 L5.88358919,0.916609205 C5.90272904,0.846400841 5.91038497,0.776192476 5.90655701,0.705984111 C5.8950731,0.362743217 5.64242711,0.0702083647 5.30556579,0.0156018588 C5.25963015,0.00780092941 5.21369452,0.0039004647 5.16775888,0.00780092941 C4.97636041,0.0156018588 4.80027381,0.0975116176 4.67395081,0.237928347 C4.54379985,0.378345076 4.47872437,0.565567382 4.4863803,0.756690152 C4.4863803,1.30665568 4.16100289,1.67329936 3.7207864,2.09845001 C2.78293386,2.84343877 1.91781274,3.21788338 1.91781274,3.21788338 C0.865121117,3.78735123 0.179914569,4.46213162 0.0306237563,5.01209714 L0.0267957868,5.027699 C0.0114839086,5.10180783 0.00382796954,5.1720162 0.00765593909,5.2383241 Z" fill="#EF3942"></path>
                                <path d="M4.24904619,3.038462 C4.24904619,3.038462 5.0146401,3.24518663 4.77347802,4.34121721 C4.76199411,4.39972418 4.75433817,4.45823116 4.76199411,4.52063859 C4.7887899,4.84437716 5.06823168,5.08230551 5.38595315,5.05500225 C5.70367462,5.027699 5.93718076,4.74296508 5.91038497,4.41922651 C5.8567934,3.65863589 4.44810061,2.72642483 4.25670213,2.74982762 C4.25670213,2.74982762 4.14569102,2.75372808 4.14569102,2.89804527 C4.14569102,3.01505922 4.24904619,3.038462 4.24904619,3.038462 Z" fill="#0C9647"></path>
                                <path d="M4.01171208,3.39730476 C4.01171208,3.39730476 4.51317609,3.53382102 4.35622934,4.24760606 C4.35622934,4.24760606 4.19162665,4.92238646 3.13127909,5.09790737 C1.93312462,5.30073153 1.95226447,4.85217809 1.95226447,4.85217809 C1.94078056,4.6298516 1.8603932,4.36071954 3.05089173,3.62743217 C3.05089173,3.62743217 3.65188294,3.25298756 4.01171208,3.39730476 Z" fill="#FDD700"></path>
                            </g>
                            <path d="M1.12159508,1.09603058 C1.19049853,2.07114676 2.56091162,3.2373857 3.38009711,3.68983961 C3.60211934,3.81465448 3.87773315,3.78735123 3.95812051,3.75614751 C4.33326152,3.5806266 3.93132472,3.43240894 3.93132472,3.43240894 C3.93132472,3.43240894 2.64129898,3.08136712 3.04323579,1.23254685 C3.0662036,1.13503523 3.07385954,1.03362315 3.0662036,0.928310599 C3.02026797,0.382245541 2.54942772,-0.0234027882 2.01351198,0.0234027882 C1.47376827,0.0702083647 1.07565944,0.549965523 1.12159508,1.09603058 Z" id="Shape" fill="#2C70B8"></path>
                        </g>
                        <path d="M14.1290356,6.43576676 L15.0400923,6.43576676 L15.0400923,2.43388997 L14.1290356,2.43388997 L14.1290356,6.43576676 Z M14.584564,2.01263979 C14.8601778,2.01263979 15.0822,1.78641283 15.0822,1.50557938 C15.0822,1.22474592 14.8601778,0.998518964 14.584564,0.998518964 C14.3089502,0.998518964 14.0869279,1.22474592 14.0869279,1.50557938 C14.0830999,1.78641283 14.3089502,2.01263979 14.584564,2.01263979 Z M9.9795166,4.87558088 C9.9795166,4.41532604 9.81874188,3.9667726 9.44360086,3.70544147 C9.70007482,3.4363094 9.82256985,3.09306851 9.82256985,2.74202669 C9.82256985,1.93463049 9.4014932,1.26765103 8.14974716,1.26765103 L6.37739726,1.26765103 L6.37739726,6.43576676 L8.18419888,6.43576676 C9.52016025,6.43576676 9.9795166,5.74538451 9.9795166,4.87558088 Z M7.29228198,2.18035977 L8.17271497,2.18035977 C8.73925447,2.18035977 8.83495371,2.45729276 8.83495371,2.73812622 C8.83495371,3.01505922 8.72011462,3.3036936 8.22630655,3.3036936 L7.29228198,3.3036936 L7.29228198,2.18035977 Z M7.29228198,4.22420327 L8.22630655,4.22420327 C8.78901807,4.22420327 8.9995564,4.4309279 8.9995564,4.87948134 C8.9995564,5.19541898 8.86557746,5.51915755 8.21482264,5.51915755 L7.29610995,5.51915755 L7.29610995,4.22420327 L7.29228198,4.22420327 Z M12.2648144,5.60496778 C11.682963,5.60496778 11.2121228,5.09790737 11.2121228,4.47383301 L11.2121228,4.46213162 C11.2121228,3.8341568 11.6676512,3.34269825 12.2533305,3.34269825 C12.5595681,3.34269825 12.8045581,3.45971219 13.0648601,3.72884426 L13.6888191,3.05796433 C13.3825815,2.75372808 12.946193,2.43388997 12.2571585,2.43388997 C11.1738431,2.43388997 10.2934101,3.34659872 10.2934101,4.46603208 L10.2934101,4.47773348 C10.2934101,5.59716685 11.1700151,6.50987559 12.2495025,6.50987559 C12.7930742,6.50987559 13.2562585,6.31095189 13.6543674,5.90920402 L13.0150964,5.27342828 C12.7777623,5.49965523 12.5442562,5.60496778 12.2648144,5.60496778 Z" id="Shape" fill="#000000"></path>
                    </g>
                </g>
            </g>
        </g>
    </g>
</svg>