﻿Tipo de resolución;Código DIAN
Factura electrónica de Venta;01
Factura electrónica de venta ‐exportación;02
Instrumento electrónico de transmisión – tipo 03;03
Factura electrónica de Venta ‐ tipo 04;04
Nota Crédito;91
Nota Débito;92
Documento soporte;05
Documento Soporte Ajuste;95
