id,name,model_id:id,group_id:id,perm_read,perm_write,perm_create,perm_unlink
access_wizard_pos_x_report,access_wizard_pos_x_report,model_wizard_pos_x_report,,1,1,1,1
access_wizard_pos_sale_report,access_wizard_pos_sale_report,model_wizard_pos_sale_report,,1,1,1,1
access_wizard_sales_details,assess.wizard.sales.details,model_wizard_sales_details,,1,1,1,1
access_customer_sales_report,assess.customer.sales.report,model_customer_sales_report,,1,1,1,1
access_employee_hourly_sale,assess.employee.hourly.sale,model_employee_hourly_sale,,1,1,1,1
