id,name,model_id:id,group_id:id,perm_read,perm_write,perm_create,perm_unlink
access_sh_pwa_config,access_sh_pwa_config,model_sh_pwa_config,base.group_user,1,1,1,1
access_sh_push_notification,access_sh_push_notification,model_sh_push_notification,base.group_user,1,1,1,1
access_sh_send_notification,access_sh_send_notification,model_sh_send_notification,base.group_user,1,1,1,1
access_sh_notification_logger,access_sh_notification_logger,model_sh_notification_logger,base.group_user,1,1,1,1