{
  "Chat Now": "Chat Now",
  "Communication channels": "Communication channels",
  "Fedora Chat": "Fedora Chat",
  "Fedora Discussion": "Fedora Discussion",
  "Fedora's Discourse-based discussion forum is a great place to connect with other Fedora Project users and contributors.": "Fedora's Discourse-based discussion forum is a great place to connect with other Fedora Project users and contributors.",
  "Fedora's Matrix-powered chat server is a great place to chat in real time with other Fedora Project users and contributors.": "Fedora's Matrix-powered chat server is a great place to chat in real time with other Fedora Project users and contributors.",
  "Atomic Desktops": "Atomic Desktops",
  "User Documentation": "User Documentation",
  "Visit Now": "Visit Now"
}
