{
  "Attend a meeting": "Attend a meeting",
  "Chat": "Chat",
  "Chat Now": "Chat Now",
  "Cloud Working Group meetings are open to all current and potential contributors {cadence} at **{time}** UTC in **{location}** (see [fedocal\u2192cloud](https://calendar.fedoraproject.org/list/cloud/) for updates).": "Cloud Working Group meetings are open to all current and potential contributors {cadence} at **{time}** UTC in **{location}** (see [fedocal\u2192cloud](https://calendar.fedoraproject.org/list/cloud/) for updates).",
  "Communication Channels": "Communication Channels",
  "Community": "Community",
  "Description": "Description",
  "Fedora Cloud is created by a team in the Fedora Project community called the Cloud Working Group. It is comprised of official members who have decision-making powers, as well as other contributors. Learn more about this group and how you can get involved on the Cloud Working Group website.": "Fedora Cloud is created by a team in the Fedora Project community called the Cloud Working Group. It is comprised of official members who have decision-making powers, as well as other contributors. Learn more about this group and how you can get involved on the Cloud Working Group website.",
  "Forum": "Forum",
  "Join a community of users and contributors focused on Fedora Cloud.": "Join a community of users and contributors focused on Fedora Cloud.",
  "Mailing List": "Mailing List",
  "Report & discuss issues": "Report & discuss issues",
  "The **Fedora Cloud** tag on Fedora's Discourse-based discussion forum is a great place to connect with other Fedora Cloud users and contributors.": "The **Fedora Cloud** tag on Fedora's Discourse-based discussion forum is a great place to connect with other Fedora Cloud users and contributors.",
  "The Fedora Cloud Working Group sends meeting agendas and minutes and has discussions on their mailing list at cloud@lists.fedoraproject.org.": "The Fedora Cloud Working Group sends meeting agendas and minutes and has discussions on their mailing list at cloud{'@'}lists.fedoraproject.org.",
  "Visit Now": "Visit Now",
  "Ways to get involved": "Ways to get involved",
  "You can chat with the Fedora Cloud Working Group via Matrix: #cloud:fedoraproject.org.": "You can chat with the Fedora Cloud Working Group via Matrix: #cloud:fedoraproject.org.",
  "You can view, file, and discuss Fedora Cloud issues on the [Fedora Cloud issue tracker](https://pagure.io/cloud-sig/issues).": "You can view, file, and discuss Fedora Cloud issues on the [Fedora Cloud issue tracker](https://pagure.io/cloud-sig/issues)."
}