{
  "Documentation": "Documentation",
  "Featured Applications": "Featured Applications",
  "Fedora Scientific Lab": "Fedora Scientific Lab",
  "Fedora Scientific includes the complete toolchain needed for creating documents using LaTeX.": "Fedora Scientific includes the complete toolchain needed for creating documents using LaTeX.",
  "GNU Octave": "GNU Octave",
  "GNU Octave is a high level programming language and numerical computing environment, mostly compatible with MATLAB.": "GNU Octave is a high level programming language and numerical computing environment, mostly compatible with MATLAB.",
  "GNU Scientific Library": "GNU Scientific Library",
  "Gnuplot": "Gnuplot",
  "Gnuplot is a command line driven utility for creating 2D and 3D graphs.": "Gnuplot is a command line driven utility for creating 2D and 3D graphs.",
  "IPython": "IPython",
  "IPython is an enhanced interactive shell with various features to support rapid interactive computing.": "IPython is an enhanced interactive shell with various features to support rapid interactive computing.",
  "LaTeX": "LaTeX",
  "Matplotlib": "Matplotlib",
  "Matplotlib is the most feature-rich Python library for creating publication ready graphs and figures.": "Matplotlib is the most feature-rich Python library for creating publication ready graphs and figures.",
  "Maxima": "Maxima",
  "Maxima is a computer algebra system.": "Maxima is a computer algebra system.",
  "Pandas": "Pandas",
  "Pandas is a Python library mostly useful for data analysis.": "Pandas is a Python library mostly useful for data analysis.",
  "R": "R",
  "R is a software environment for statistical computing.": "R is a software environment for statistical computing.",
  "The GNU Scientific Library is a C/C++ library providing a extensive collection of mathematical routines.": "The GNU Scientific Library is a C/C++ library providing a extensive collection of mathematical routines.",
  "Wary of reinstalling all the essential tools for your scientific and numerical work? The answer is here. Fedora Scientific Spin brings together the most useful open source scientific and numerical tools atop the goodness of the KDE desktop environment.\n\nFedora Scientific currently ships with numerous applications and libraries. These range from libraries such as the GNU Scientific library, the SciPy libraries, tools like Octave and xfig to typesetting tools like Kile and graphics programs such as Inkscape. The current set of packages include an IDE, tools and libraries for programming in C, C++, Python, Java and R. Also included along with are libraries for parallel computing such as the OpenMPI and OpenMP. Tools for typesetting, writing and publishing are included.": "Wary of reinstalling all the essential tools for your scientific and numerical work? The answer is here. Fedora Scientific Spin brings together the most useful open source scientific and numerical tools atop the goodness of the KDE desktop environment.\n\nFedora Scientific currently ships with numerous applications and libraries. These range from libraries such as the GNU Scientific library, the SciPy libraries, tools like Octave and xfig to typesetting tools like Kile and graphics programs such as Inkscape. The current set of packages include an IDE, tools and libraries for programming in C, C++, Python, Java and R. Also included along with are libraries for parallel computing such as the OpenMPI and OpenMP. Tools for typesetting, writing and publishing are included."
}