{
  "A lightweight yet powerful and scalable OS": "A lightweight yet powerful and scalable OS",
  "Attend a meeting": "Attend a meeting",
  "Built By You": "Built By You",
  "Built on the latest technologies and enhancements that open-source has to offer.": "Built on the latest technologies and enhancements that open-source has to offer.",
  "Chat with the team": "Chat with the team",
  "Container Based": "Container Based",
  "Documentation": "Documentation",
  "Download Now": "Download Now",
  "Edge Support": "Edge Support",
  "Everything is supported by a totally free and open-source Fedora ecosystem.": "Everything is supported by a totally free and open-source Fedora ecosystem.",
  "Fedora IoT Image": "Fedora IoT Image",
  "Fedora IoT is a container-based host that runs on your hardware, with a focus on edge device deployment.": "Fedora IoT is a container-based host that runs on your hardware, with a focus on edge device deployment.",
  "Fedora works with hardware vendors to make excellent hardware support across a range of devices.": "Fedora works with hardware vendors to make excellent hardware support across a range of devices.",
  "Flexible": "Flexible",
  "Join the mailing list": "Join the mailing list",
  "Leading Technology": "Leading Technology",
  "Makes the most of your device": "Makes the most of your device",
  "Open to all current and potential contributors {cadence} at **{time}** UTC in **{location}** (see [fedocal\u2192iot](https://calendar.fedoraproject.org/list/IoT/) for updates).": "Open to all current and potential contributors {cadence} at **{time}** UTC in **{location}** (see [fedocal\u2192iot](https://calendar.fedoraproject.org/list/IoT/) for updates).",
  "Open-source Ecosystem": "Open-source Ecosystem",
  "Platforms Tested against IoT": "Platforms Tested against IoT",
  "Report & discuss issues": "Report & discuss issues",
  "Sign up at [iot@lists.fedoraproject.org](https://lists.fedoraproject.org/admin/lists/iot.lists.fedoraproject.org/) to receive meeting agendas and minutes [view archives](https://lists.fedoraproject.org/archives/list/iot@lists.fedoraproject.org/)": "Sign up at [iot{'@'}lists.fedoraproject.org](https://lists.fedoraproject.org/admin/lists/iot.lists.fedoraproject.org/) to receive meeting agendas and minutes [view archives](https://lists.fedoraproject.org/archives/list/iot{'@'}lists.fedoraproject.org/)",
  "The Fedora Project envisions a world where everyone benefits from free and open source software built by inclusive, welcoming, and open-minded communities.\n\nFedora IoT is created by a team in the Fedora community called the **IoT Working Group**. It is comprised of official members who have decision making powers, as well as other contributors. Learn more on the [IoT Working Group website](https://docs.fedoraproject.org/en-US/iot-wg/).": "The Fedora Project envisions a world where everyone benefits from free and open source software built by inclusive, welcoming, and open-minded communities.\n\nFedora IoT is created by a team in the Fedora community called the **IoT Working Group**. It is comprised of official members who have decision making powers, as well as other contributors. Learn more on the [IoT Working Group website](https://docs.fedoraproject.org/en-US/iot-wg/).",
  "The solid foundation for IoT ecosystems": "The solid foundation for IoT ecosystems",
  "There are a wide variety of supported installation methods.": "There are a wide variety of supported installation methods.",
  "Use Fedora IoT to support your workloads that are computed outside of the traditional datacenter.": "Use Fedora IoT to support your workloads that are computed outside of the traditional datacenter.",
  "Visit \\#fedora-iot on irc.libera.chat or visit [#iot:fedoraproject.org](https://matrix.to/#/#iot:fedoraproject.org?web-instance[element.io]=chat.fedoraproject.org).": "Visit \\#fedora-iot on irc.libera.chat or visit [#iot:fedoraproject.org](https://matrix.to/#/#iot:fedoraproject.org?web-instance[element.io]=chat.fedoraproject.org).",
  "Why Fedora Iot?": "Why Fedora Iot?",
  "You can view, file, and discuss Fedora IoT issues on the [Fedora IoT issue tracker](https://github.com/fedora-iot/iot-distro/issues)": "You can view, file, and discuss Fedora IoT issues on the [Fedora IoT issue tracker](https://github.com/fedora-iot/iot-distro/issues)"
}