{
  "A flexible 2.5D simulator for robotic sensors and movement.": "A flexible 2.5D simulator for robotic sensors and movement.",
  "A versatile and powerful 3D robotics simulator with realistic physics.": "A versatile and powerful 3D robotics simulator with realistic physics.",
  "Arduino": "Arduino",
  "Development environment for the Arduino open source hardware platform.": "Development environment for the Arduino open source hardware platform.",
  "Documentation": "Documentation",
  "Eclipse": "Eclipse",
  "Fawkes": "Fawkes",
  "Featured Applications": "Featured Applications",
  "Fedora Robotics Lab": "Fedora Robotics Lab",
  "Gazebo": "Gazebo",
  "Libraries and applications for robotics system development.": "Libraries and applications for robotics system development.",
  "MRPT": "MRPT",
  "Modular framework for high performance robotic systems.": "Modular framework for high performance robotic systems.",
  "PCL": "PCL",
  "Physical simulator for multi-agent robotics research.": "Physical simulator for multi-agent robotics research.",
  "Player": "Player",
  "Powerful and extensible multi-language integrated development environment.": "Powerful and extensible multi-language integrated development environment.",
  "Robot server and framework for advanced robotic systems.": "Robot server and framework for advanced robotic systems.",
  "SimSpark": "SimSpark",
  "Stage": "Stage",
  "The Fedora Robotics spin provides a wide variety of free and open robotics software packages. These range from hardware accessory libraries for the Hokuyo laser scanners or Katana robotic arm to software frameworks like Fawkes or Player and simulation environments such as Stage and RoboCup Soccer Simulation Server 2D/3D. It also provides a ready to use development environment for robotics including useful libraries such as OpenCV computer vision library, Festival text to speech system and MRPT.\n\nThe Robotics spin is targeted at people just discovering their interest in robotics as well as experienced roboticists. For the former we provide a readily usable simulation environment with an introductory hands-on demonstration, and for the latter we provide a full development environment, to be used immediately.": "The Fedora Robotics spin provides a wide variety of free and open robotics software packages. These range from hardware accessory libraries for the Hokuyo laser scanners or Katana robotic arm to software frameworks like Fawkes or Player and simulation environments such as Stage and RoboCup Soccer Simulation Server 2D/3D. It also provides a ready to use development environment for robotics including useful libraries such as OpenCV computer vision library, Festival text to speech system and MRPT.\n\nThe Robotics spin is targeted at people just discovering their interest in robotics as well as experienced roboticists. For the former we provide a readily usable simulation environment with an introductory hands-on demonstration, and for the latter we provide a full development environment, to be used immediately.",
  "The Point Cloud Library (PCL) is a standalone, large scale, open project for 2D/3D image and point cloud processing.": "The Point Cloud Library (PCL) is a standalone, large scale, open project for 2D/3D image and point cloud processing."
}