{
  "Become a Fedora contributor": "Become a Fedora contributor",
  "Check out the recap from our latest event, the Fedora 38 release party!": "Check out the recap from our latest event, the Fedora 38 release party!",
  "Col\u00far (cuh-loohr) is our Flock mascot.": "Col\u00far (cuh-loohr) is our Flock mascot.",
  "Events": "Events",
  "Fedora Release Parties": "Fedora Release Parties",
  "Fedora has events throughout the year that you can attend, typically in-person or virtually, to learn more about Fedora Workstation as well as meet other users and contributors.": "Fedora has events throughout the year that you can attend, typically in-person or virtually, to learn more about Fedora Workstation as well as meet other users and contributors.",
  "Flock is the Fedora Project's annual multi-day **in-person** conference focused on our contributors. It typically alternates between European and North American locations. The conference provides a venue for face-to-face meetings and conversations. It is also a place to celebrate our community. \n\n**Flock typically takes place every August.**": "Flock is the Fedora Project's annual multi-day **in-person** conference focused on our contributors. It typically alternates between European and North American locations. The conference provides a venue for face-to-face meetings and conversations. It is also a place to celebrate our community. \n\n**Flock typically takes place every August.**",
  "Hatch is a series of small-scale, in-person global meetups organized in the weeks preceding the Flock / Nest conference enabling Fedorans local to each other to meet.": "Hatch is a series of small-scale, in-person global meetups organized in the weeks preceding the Flock / Nest conference enabling Fedorans local to each other to meet.",
  "Make a proposal": "Make a proposal",
  "Nest is our at-home, virtual Flock that has been running since the global outbreak of COVID-19.  It takes place over 3 days and includes talks, workshops, hackfests, and social events.": "Nest is our at-home, virtual Flock that has been running since the global outbreak of COVID-19.  It takes place over 3 days and includes talks, workshops, hackfests, and social events.",
  "Recap": "Recap",
  "The Annual Fedora Project Conference": "The Annual Fedora Project Conference",
  "The Virtual Fedora Project Conference": "The Virtual Fedora Project Conference",
  "There's a Fedora release party every six months and a Flock event every year. Make a plan to attend and even propose a talk!": "There's a Fedora release party every six months and a Flock event every year. Make a plan to attend and even propose a talk!",
  "Twice a year, in coordination with the release of each new version of Fedora Linux, we hold global virtual release parties. These are typically a 1.5 day \"mini-conference\" with talks and social events. ": "Twice a year, in coordination with the release of each new version of Fedora Linux, we hold global virtual release parties. These are typically a 1.5 day \"mini-conference\" with talks and social events. ",
  "We have a **currently-open call for proposals and sponsors** for this year's Nest virtual Fedora annual conference! We have a rolling deadline process with acceptance dates of **July 1st and July 8th, 2022**.\n\n[Read more about the call for proposals and propose your own](https://communityblog.fedoraproject.org/nest-2022-cfp/)!": "We have a **currently-open call for proposals and sponsors** for this year's Nest virtual Fedora annual conference! We have a rolling deadline process with acceptance dates of **July 1st and July 8th, 2022**.\n\n[Read more about the call for proposals and propose your own](https://communityblog.fedoraproject.org/nest-2022-cfp/)!",
  "We want you to be part of Nest 2022": "We want you to be part of Nest 2022",
  "Worldwide & Local Fedora Meetups": "Worldwide & Local Fedora Meetups"
}